{"text_format":"1","workbook":"xlsx","n_sheets":7,"sheets":["Formato2020 ","INVERSION","FUNCIONAMIENTO","Ctos suscrito x Trimestre","Instructivo","Tipo","Eje_Pilar_Prop"],"not_rendered":{"charts":0,"images":1,"macros":1,"external_links":6,"defined_names":65,"comments":1,"pivot_tables":9},"unopened":[],"bounds":{"document_bytes":16777216,"sheet_cells":100000,"rows_first":2000,"rows_last":500,"rows_between":2000,"halvings":0,"cell_chars":16384,"cell_head_chars":4096},"cells_cut":0,"cells_raw":0,"read":"whole","date_system":"1900"}

{"sheet":"Formato2020 ","index":0,"n_rows":501,"n_cols":47,"rows_kept":501,"cut":false,"hidden":false,"merged":[[5,0,5,3],[5,8,5,10],[5,29,5,30],[6,0,6,3],[6,8,6,10],[6,29,6,30],[1,0,1,37],[2,0,2,37],[4,0,4,3],[4,8,4,10],[4,14,4,15],[4,22,4,37],[8,10,9,15],[8,29,8,30],[9,0,9,3],[9,5,9,7],[11,14,11,15],[10,0,10,15],[10,16,10,22],[10,23,10,28],[11,2,11,3],[11,8,11,12],[8,0,8,3],[8,5,8,7],[7,29,7,30],[11,33,11,36],[10,29,10,32],[5,31,5,37],[6,31,6,37],[7,31,7,37],[8,31,8,37],[9,31,9,37],[9,29,9,30],[10,33,10,36]]}
[]
["VEEDURIA DISTRITAL - RENDICION DE CUENTAS DE LA GESTION CONTRACTUAL EN EL DISTRITO CAPITAL (Acuerdo 380 de 2009)"]
["INFORMACION GENERAL DE CONTRATACION ENTIDADES DISTRITALES  -  ENERO 1 A 31 DICIEMBRE DE 2020"]
[]
["1. Entidad",null,null,null,"FONDO DE DESARROLLO LOCAL LA CANDELARIA",null,null,"2. Sector","Gobierno"]
["3. Presupuesto Disponible Inversión Directa PREDIS",null,null,null,{"$f":"11749185174-E7","v":1572098883},null,null,"5. Presupuesto Disponible Funcionamiento PREDIS",{"$f":"2525795523-I7","v":180815230},null,null,null,null,null,null,null,null,null,null,null,null,null,null,null,null,null,null,null,null,"9. Nombre de quien diligencia el formato",null,"Paula Villota"]
["4. Presupuesto Comprometido de Inversión Directa según PREDIS ",null,null,null,10177086291,null,null,"6. Presupuesto Comprometido Funcionamiento según PREDIS",2344980293,null,null,null,null,null,null,null,null,null,null,null,null,null,null,null,null,null,null,null,null,"Cargo"]
[null,null,null,null,null,null,null,null,null,null,null,null,null,null,null,null,null,null,null,null,null,null,null,null,null,null,null,null,null,"Dependencia",null,"Contratación"]
["7. Presupuesto Disponible Operación (Régimen Privado)",null,null,null,null,null,null,null,null,null,null,null,null,null,null,null,null,null,null,null,null,{"$f":"+SUBTOTAL(9,V14:V501)","v":12522066584},{"$f":"+SUBTOTAL(9,W14:W501)","v":7229871864},null,null,null,null,null,null,"Teléfono"]
["8. Presupuesto Comprometido Operación mediante contratos",null,null,null,null,null,null,null,null,null,null,null,null,null,null,null,null,null,null,null,null,null,null,null,null,null,null,null,null,"Correo Electrónico"]
["1- INFORMACION GENERAL",null,null,null,null,null,null,null,null,null,null,null,null,null,null,null,"2- INFORMACION FINANCIERA",null,null,null,null,null,null,"3 - PLAZOS ",null,null,null,null,null,"4. CESION",null,null,null,null,null,null,null,"5. %  Avance y/o cumplimiento"]
[1,2,3,null,4,5,6,7,8,null,null,null,null,9,10,null,11,12,13,14,15,16,17,18,19,20,21,22,23,24,25,26,27,null,null,null,null,29]
["Número Contrato","Año","Proceso Publicado en","Número de proceso contractual \nSECOP","Tipo de contrato ","Modalidad de Selección","Procedimiento o causal","Objeto","Afectación","Plan de Desarrollo Distrital","Número Programa","Equivalencia número de programa","Eje / Pilar / Propósito","Número Proyecto","Número  de Identificación del contratista\n(NIT con digito de verificación)","Nombre del contratista","Valor Inicial del contrato","Número de reducciones","Valor total reducciones \n(En valor negativo)","Número de adiciones","Valor total de adiciones ","Valor Final ","Giros (valor en pesos)","Fecha de suscripción (DD/MM/AAAA)","Fecha de inicio (DD/MM/AAAA)","Fecha de terminación (DD/MM/AAAA)","Plazo en días","Número de prórrogas","Prorroga en días","Número  de Identificación del cesionario\n(NIT con digito de verificación)","Nombre cesionario","Fecha cesión\n(DD/MM/AAAA)","Valor cesión","Celebrado o por iniciar","En Ejecución","Terminado","Liquidado","% Avance y/o Cumplimiento","Total Contratos","Validación Tipo","Validación Modalidad","Validación procedimiento","Validación afectación","Validación programa","secop","Fecha suscripción","PDD"]
[1,2020,"SECOP I","ORDEN DE COMPRA 44279","Suministro","Selección abreviada","Acuerdo marco de precios ","CONTRATAR A MONTO AGOTABLE EL SUMINISTRO DE SERVICIO DE COMBUSTIBLE GASOLINA Y DIÉSEL PARA LOS VEHÍCULOS DE PROPIEDAD DEL FONDO DE DESARROLLO LOCAL DE LA CANDELARIA","Funcionamiento","Bogotá Mejor para Todos","No aplica","No Aplica","No Aplica","No Aplica","900459737-5","GRUPO EDS AUTOGAS S.A.S",20000000,null,null,1,3000000,{"$f":"+Q14+S14+U14","v":23000000},18967996,"2020-01-10","2020-01-13","2021-01-12",360,null,null,null,null,null,null,null,null,"X",null,{"$f":"IF(ISERROR(W14/V14),\"-\",(W14/V14))","v":0.82469547826086953},{"$f":"IF(SUMPRODUCT((A$14:A14=A14)*(B$14:B14=B14)*(D$14:D14=D14))>1,0,1)","v":1},{"$f":"IF(ISBLANK(E14),1,IFERROR(VLOOKUP(E14,tipo,1,FALSE),\"NO\"))","v":"Suministro"},{"$f":"IF(ISBLANK(F14),1,IFERROR(VLOOKUP(F14,modal,1,FALSE),\"NO\"))","v":"Selección abreviada"},{"$f":"IF(ISBLANK(G14),1,IFERROR(VLOOKUP(G14,Tipo!$C$12:$C$27,1,FALSE),\"NO\"))","v":"Acuerdo marco de precios "},{"$f":"IF(ISBLANK(I14),1,IFERROR(VLOOKUP(I14,afectacion,1,FALSE),\"NO\"))","v":"Funcionamiento"},{"$f":"IF(ISBLANK(K14),1,IFERROR(VLOOKUP(K14,Eje_Pilar_Prop!C3:C104,1,FALSE),\"NO\"))","v":"NO"},{"$f":"IF(ISBLANK(C14),1,IFERROR(VLOOKUP(C14,SECOP,1,FALSE),\"NO\"))","v":"SECOP I"},{"$f":"IF(OR(YEAR(X14)=2020,ISBLANK(X14)),1,\"NO\")","v":1},{"$f":"IF(ISBLANK(J14),1,IFERROR(VLOOKUP(J14,pdd,1,FALSE),\"NO\"))","v":"Bogotá Mejor para Todos"}]
[2,2020,"SECOP II","FDLC-IMC-001-2020","Interventoría","Contratación mínima cuantia","No aplica","INTERVENTORÍA TÉCNICA, ADMINISTRATIVA Y FINANCIERA DE LA CONTINUACIÓN DEL CONTRATO DE OBRA 101 DE 2018, QUE TIENE POR OBJETO: “REALIZAR A PRECIO GLOBAL FIJO LA ACTUALIZACIÓN, AJUSTES Y/O COMPLEMENTACIÓN DE LOS ESTUDIOS Y DISEÑOS Y A MONTO AGOTABLE LA CONSTRUCCIÓN DEL TRAMO FALTANTE DEL PROYECTO RAPS NIEVES UBICADO EN LA CARRERA 4 ENTRE CALLES 13 Y 10 EN LA LOCALIDAD DE LA CANDELARIA, EN BOGOTÁ D.C.","Inversión","Bogotá Mejor para Todos",18,{"$f":"IF(ISERROR(VLOOKUP(K15,Eje_Pilar_Prop!$C$2:$E$104,2,FALSE)),\" \",VLOOKUP(K15,Eje_Pilar_Prop!$C$2:$E$104,2,FALSE))","v":"Mejor movilidad para todos"},{"$f":"IF(ISERROR(VLOOKUP(K15,Eje_Pilar_Prop!$C$2:$E$104,3,FALSE)),\" \",VLOOKUP(K15,Eje_Pilar_Prop!$C$2:$E$104,3,FALSE))","v":"Pilar 2 Democracía Urbana"},1391,900866325,"JMELO INGENIERIA DE PROYECTOS S.A.S",24184587,null,null,0,null,{"$f":"+Q15+S15+U15","v":24184587},12092293,"2020-01-30","2020-02-05","2020-07-21",60,null,null,null,null,null,null,null,null,"X",null,{"$f":"IF(ISERROR(W15/V15),\"-\",(W15/V15))","v":0.49999997932567547},{"$f":"IF(SUMPRODUCT((A$14:A15=A15)*(B$14:B15=B15)*(D$14:D15=D15))>1,0,1)","v":1},"Interventoría","Contratación mínima cuantia",{"$f":"IF(ISBLANK(G15),1,IFERROR(VLOOKUP(G15,Tipo!$C$12:$C$27,1,FALSE),\"NO\"))","v":"NO"},"Inversión",{"$f":"IF(ISBLANK(K15),1,IFERROR(VLOOKUP(K15,Eje_Pilar_Prop!C4:C105,1,FALSE),\"NO\"))","v":18},"SECOP II",1,"Bogotá Mejor para Todos"]
[3,2020,"SECOP II","FDLC-CPS-003-2020","Contratos de prestación de servicios profesionales y de apoyo a la gestión","Contratación directa","Prestación de servicios profesionales y de apoyo a la gestión, o para la ejecución de trabajos artísticos que sólo puedan encomendarse a determinadas personas naturales;","PRESTACIÓN DE SERVICIOS DE APOYO ASISTENCIAL A LA GESTIÓN DEL DESPACHO Y LAS DIFERENTES ÁREAS DEL FONDO DE DESARROLLO LOCAL DE LA CANDELARIA","Inversión","Bogotá Mejor para Todos",45,{"$f":"IF(ISERROR(VLOOKUP(K16,Eje_Pilar_Prop!$C$2:$E$104,2,FALSE)),\" \",VLOOKUP(K16,Eje_Pilar_Prop!$C$2:$E$104,2,FALSE))","v":"Gobernanza e influencia local, regional e internacional"},{"$f":"IF(ISERROR(VLOOKUP(K16,Eje_Pilar_Prop!$C$2:$E$104,3,FALSE)),\" \",VLOOKUP(K16,Eje_Pilar_Prop!$C$2:$E$104,3,FALSE))","v":"Eje Transversal 4 Gobierno Legitimo, Fortalecimiento Local y Eficiencia"},1395,"52305372-4","ELCY JANETH PULIDO AMORTEGUI",4342198,null,null,1,2130134,{"$f":"+Q16+S16+U16","v":6472332},6390404,"2020-02-07","2020-02-07","2020-04-24",53,1,26,null,null,null,null,null,null,null,"X",0.9873418112667891,{"$f":"IF(SUMPRODUCT((A$14:A16=A16)*(B$14:B16=B16)*(D$14:D16=D16))>1,0,1)","v":1},"Contratos de prestación de servicios profesionales y de apoyo a la gestión","Contratación directa",{"$f":"IF(ISBLANK(G16),1,IFERROR(VLOOKUP(G16,Tipo!$C$12:$C$27,1,FALSE),\"NO\"))","v":"Prestación de servicios profesionales y de apoyo a la gestión, o para la ejecución de trabajos artísticos que sólo puedan encomendarse a determinadas personas naturales;"},"Inversión",{"$f":"IF(ISBLANK(K16),1,IFERROR(VLOOKUP(K16,Eje_Pilar_Prop!C5:C106,1,FALSE),\"NO\"))","v":45},"SECOP II",1,"Bogotá Mejor para Todos"]
[4,2020,"SECOP II","FDLC-CPS-004-2020","Contratos de prestación de servicios profesionales y de apoyo a la gestión","Contratación directa","Prestación de servicios profesionales y de apoyo a la gestión, o para la ejecución de trabajos artísticos que sólo puedan encomendarse a determinadas personas naturales;","PRESTACIÓN DE SERVICIOS DE APOYO Y ASISTENCIA ADMINISTRATIVA A LA GESTION DE LA JUNTA ADMINISTRADORA LOCAL DE LA CANDELARIA","Inversión","Bogotá Mejor para Todos",45,{"$f":"IF(ISERROR(VLOOKUP(K17,Eje_Pilar_Prop!$C$2:$E$104,2,FALSE)),\" \",VLOOKUP(K17,Eje_Pilar_Prop!$C$2:$E$104,2,FALSE))","v":"Gobernanza e influencia local, regional e internacional"},{"$f":"IF(ISERROR(VLOOKUP(K17,Eje_Pilar_Prop!$C$2:$E$104,3,FALSE)),\" \",VLOOKUP(K17,Eje_Pilar_Prop!$C$2:$E$104,3,FALSE))","v":"Eje Transversal 4 Gobierno Legitimo, Fortalecimiento Local y Eficiencia"},1395,51879946,"ISABEL CRISTINA BULLA RODRIGUEZ",9831392,null,null,0,null,{"$f":"+Q17+S17+U17","v":9831392},9620977,"2020-02-11","2020-02-11","2020-06-10",120,null,null,null,null,null,null,null,null,null,"X",0.97859763907288,{"$f":"IF(SUMPRODUCT((A$14:A17=A17)*(B$14:B17=B17)*(D$14:D17=D17))>1,0,1)","v":1},"Contratos de prestación de servicios profesionales y de apoyo a la gestión","Contratación directa",{"$f":"IF(ISBLANK(G17),1,IFERROR(VLOOKUP(G17,Tipo!$C$12:$C$27,1,FALSE),\"NO\"))","v":"Prestación de servicios profesionales y de apoyo a la gestión, o para la ejecución de trabajos artísticos que sólo puedan encomendarse a determinadas personas naturales;"},"Inversión",{"$f":"IF(ISBLANK(K17),1,IFERROR(VLOOKUP(K17,Eje_Pilar_Prop!C6:C107,1,FALSE),\"NO\"))","v":45},"SECOP II",1,"Bogotá Mejor para Todos"]
[5,2020,"SECOP II","FDLC-CPS-005-2020","Contratos de prestación de servicios profesionales y de apoyo a la gestión","Contratación directa","Prestación de servicios profesionales y de apoyo a la gestión, o para la ejecución de trabajos artísticos que sólo puedan encomendarse a determinadas personas naturales;"," PRESTACIÓN DE SERVICIOS PROFESIONALES COMO ADMINISTRADOR DE RED LOCAL, ENLACE CON LA SECRETARÍA DISTRITAL DE GOBIERNO, BRINDANDO SOPORTE EN MATERIA DE SISTEMAS (SOFTWARE Y HARDWARE) A LOS USUARIOS INTERNOS Y EXTERNOS DE LAS DIFERENTES ÁREAS DE LA ALCALDÍA LOCAL DE LA CANDELARIA","Inversión","Bogotá Mejor para Todos",45,{"$f":"IF(ISERROR(VLOOKUP(K18,Eje_Pilar_Prop!$C$2:$E$104,2,FALSE)),\" \",VLOOKUP(K18,Eje_Pilar_Prop!$C$2:$E$104,2,FALSE))","v":"Gobernanza e influencia local, regional e internacional"},{"$f":"IF(ISERROR(VLOOKUP(K18,Eje_Pilar_Prop!$C$2:$E$104,3,FALSE)),\" \",VLOOKUP(K18,Eje_Pilar_Prop!$C$2:$E$104,3,FALSE))","v":"Eje Transversal 4 Gobierno Legitimo, Fortalecimiento Local y Eficiencia"},1395,79814029,"AGUSTIN LARA BELTRAN",21067272,null,null,0,null,21067272,21067272,"2020-02-10","2020-02-10","2020-06-09",120,null,null,null,null,null,null,null,null,null,"X",1,{"$f":"IF(SUMPRODUCT((A$14:A18=A18)*(B$14:B18=B18)*(D$14:D18=D18))>1,0,1)","v":1},"Contratos de prestación de servicios profesionales y de apoyo a la gestión","Contratación directa",{"$f":"IF(ISBLANK(G18),1,IFERROR(VLOOKUP(G18,Tipo!$C$12:$C$27,1,FALSE),\"NO\"))","v":"Prestación de servicios profesionales y de apoyo a la gestión, o para la ejecución de trabajos artísticos que sólo puedan encomendarse a determinadas personas naturales;"},"Inversión",{"$f":"IF(ISBLANK(K18),1,IFERROR(VLOOKUP(K18,Eje_Pilar_Prop!C7:C108,1,FALSE),\"NO\"))","v":45},"SECOP II",1,"Bogotá Mejor para Todos"]
[6,2020,"SECOP II","FDLC-CPS-006-2020","Contratos de prestación de servicios profesionales y de apoyo a la gestión","Contratación directa","Prestación de servicios profesionales y de apoyo a la gestión, o para la ejecución de trabajos artísticos que sólo puedan encomendarse a determinadas personas naturales;"," PRESTACIÓN DE SERVICIOS DE APOYO PROFESIONAL EN LA GESTIÓN DEL ÁREA DE PLANEACIÓN PARA LA PRESENTACIÓN Y SEGUIMIENTO DE LOS PROYECTOS ENCAMINADOS A LA GESTIÓN DE RIESGOS Y CAMBIO CLIMÁTICO, ASI COMO BRINDAR APOYO A DICHO COMITÉ","Inversión","Bogotá Mejor para Todos",45,{"$f":"IF(ISERROR(VLOOKUP(K19,Eje_Pilar_Prop!$C$2:$E$104,2,FALSE)),\" \",VLOOKUP(K19,Eje_Pilar_Prop!$C$2:$E$104,2,FALSE))","v":"Gobernanza e influencia local, regional e internacional"},{"$f":"IF(ISERROR(VLOOKUP(K19,Eje_Pilar_Prop!$C$2:$E$104,3,FALSE)),\" \",VLOOKUP(K19,Eje_Pilar_Prop!$C$2:$E$104,3,FALSE))","v":"Eje Transversal 4 Gobierno Legitimo, Fortalecimiento Local y Eficiencia"},1395,52790286,"JESYCA ROSY ORJUELA AYA",21067272,null,null,0,null,21067272,21067272,"2020-02-11","2020-02-11","2020-06-10",120,null,null,null,null,null,null,null,null,null,"X",1,{"$f":"IF(SUMPRODUCT((A$14:A19=A19)*(B$14:B19=B19)*(D$14:D19=D19))>1,0,1)","v":1},"Contratos de prestación de servicios profesionales y de apoyo a la gestión","Contratación directa",{"$f":"IF(ISBLANK(G19),1,IFERROR(VLOOKUP(G19,Tipo!$C$12:$C$27,1,FALSE),\"NO\"))","v":"Prestación de servicios profesionales y de apoyo a la gestión, o para la ejecución de trabajos artísticos que sólo puedan encomendarse a determinadas personas naturales;"},"Inversión",{"$f":"IF(ISBLANK(K19),1,IFERROR(VLOOKUP(K19,Eje_Pilar_Prop!C8:C109,1,FALSE),\"NO\"))","v":45},"SECOP II",1,"Bogotá Mejor para Todos"]
[7,2020,"SECOP II","FDLC-CPS-007-2020","Contratos de prestación de servicios profesionales y de apoyo a la gestión","Contratación directa","Prestación de servicios profesionales y de apoyo a la gestión, o para la ejecución de trabajos artísticos que sólo puedan encomendarse a determinadas personas naturales;","PRESTACIÓN DE SERVICIOS PROFESIONALES PARA APOYAR JURÍDICAMENTE LA EJECUCIÓN DE LAS ACCIONES REQUERIDAS PARA LA DEPURACIÓN DE LAS ACTUACIONES ADMINISTRATIVAS QUE CURSAN EN LA ALCALDIA LOCAL","Inversión","Bogotá Mejor para Todos",45,{"$f":"IF(ISERROR(VLOOKUP(K20,Eje_Pilar_Prop!$C$2:$E$104,2,FALSE)),\" \",VLOOKUP(K20,Eje_Pilar_Prop!$C$2:$E$104,2,FALSE))","v":"Gobernanza e influencia local, regional e internacional"},{"$f":"IF(ISERROR(VLOOKUP(K20,Eje_Pilar_Prop!$C$2:$E$104,3,FALSE)),\" \",VLOOKUP(K20,Eje_Pilar_Prop!$C$2:$E$104,3,FALSE))","v":"Eje Transversal 4 Gobierno Legitimo, Fortalecimiento Local y Eficiencia"},1395,1022973767,"CAROLINA ROJAS CARVAJAL",17907180,null,null,0,null,17907180,17757953,"2020-02-11","2020-02-11","2020-06-10",120,null,null,null,null,null,null,null,null,null,"X",0.99166663874490568,{"$f":"IF(SUMPRODUCT((A$14:A20=A20)*(B$14:B20=B20)*(D$14:D20=D20))>1,0,1)","v":1},"Contratos de prestación de servicios profesionales y de apoyo a la gestión","Contratación directa",{"$f":"IF(ISBLANK(G20),1,IFERROR(VLOOKUP(G20,Tipo!$C$12:$C$27,1,FALSE),\"NO\"))","v":"Prestación de servicios profesionales y de apoyo a la gestión, o para la ejecución de trabajos artísticos que sólo puedan encomendarse a determinadas personas naturales;"},"Inversión",{"$f":"IF(ISBLANK(K20),1,IFERROR(VLOOKUP(K20,Eje_Pilar_Prop!C9:C110,1,FALSE),\"NO\"))","v":45},"SECOP II",1,"Bogotá Mejor para Todos"]
[8,2020,"SECOP II","FDLC-CPS-008-2020","Contratos de prestación de servicios profesionales y de apoyo a la gestión","Contratación directa","Prestación de servicios profesionales y de apoyo a la gestión, o para la ejecución de trabajos artísticos que sólo puedan encomendarse a determinadas personas naturales;","PRESTAR SERVICIOS DE APOYO COMO CONDUCTOR DE LOS VEHICULOS QUE SE ENCUENTRAN A CARGO DEL FONDO DE DESARROLLO LOCAL LA CANDELARIA","Inversión","Bogotá Mejor para Todos",45,{"$f":"IF(ISERROR(VLOOKUP(K21,Eje_Pilar_Prop!$C$2:$E$104,2,FALSE)),\" \",VLOOKUP(K21,Eje_Pilar_Prop!$C$2:$E$104,2,FALSE))","v":"Gobernanza e influencia local, regional e internacional"},{"$f":"IF(ISERROR(VLOOKUP(K21,Eje_Pilar_Prop!$C$2:$E$104,3,FALSE)),\" \",VLOOKUP(K21,Eje_Pilar_Prop!$C$2:$E$104,3,FALSE))","v":"Eje Transversal 4 Gobierno Legitimo, Fortalecimiento Local y Eficiencia"},1395,1010187694,"CHRISTIAM CAMILO ROMERO WALTEROS",9831392,null,null,0,null,9831392,9831392,"2020-02-12","2020-02-13","2020-06-12",120,null,null,null,null,null,null,null,null,null,"X",1,{"$f":"IF(SUMPRODUCT((A$14:A21=A21)*(B$14:B21=B21)*(D$14:D21=D21))>1,0,1)","v":1},"Contratos de prestación de servicios profesionales y de apoyo a la gestión","Contratación directa",{"$f":"IF(ISBLANK(G21),1,IFERROR(VLOOKUP(G21,Tipo!$C$12:$C$27,1,FALSE),\"NO\"))","v":"Prestación de servicios profesionales y de apoyo a la gestión, o para la ejecución de trabajos artísticos que sólo puedan encomendarse a determinadas personas naturales;"},"Inversión",{"$f":"IF(ISBLANK(K21),1,IFERROR(VLOOKUP(K21,Eje_Pilar_Prop!C10:C111,1,FALSE),\"NO\"))","v":45},"SECOP II",1,"Bogotá Mejor para Todos"]
[9,2020,"SECOP II","FDLC-CPS-009-2020","Contratos de prestación de servicios profesionales y de apoyo a la gestión","Contratación directa","Prestación de servicios profesionales y de apoyo a la gestión, o para la ejecución de trabajos artísticos que sólo puedan encomendarse a determinadas personas naturales;","PRESTAR SERVICIOS DE APOYO COMO CONDUCTOR DE LOS VEHICULOS QUE SE ENCUENTRAN A CARGO DEL FONDO DE DESARROLLO LOCAL LA CANDELARIA","Inversión","Bogotá Mejor para Todos",45,{"$f":"IF(ISERROR(VLOOKUP(K22,Eje_Pilar_Prop!$C$2:$E$104,2,FALSE)),\" \",VLOOKUP(K22,Eje_Pilar_Prop!$C$2:$E$104,2,FALSE))","v":"Gobernanza e influencia local, regional e internacional"},{"$f":"IF(ISERROR(VLOOKUP(K22,Eje_Pilar_Prop!$C$2:$E$104,3,FALSE)),\" \",VLOOKUP(K22,Eje_Pilar_Prop!$C$2:$E$104,3,FALSE))","v":"Eje Transversal 4 Gobierno Legitimo, Fortalecimiento Local y Eficiencia"},1395,79714948,"OSCAR ANTONIO ZAMBRANO GUTIERREZ",9831392,null,null,0,null,9831392,9831392,"2020-02-12","2020-02-13","2020-06-12",120,null,null,null,null,null,null,null,null,null,"X",{"$f":"IF(ISERROR(W22/V22),\"-\",(W22/V22))","v":1},{"$f":"IF(SUMPRODUCT((A$14:A22=A22)*(B$14:B22=B22)*(D$14:D22=D22))>1,0,1)","v":1},"Contratos de prestación de servicios profesionales y de apoyo a la gestión","Contratación directa",{"$f":"IF(ISBLANK(G22),1,IFERROR(VLOOKUP(G22,Tipo!$C$12:$C$27,1,FALSE),\"NO\"))","v":"Prestación de servicios profesionales y de apoyo a la gestión, o para la ejecución de trabajos artísticos que sólo puedan encomendarse a determinadas personas naturales;"},"Inversión",{"$f":"IF(ISBLANK(K22),1,IFERROR(VLOOKUP(K22,Eje_Pilar_Prop!C4:C105,1,FALSE),\"NO\"))","v":45},"SECOP II",1,"Bogotá Mejor para Todos"]
[10,2020,"SECOP II","FDLC-CPS-010-2020","Contratos de prestación de servicios profesionales y de apoyo a la gestión","Contratación directa","Prestación de servicios profesionales y de apoyo a la gestión, o para la ejecución de trabajos artísticos que sólo puedan encomendarse a determinadas personas naturales;"," PRESTACIÓN DE SERVICIOS DE APOYO TÉCNICO EN LA ADMINISTRACIÓN DE LAS CASAS COMUNITARIAS DE LA LOCALIDAD DE LA CANDELARIA DE CONFORMIDAD CON EL ACUERDO LOCAL 006 DE 2013","Inversión","Bogotá Mejor para Todos",45,{"$f":"IF(ISERROR(VLOOKUP(K23,Eje_Pilar_Prop!$C$2:$E$104,2,FALSE)),\" \",VLOOKUP(K23,Eje_Pilar_Prop!$C$2:$E$104,2,FALSE))","v":"Gobernanza e influencia local, regional e internacional"},{"$f":"IF(ISERROR(VLOOKUP(K23,Eje_Pilar_Prop!$C$2:$E$104,3,FALSE)),\" \",VLOOKUP(K23,Eje_Pilar_Prop!$C$2:$E$104,3,FALSE))","v":"Eje Transversal 4 Gobierno Legitimo, Fortalecimiento Local y Eficiencia"},1395,41621560,"NELLY PARRA TOCORA",11587000,null,null,0,null,11587000,11587000,"2020-02-12","2020-02-12","2020-06-11",120,null,null,null,null,null,null,null,null,null,"X",{"$f":"IF(ISERROR(W23/V23),\"-\",(W23/V23))","v":1},{"$f":"IF(SUMPRODUCT((A$14:A23=A23)*(B$14:B23=B23)*(D$14:D23=D23))>1,0,1)","v":1},"Contratos de prestación de servicios profesionales y de apoyo a la gestión","Contratación directa",{"$f":"IF(ISBLANK(G23),1,IFERROR(VLOOKUP(G23,Tipo!$C$12:$C$27,1,FALSE),\"NO\"))","v":"Prestación de servicios profesionales y de apoyo a la gestión, o para la ejecución de trabajos artísticos que sólo puedan encomendarse a determinadas personas naturales;"},"Inversión",{"$f":"IF(ISBLANK(K23),1,IFERROR(VLOOKUP(K23,Eje_Pilar_Prop!C5:C106,1,FALSE),\"NO\"))","v":45},"SECOP II",1,"Bogotá Mejor para Todos"]
[11,2020,"SECOP II","FDLC-CPS-011-2020","Contratos de prestación de servicios profesionales y de apoyo a la gestión","Contratación directa","Prestación de servicios profesionales y de apoyo a la gestión, o para la ejecución de trabajos artísticos que sólo puedan encomendarse a determinadas personas naturales;","PRESTAR SERVICIO ASISTENCIAL DE APOYO EN EL ÁREA DE GESTIÓN DE DESARROLLO LOCAL—CDI, PARA LA NOTIFICACIÓN DE CORRESPONDENCIA EN GENERAL","Inversión","Bogotá Mejor para Todos",45,{"$f":"IF(ISERROR(VLOOKUP(K24,Eje_Pilar_Prop!$C$2:$E$104,2,FALSE)),\" \",VLOOKUP(K24,Eje_Pilar_Prop!$C$2:$E$104,2,FALSE))","v":"Gobernanza e influencia local, regional e internacional"},{"$f":"IF(ISERROR(VLOOKUP(K24,Eje_Pilar_Prop!$C$2:$E$104,3,FALSE)),\" \",VLOOKUP(K24,Eje_Pilar_Prop!$C$2:$E$104,3,FALSE))","v":"Eje Transversal 4 Gobierno Legitimo, Fortalecimiento Local y Eficiencia"},1395,1121855155,"HERNAN EDUARDO RODRIGUEZ BEDOYA",9831392,null,null,0,null,9831392,9831392,"2020-02-14","2020-02-17","2020-06-16",120,null,null,null,null,null,null,null,null,null,"X",{"$f":"IF(ISERROR(W24/V24),\"-\",(W24/V24))","v":1},{"$f":"IF(SUMPRODUCT((A$14:A24=A24)*(B$14:B24=B24)*(D$14:D24=D24))>1,0,1)","v":1},"Contratos de prestación de servicios profesionales y de apoyo a la gestión","Contratación directa",{"$f":"IF(ISBLANK(G24),1,IFERROR(VLOOKUP(G24,Tipo!$C$12:$C$27,1,FALSE),\"NO\"))","v":"Prestación de servicios profesionales y de apoyo a la gestión, o para la ejecución de trabajos artísticos que sólo puedan encomendarse a determinadas personas naturales;"},"Inversión",{"$f":"IF(ISBLANK(K24),1,IFERROR(VLOOKUP(K24,Eje_Pilar_Prop!C6:C107,1,FALSE),\"NO\"))","v":45},"SECOP II",1,"Bogotá Mejor para Todos"]
[13,2020,"SECOP II","FDLC-IMC-002-2020","Seguros","Contratación mínima cuantia","No aplica","CONTRATAR LOS SEGUROS QUE AMPAREN LOS INTERESES PATRIMONIALES ACTUALES Y FUTUROS, ASÍ COMO LOS BIENES DE PROPIEDAD DE EL FONDO DE DESARROLLO LOCAL DE LA CANDELARIA, QUE ESTÉN BAJO SU RESPONSABILIDAD Y CUSTODIA Y AQUELLOS QUE SEAN ADQUIRIDOS PARA DESARROLLAR LAS FUNCIONES INHERENTES A SU ACTIVIDAD Y CUALQUIER OTRA PÓLIZA DE SEGUROS QUE REQUIERA LA ENTIDAD EN EL DESARROLLO DE SU ACTIVIDAD","Funcionamiento","Bogotá Mejor para Todos","No aplica","No Aplica","No Aplica","No Aplica",8600024002,"LA PREVISORA S.A. COMPAÑÍA DE SEGUROS",23511213,null,null,1,2036651,{"$f":"+Q25+S25+U25","v":25547864},25426670,"2020-02-13","2020-02-16","2020-06-17",111,1,10,null,null,null,null,null,null,"X",null,{"$f":"IF(ISERROR(W25/V25),\"-\",(W25/V25))","v":0.99525619832640411},{"$f":"IF(SUMPRODUCT((A$14:A25=A25)*(B$14:B25=B25)*(D$14:D25=D25))>1,0,1)","v":1},"Seguros","Contratación mínima cuantia",{"$f":"IF(ISBLANK(G25),1,IFERROR(VLOOKUP(G25,Tipo!$C$12:$C$27,1,FALSE),\"NO\"))","v":"NO"},"Funcionamiento",{"$f":"IF(ISBLANK(K25),1,IFERROR(VLOOKUP(K25,Eje_Pilar_Prop!C8:C109,1,FALSE),\"NO\"))","v":"NO"},"SECOP II",1,"Bogotá Mejor para Todos"]
[14,2020,"SECOP II","FDLC-CPS-014-2020","Contratos de prestación de servicios profesionales y de apoyo a la gestión","Contratación directa","Prestación de servicios profesionales y de apoyo a la gestión, o para la ejecución de trabajos artísticos que sólo puedan encomendarse a determinadas personas naturales;","PRESTAR SERVICIOS PROFESIONALES ESPECIALIZADOS PARA BRINDAR LINEAMIENTOS JURIDICOS, EVALUAR Y ORIENTAR TEMAS PRIORITARIOS DEL DESPACHO DE LA LACALDIA LOCAL DE LA CANDELARIA.","Inversión","Bogotá Mejor para Todos",45,{"$f":"IF(ISERROR(VLOOKUP(K26,Eje_Pilar_Prop!$C$2:$E$104,2,FALSE)),\" \",VLOOKUP(K26,Eje_Pilar_Prop!$C$2:$E$104,2,FALSE))","v":"Gobernanza e influencia local, regional e internacional"},{"$f":"IF(ISERROR(VLOOKUP(K26,Eje_Pilar_Prop!$C$2:$E$104,3,FALSE)),\" \",VLOOKUP(K26,Eje_Pilar_Prop!$C$2:$E$104,3,FALSE))","v":"Eje Transversal 4 Gobierno Legitimo, Fortalecimiento Local y Eficiencia"},1395,50917355,"FLORALBA ALEJANDRINA PADRON PARDO",38000000,null,null,null,null,38000000,37999998,"2020-02-18","2020-02-20","2020-06-19",120,null,null,16934608,"WILLIAM MEJIA","2020-05-15",11716666,null,null,null,"X",0.99999994736842102]
[15,2020,"SECOP II","FDLC-CPS-015-2020","Contratos de prestación de servicios profesionales y de apoyo a la gestión","Contratación directa","Prestación de servicios profesionales y de apoyo a la gestión, o para la ejecución de trabajos artísticos que sólo puedan encomendarse a determinadas personas naturales;","PRESTACIÓN DE SERVICIOS TECNICOS DE APOYO A LA OFICINA DEL ALMACEN DEL FONDO DE DESARROLLO LOCAL LA CANDELARIA","Inversión","Bogotá Mejor para Todos",45,{"$f":"IF(ISERROR(VLOOKUP(K27,Eje_Pilar_Prop!$C$2:$E$104,2,FALSE)),\" \",VLOOKUP(K27,Eje_Pilar_Prop!$C$2:$E$104,2,FALSE))","v":"Gobernanza e influencia local, regional e internacional"},{"$f":"IF(ISERROR(VLOOKUP(K27,Eje_Pilar_Prop!$C$2:$E$104,3,FALSE)),\" \",VLOOKUP(K27,Eje_Pilar_Prop!$C$2:$E$104,3,FALSE))","v":"Eje Transversal 4 Gobierno Legitimo, Fortalecimiento Local y Eficiencia"},1395,79277986,"JOSE EDYS ROJAS ROJAS",12991484,null,null,0,0,12991484,12985484,"2020-02-19","2020-02-19","2020-06-18",120,null,null,null,null,null,null,null,null,null,"X",0.99953815899707843,{"$f":"IF(SUMPRODUCT((A$14:A27=A27)*(B$14:B27=B27)*(D$14:D27=D27))>1,0,1)","v":1},null,"Contratación directa",{"$f":"IF(ISBLANK(G27),1,IFERROR(VLOOKUP(G27,Tipo!$C$12:$C$27,1,FALSE),\"NO\"))","v":"Prestación de servicios profesionales y de apoyo a la gestión, o para la ejecución de trabajos artísticos que sólo puedan encomendarse a determinadas personas naturales;"},"Inversión",{"$f":"IF(ISBLANK(K27),1,IFERROR(VLOOKUP(K27,Eje_Pilar_Prop!C9:C110,1,FALSE),\"NO\"))","v":45},"SECOP II",{"$f":"IF(OR(YEAR(X27)=2020,ISBLANK(X27)),1,\"NO\")","v":1},"Bogotá Mejor para Todos"]
[16,2020,"SECOP II","FDLC-CPS-016-2020","Contratos de prestación de servicios profesionales y de apoyo a la gestión","Contratación directa","Prestación de servicios profesionales y de apoyo a la gestión, o para la ejecución de trabajos artísticos que sólo puedan encomendarse a determinadas personas naturales;","PRESTAR SERVICIOS PROFESIONALES AL ÁREA DE GESTIÓN POLICIVA DEL FONDO DE DESARROLLO LOCAL LA CANDELARIA, PARA FORTALECER Y PROMOVER ESTRATEGIAS DE IMPLEMENTACIÓN, APLICACIÓN Y CAPACITACION A LA COMUNIDAD Y DIFERENTES SECTORES, EN MATERIA DE NORMATIVIDAD REFERENTE AL CODIGO DE POLICIA Y FRENTES LOCALES DE SEGURIDAD","Inversión","Bogotá Mejor para Todos",45,{"$f":"IF(ISERROR(VLOOKUP(K28,Eje_Pilar_Prop!$C$2:$E$104,2,FALSE)),\" \",VLOOKUP(K28,Eje_Pilar_Prop!$C$2:$E$104,2,FALSE))","v":"Gobernanza e influencia local, regional e internacional"},{"$f":"IF(ISERROR(VLOOKUP(K28,Eje_Pilar_Prop!$C$2:$E$104,3,FALSE)),\" \",VLOOKUP(K28,Eje_Pilar_Prop!$C$2:$E$104,3,FALSE))","v":"Eje Transversal 4 Gobierno Legitimo, Fortalecimiento Local y Eficiencia"},1395,1077967370,"EMERSON LINARES GORDILLO",16000000,null,null,0,0,16000000,15998000,"2020-02-18","2020-02-19","2020-06-18",120,null,null,null,null,null,null,null,null,null,"X",0.99987499999999996,{"$f":"IF(SUMPRODUCT((A$14:A28=A28)*(B$14:B28=B28)*(D$14:D28=D28))>1,0,1)","v":1},"Contratos de prestación de servicios profesionales y de apoyo a la gestión","Contratación directa",{"$f":"IF(ISBLANK(G28),1,IFERROR(VLOOKUP(G28,Tipo!$C$12:$C$27,1,FALSE),\"NO\"))","v":"Prestación de servicios profesionales y de apoyo a la gestión, o para la ejecución de trabajos artísticos que sólo puedan encomendarse a determinadas personas naturales;"},"Inversión",{"$f":"IF(ISBLANK(K28),1,IFERROR(VLOOKUP(K28,Eje_Pilar_Prop!C10:C111,1,FALSE),\"NO\"))","v":45},"SECOP II",1,"Bogotá Mejor para Todos"]
[17,2020,"SECOP II","FDLC-CPS-017-2020","Contratos de prestación de servicios profesionales y de apoyo a la gestión","Contratación directa","Prestación de servicios profesionales y de apoyo a la gestión, o para la ejecución de trabajos artísticos que sólo puedan encomendarse a determinadas personas naturales;","PRESTACIÓN DE SERVICIOS ASISTENCIALES DE APOYO A LA GESTIÓN DEL FONDO DE DESARROLLO LOCAL DE LA CANDELARIA - CDI PARA EL MANEJO Y PROCESO DE DISTRIBUCION DE CORRESPONDENCIA EN GENERAL","Inversión","Bogotá Mejor para Todos",45,{"$f":"IF(ISERROR(VLOOKUP(K29,Eje_Pilar_Prop!$C$2:$E$104,2,FALSE)),\" \",VLOOKUP(K29,Eje_Pilar_Prop!$C$2:$E$104,2,FALSE))","v":"Gobernanza e influencia local, regional e internacional"},{"$f":"IF(ISERROR(VLOOKUP(K29,Eje_Pilar_Prop!$C$2:$E$104,3,FALSE)),\" \",VLOOKUP(K29,Eje_Pilar_Prop!$C$2:$E$104,3,FALSE))","v":"Eje Transversal 4 Gobierno Legitimo, Fortalecimiento Local y Eficiencia"},1395,1010227910,"CARLOS ARMANDO GONZÁLEZ RASGO",9831392,null,null,0,0,9831392,8280126,"2020-02-19","2020-02-19","2020-06-18",120,null,null,null,null,null,null,null,null,"X",null,0.84221298469229988,{"$f":"IF(SUMPRODUCT((A$14:A29=A29)*(B$14:B29=B29)*(D$14:D29=D29))>1,0,1)","v":1},"Contratos de prestación de servicios profesionales y de apoyo a la gestión","Contratación directa",{"$f":"IF(ISBLANK(G29),1,IFERROR(VLOOKUP(G29,Tipo!$C$12:$C$27,1,FALSE),\"NO\"))","v":"Prestación de servicios profesionales y de apoyo a la gestión, o para la ejecución de trabajos artísticos que sólo puedan encomendarse a determinadas personas naturales;"},"Inversión",{"$f":"IF(ISBLANK(K29),1,IFERROR(VLOOKUP(K29,Eje_Pilar_Prop!C11:C112,1,FALSE),\"NO\"))","v":45},"SECOP II",1,"Bogotá Mejor para Todos"]
[18,2020,"SECOP II","FDLC-CPS-018-2020","Contratos de prestación de servicios profesionales y de apoyo a la gestión","Contratación directa","Prestación de servicios profesionales y de apoyo a la gestión, o para la ejecución de trabajos artísticos que sólo puedan encomendarse a determinadas personas naturales;","PRESTACIÓN DE SERVICIOS PROFESIONALES PARA APOYAR AL ÁREA DE GESTIÓN DE DESARROLLO LOCAL, EN TEMAS SEGUIMIENTO DE LOS PROGRAMAS Y PROYECTOS DEL PLAN DE DESARROLLO LOCAL, ASÍ COMO DE LOS PROCESOS DE OBLIGACIONES POR PAGAR DEL FDLC","Inversión","Bogotá Mejor para Todos",45,{"$f":"IF(ISERROR(VLOOKUP(K30,Eje_Pilar_Prop!$C$2:$E$104,2,FALSE)),\" \",VLOOKUP(K30,Eje_Pilar_Prop!$C$2:$E$104,2,FALSE))","v":"Gobernanza e influencia local, regional e internacional"},{"$f":"IF(ISERROR(VLOOKUP(K30,Eje_Pilar_Prop!$C$2:$E$104,3,FALSE)),\" \",VLOOKUP(K30,Eje_Pilar_Prop!$C$2:$E$104,3,FALSE))","v":"Eje Transversal 4 Gobierno Legitimo, Fortalecimiento Local y Eficiencia"},1395,1010216582,"WILSON ENRIQUE GARCIA VALDERRAMA",15452000,null,null,0,0,15452000,15452000,"2020-02-20","2020-02-20","2020-06-19",120,null,null,null,null,null,null,null,null,null,"X",1,{"$f":"IF(SUMPRODUCT((A$14:A30=A30)*(B$14:B30=B30)*(D$14:D30=D30))>1,0,1)","v":1},"Contratos de prestación de servicios profesionales y de apoyo a la gestión","Contratación directa",{"$f":"IF(ISBLANK(G30),1,IFERROR(VLOOKUP(G30,Tipo!$C$12:$C$27,1,FALSE),\"NO\"))","v":"Prestación de servicios profesionales y de apoyo a la gestión, o para la ejecución de trabajos artísticos que sólo puedan encomendarse a determinadas personas naturales;"},"Inversión",{"$f":"IF(ISBLANK(K30),1,IFERROR(VLOOKUP(K30,Eje_Pilar_Prop!C12:C113,1,FALSE),\"NO\"))","v":45},"SECOP II",1,"Bogotá Mejor para Todos"]
[19,2020,"SECOP II","FDLC-CPS-019-2020","Contratos de prestación de servicios profesionales y de apoyo a la gestión","Contratación directa","Prestación de servicios profesionales y de apoyo a la gestión, o para la ejecución de trabajos artísticos que sólo puedan encomendarse a determinadas personas naturales;","PRESTAR SERVICIO ASISTENCIAL DE APOYO EN EL ÁREA DE GESTIÓN DE DESARROLLO LOCAL—CDI, PARA LA NOTIFICACIÓN DE CORRESPONDENCIA EN GENERAL","Inversión","Bogotá Mejor para Todos",45,{"$f":"IF(ISERROR(VLOOKUP(K31,Eje_Pilar_Prop!$C$2:$E$104,2,FALSE)),\" \",VLOOKUP(K31,Eje_Pilar_Prop!$C$2:$E$104,2,FALSE))","v":"Gobernanza e influencia local, regional e internacional"},{"$f":"IF(ISERROR(VLOOKUP(K31,Eje_Pilar_Prop!$C$2:$E$104,3,FALSE)),\" \",VLOOKUP(K31,Eje_Pilar_Prop!$C$2:$E$104,3,FALSE))","v":"Eje Transversal 4 Gobierno Legitimo, Fortalecimiento Local y Eficiencia"},1395,1122727530,"JESSE JOSE VILLEGAS CABRERA",9831392,null,null,0,0,9831392,9831392,"2020-02-21","2020-02-21","2020-06-20",120,null,null,null,null,null,null,null,null,null,"X",1,{"$f":"IF(SUMPRODUCT((A$14:A31=A31)*(B$14:B31=B31)*(D$14:D31=D31))>1,0,1)","v":1},"Contratos de prestación de servicios profesionales y de apoyo a la gestión","Contratación directa",{"$f":"IF(ISBLANK(G31),1,IFERROR(VLOOKUP(G31,Tipo!$C$12:$C$27,1,FALSE),\"NO\"))","v":"Prestación de servicios profesionales y de apoyo a la gestión, o para la ejecución de trabajos artísticos que sólo puedan encomendarse a determinadas personas naturales;"},"Inversión",{"$f":"IF(ISBLANK(K31),1,IFERROR(VLOOKUP(K31,Eje_Pilar_Prop!C13:C114,1,FALSE),\"NO\"))","v":45},"SECOP II",1,"Bogotá Mejor para Todos"]
[20,2020,"SECOP II","FDLC-CPS-020-2020","Contratos de prestación de servicios profesionales y de apoyo a la gestión","Contratación directa","Prestación de servicios profesionales y de apoyo a la gestión, o para la ejecución de trabajos artísticos que sólo puedan encomendarse a determinadas personas naturales;","PRESTACIÓN DE SERVICIOS PROFESIONALES PARA APOYAR TÉCNICAMENTE LAS DISTINTAS ETAPAS DE LOS PROCESOS DE COMPETENCIA DE LA ALCALDÍA LOCAL PARA LA DEPURACIÓN DE ACTUACIONES ADMINISTRATIVAS","Inversión","Bogotá Mejor para Todos",45,{"$f":"IF(ISERROR(VLOOKUP(K32,Eje_Pilar_Prop!$C$2:$E$104,2,FALSE)),\" \",VLOOKUP(K32,Eje_Pilar_Prop!$C$2:$E$104,2,FALSE))","v":"Gobernanza e influencia local, regional e internacional"},{"$f":"IF(ISERROR(VLOOKUP(K32,Eje_Pilar_Prop!$C$2:$E$104,3,FALSE)),\" \",VLOOKUP(K32,Eje_Pilar_Prop!$C$2:$E$104,3,FALSE))","v":"Eje Transversal 4 Gobierno Legitimo, Fortalecimiento Local y Eficiencia"},1395,79507928,"FRANCISCO JAVIER HIGUERA NOVA",17907180,null,null,0,0,17907180,17757950,"2020-02-21","2020-02-24","2020-06-23",120,null,null,null,null,null,null,null,null,null,"X",0.99166647121433971,{"$f":"IF(SUMPRODUCT((A$14:A32=A32)*(B$14:B32=B32)*(D$14:D32=D32))>1,0,1)","v":1},"Contratos de prestación de servicios profesionales y de apoyo a la gestión","Contratación directa",{"$f":"IF(ISBLANK(G32),1,IFERROR(VLOOKUP(G32,Tipo!$C$12:$C$27,1,FALSE),\"NO\"))","v":"Prestación de servicios profesionales y de apoyo a la gestión, o para la ejecución de trabajos artísticos que sólo puedan encomendarse a determinadas personas naturales;"},"Inversión",{"$f":"IF(ISBLANK(K32),1,IFERROR(VLOOKUP(K32,Eje_Pilar_Prop!C14:C115,1,FALSE),\"NO\"))","v":45},"SECOP II",1,"Bogotá Mejor para Todos"]
[21,2020,"SECOP II","FDLC-CPS-021-2020","Contratos de prestación de servicios profesionales y de apoyo a la gestión","Contratación directa","Prestación de servicios profesionales y de apoyo a la gestión, o para la ejecución de trabajos artísticos que sólo puedan encomendarse a determinadas personas naturales;","PRESTAR SUS SERVICIOS PROFESIONALES PARA APOYAR TÉCNICAMENTE A LOS RESPONSABLES E INTEGRANTES DE LOS PROCESOS EN LA IMPLEMENTACIÓN DE HERRAMIENTAS DE GESTIÓN, SIGUIENDO LOS LINEAMIENTOS METODOLÓGICOS ESTABLECIDOS POR LA OFICINA ASESORA DE PLANEACIÓN DE LA SECRETARÍA DISTRITAL DE GOBIERNO","Inversión","Bogotá Mejor para Todos",45,{"$f":"IF(ISERROR(VLOOKUP(K33,Eje_Pilar_Prop!$C$2:$E$104,2,FALSE)),\" \",VLOOKUP(K33,Eje_Pilar_Prop!$C$2:$E$104,2,FALSE))","v":"Gobernanza e influencia local, regional e internacional"},{"$f":"IF(ISERROR(VLOOKUP(K33,Eje_Pilar_Prop!$C$2:$E$104,3,FALSE)),\" \",VLOOKUP(K33,Eje_Pilar_Prop!$C$2:$E$104,3,FALSE))","v":"Eje Transversal 4 Gobierno Legitimo, Fortalecimiento Local y Eficiencia"},1395,67031659,"DIANA CAROLINA GUAPACHA TOVAR",16800000,null,null,0,null,16800000,16800000,"2020-02-27","2020-02-27","2020-06-26",120,null,null,null,null,null,null,null,null,null,"X",1,{"$f":"IF(SUMPRODUCT((A$14:A33=A33)*(B$14:B33=B33)*(D$14:D33=D33))>1,0,1)","v":1},"Contratos de prestación de servicios profesionales y de apoyo a la gestión","Contratación directa",{"$f":"IF(ISBLANK(G33),1,IFERROR(VLOOKUP(G33,Tipo!$C$12:$C$27,1,FALSE),\"NO\"))","v":"Prestación de servicios profesionales y de apoyo a la gestión, o para la ejecución de trabajos artísticos que sólo puedan encomendarse a determinadas personas naturales;"},"Inversión",{"$f":"IF(ISBLANK(K33),1,IFERROR(VLOOKUP(K33,Eje_Pilar_Prop!C15:C116,1,FALSE),\"NO\"))","v":45},"SECOP II",1,"Bogotá Mejor para Todos"]
[22,2020,"SECOP II","FDLC-CPS-022*-2020","Contratos de prestación de servicios profesionales y de apoyo a la gestión","Contratación directa","Prestación de servicios profesionales y de apoyo a la gestión, o para la ejecución de trabajos artísticos que sólo puedan encomendarse a determinadas personas naturales;","PRESTAR SERVICIO ASISTENCIAL DE APOYO EN EL ÁREA DE GESTIÓN DE DESARROLLO LOCAL—CDI, PARA LA NOTIFICACIÓN DE CORRESPONDENCIA EN GENERAL","Inversión","Bogotá Mejor para Todos",45,{"$f":"IF(ISERROR(VLOOKUP(K34,Eje_Pilar_Prop!$C$2:$E$104,2,FALSE)),\" \",VLOOKUP(K34,Eje_Pilar_Prop!$C$2:$E$104,2,FALSE))","v":"Gobernanza e influencia local, regional e internacional"},{"$f":"IF(ISERROR(VLOOKUP(K34,Eje_Pilar_Prop!$C$2:$E$104,3,FALSE)),\" \",VLOOKUP(K34,Eje_Pilar_Prop!$C$2:$E$104,3,FALSE))","v":"Eje Transversal 4 Gobierno Legitimo, Fortalecimiento Local y Eficiencia"},1395,51940511,"ALEIDA CRUZ GRANADA",9831392,null,null,0,null,9831392,9831384,"2020-03-02","2020-03-04","2020-07-03",120,null,null,null,null,null,null,null,null,null,"X",0.99999918628003037,{"$f":"IF(SUMPRODUCT((A$14:A34=A34)*(B$14:B34=B34)*(D$14:D34=D34))>1,0,1)","v":1},"Contratos de prestación de servicios profesionales y de apoyo a la gestión","Contratación directa",{"$f":"IF(ISBLANK(G34),1,IFERROR(VLOOKUP(G34,Tipo!$C$12:$C$27,1,FALSE),\"NO\"))","v":"Prestación de servicios profesionales y de apoyo a la gestión, o para la ejecución de trabajos artísticos que sólo puedan encomendarse a determinadas personas naturales;"},"Inversión",{"$f":"IF(ISBLANK(K34),1,IFERROR(VLOOKUP(K34,Eje_Pilar_Prop!C16:C117,1,FALSE),\"NO\"))","v":45},"SECOP II",null,"Bogotá Mejor para Todos"]
[23,2020,"SECOP II","FDLC-CPS-023-2020","Contratos de prestación de servicios profesionales y de apoyo a la gestión","Contratación directa","Prestación de servicios profesionales y de apoyo a la gestión, o para la ejecución de trabajos artísticos que sólo puedan encomendarse a determinadas personas naturales;","PRESTACIÓN DE SERVICIOS PARA APOYAR LAS LABORES DE ENTREGA Y RECIBO DE LAS COMUNICACIONES EMITIDAS POR LA INSPECCIÓN DE POLICÍA DE LA LOCALIDAD","Inversión","Bogotá Mejor para Todos",45,{"$f":"IF(ISERROR(VLOOKUP(K35,Eje_Pilar_Prop!$C$2:$E$104,2,FALSE)),\" \",VLOOKUP(K35,Eje_Pilar_Prop!$C$2:$E$104,2,FALSE))","v":"Gobernanza e influencia local, regional e internacional"},{"$f":"IF(ISERROR(VLOOKUP(K35,Eje_Pilar_Prop!$C$2:$E$104,3,FALSE)),\" \",VLOOKUP(K35,Eje_Pilar_Prop!$C$2:$E$104,3,FALSE))","v":"Eje Transversal 4 Gobierno Legitimo, Fortalecimiento Local y Eficiencia"},1395,1022956077,"JARRY EMERSON RIAÑO DELGADO",9831393,null,null,0,null,9831393,9749464,"2020-02-28","2020-02-28","2020-06-27",120,null,null,null,null,null,null,null,null,null,"X",0.99166659292330195,{"$f":"IF(SUMPRODUCT((A$14:A35=A35)*(B$14:B35=B35)*(D$14:D35=D35))>1,0,1)","v":1},"Contratos de prestación de servicios profesionales y de apoyo a la gestión","Contratación directa",{"$f":"IF(ISBLANK(G35),1,IFERROR(VLOOKUP(G35,Tipo!$C$12:$C$27,1,FALSE),\"NO\"))","v":"Prestación de servicios profesionales y de apoyo a la gestión, o para la ejecución de trabajos artísticos que sólo puedan encomendarse a determinadas personas naturales;"},"Inversión",{"$f":"IF(ISBLANK(K35),1,IFERROR(VLOOKUP(K35,Eje_Pilar_Prop!C17:C118,1,FALSE),\"NO\"))","v":45},"SECOP II",1,"Bogotá Mejor para Todos"]
[24,2020,"SECOP II","FDLC-CPS-024-2020","Contratos de prestación de servicios profesionales y de apoyo a la gestión","Contratación directa","Prestación de servicios profesionales y de apoyo a la gestión, o para la ejecución de trabajos artísticos que sólo puedan encomendarse a determinadas personas naturales;","PRESTACIÓN DE SERVICIOS PROFESIONALES PARA APOYAR TÉCNICAMENTE LAS DISTINTAS ETAPAS DE LOS PROCESOS DE COMPETENCIA DE LA ALCALDÍA LOCAL PARA LA DEPURACIÓN DE ACTUACIONES ADMINISTRATIVAS","Inversión","Bogotá Mejor para Todos",45,{"$f":"IF(ISERROR(VLOOKUP(K36,Eje_Pilar_Prop!$C$2:$E$104,2,FALSE)),\" \",VLOOKUP(K36,Eje_Pilar_Prop!$C$2:$E$104,2,FALSE))","v":"Gobernanza e influencia local, regional e internacional"},{"$f":"IF(ISERROR(VLOOKUP(K36,Eje_Pilar_Prop!$C$2:$E$104,3,FALSE)),\" \",VLOOKUP(K36,Eje_Pilar_Prop!$C$2:$E$104,3,FALSE))","v":"Eje Transversal 4 Gobierno Legitimo, Fortalecimiento Local y Eficiencia"},1395,13718198,"OSCAR JULIAN DUARTE CUBILLOS",17907180,null,null,0,null,17907180,17907180,"2020-02-28","2020-03-02","2020-07-01",120,null,null,null,null,null,null,null,null,null,"X",1,{"$f":"IF(SUMPRODUCT((A$14:A36=A36)*(B$14:B36=B36)*(D$14:D36=D36))>1,0,1)","v":1},"Contratos de prestación de servicios profesionales y de apoyo a la gestión","Contratación directa",{"$f":"IF(ISBLANK(G36),1,IFERROR(VLOOKUP(G36,Tipo!$C$12:$C$27,1,FALSE),\"NO\"))","v":"Prestación de servicios profesionales y de apoyo a la gestión, o para la ejecución de trabajos artísticos que sólo puedan encomendarse a determinadas personas naturales;"},"Inversión",{"$f":"IF(ISBLANK(K36),1,IFERROR(VLOOKUP(K36,Eje_Pilar_Prop!C18:C119,1,FALSE),\"NO\"))","v":45},"SECOP II",1,"Bogotá Mejor para Todos"]
[25,2020,"SECOP II","FDLC-CPS-025-2020","Contratos de prestación de servicios profesionales y de apoyo a la gestión","Contratación directa","Prestación de servicios profesionales y de apoyo a la gestión, o para la ejecución de trabajos artísticos que sólo puedan encomendarse a determinadas personas naturales;","PRESTAR SERVICIOS DE APOYO COMO CONDUCTOR DE LOS VEHICULOS QUE SE ENCUENTRAN A CARGO DEL FONDO DE DESARROLLO LOCAL LA CANDELARIA","Inversión","Bogotá Mejor para Todos",45,{"$f":"IF(ISERROR(VLOOKUP(K37,Eje_Pilar_Prop!$C$2:$E$104,2,FALSE)),\" \",VLOOKUP(K37,Eje_Pilar_Prop!$C$2:$E$104,2,FALSE))","v":"Gobernanza e influencia local, regional e internacional"},{"$f":"IF(ISERROR(VLOOKUP(K37,Eje_Pilar_Prop!$C$2:$E$104,3,FALSE)),\" \",VLOOKUP(K37,Eje_Pilar_Prop!$C$2:$E$104,3,FALSE))","v":"Eje Transversal 4 Gobierno Legitimo, Fortalecimiento Local y Eficiencia"},1395,79951133,"WILSON HAISBER RAMIREZ REINA",9831392,null,null,0,null,9831392,9831392,"2020-03-02","2020-03-03","2020-07-02",120,null,null,null,null,null,null,null,null,null,"X",1,{"$f":"IF(SUMPRODUCT((A$14:A37=A37)*(B$14:B37=B37)*(D$14:D37=D37))>1,0,1)","v":1},"Contratos de prestación de servicios profesionales y de apoyo a la gestión","Contratación directa",{"$f":"IF(ISBLANK(G37),1,IFERROR(VLOOKUP(G37,Tipo!$C$12:$C$27,1,FALSE),\"NO\"))","v":"Prestación de servicios profesionales y de apoyo a la gestión, o para la ejecución de trabajos artísticos que sólo puedan encomendarse a determinadas personas naturales;"},"Inversión",{"$f":"IF(ISBLANK(K37),1,IFERROR(VLOOKUP(K37,Eje_Pilar_Prop!C19:C120,1,FALSE),\"NO\"))","v":45},"SECOP II",1,"Bogotá Mejor para Todos"]
[26,2020,"SECOP II","FDLC-CPS-026-2020","Contratos de prestación de servicios profesionales y de apoyo a la gestión","Contratación directa","Prestación de servicios profesionales y de apoyo a la gestión, o para la ejecución de trabajos artísticos que sólo puedan encomendarse a determinadas personas naturales;","PRESTACIÓN DE SERVICIOS PROFESIONALES PARA APOYAR JURÍDICAMENTE LA EJECUCIÓN DE LAS ACCIONES REQUERIDAS PARA LA DEPURACIÓN DE LAS ACTUACIONES ADMINISTRATIVAS QUE CURSAN EN LA ALCALDÍA LOCAL","Inversión","Bogotá Mejor para Todos",45,{"$f":"IF(ISERROR(VLOOKUP(K38,Eje_Pilar_Prop!$C$2:$E$104,2,FALSE)),\" \",VLOOKUP(K38,Eje_Pilar_Prop!$C$2:$E$104,2,FALSE))","v":"Gobernanza e influencia local, regional e internacional"},{"$f":"IF(ISERROR(VLOOKUP(K38,Eje_Pilar_Prop!$C$2:$E$104,3,FALSE)),\" \",VLOOKUP(K38,Eje_Pilar_Prop!$C$2:$E$104,3,FALSE))","v":"Eje Transversal 4 Gobierno Legitimo, Fortalecimiento Local y Eficiencia"},1395,79691880,"JORGE ELIECER DURAN CONSUEGRA",17907181,null,null,0,null,17907181,17907180,"2020-03-03","2020-03-03","2020-07-02",120,null,null,null,null,null,null,null,null,null,"X",0.99999994415648108,{"$f":"IF(SUMPRODUCT((A$14:A38=A38)*(B$14:B38=B38)*(D$14:D38=D38))>1,0,1)","v":1},"Contratos de prestación de servicios profesionales y de apoyo a la gestión","Contratación directa",{"$f":"IF(ISBLANK(G38),1,IFERROR(VLOOKUP(G38,Tipo!$C$12:$C$27,1,FALSE),\"NO\"))","v":"Prestación de servicios profesionales y de apoyo a la gestión, o para la ejecución de trabajos artísticos que sólo puedan encomendarse a determinadas personas naturales;"},"Inversión",{"$f":"IF(ISBLANK(K38),1,IFERROR(VLOOKUP(K38,Eje_Pilar_Prop!C20:C121,1,FALSE),\"NO\"))","v":45},"SECOP II",1,"Bogotá Mejor para Todos"]
[27,2020,"SECOP II","FDCLC-CPS-027-2020","Contratos de prestación de servicios profesionales y de apoyo a la gestión","Contratación directa","Prestación de servicios profesionales y de apoyo a la gestión, o para la ejecución de trabajos artísticos que sólo puedan encomendarse a determinadas personas naturales;","PRESTACIÓN DE SERVICIOS DE APOYO TÉCNICO EN LA ADMINISTRACIÓN DE LAS CASAS COMUNITARIAS DE LA LOCALIDAD DE LA CANDELARIA DE CONFORMIDAD CON EL ACUERDO LOCAL 006 DE 2013","Inversión","Bogotá Mejor para Todos",45,{"$f":"IF(ISERROR(VLOOKUP(K39,Eje_Pilar_Prop!$C$2:$E$104,2,FALSE)),\" \",VLOOKUP(K39,Eje_Pilar_Prop!$C$2:$E$104,2,FALSE))","v":"Gobernanza e influencia local, regional e internacional"},{"$f":"IF(ISERROR(VLOOKUP(K39,Eje_Pilar_Prop!$C$2:$E$104,3,FALSE)),\" \",VLOOKUP(K39,Eje_Pilar_Prop!$C$2:$E$104,3,FALSE))","v":"Eje Transversal 4 Gobierno Legitimo, Fortalecimiento Local y Eficiencia"},1395,51653505,"DORA CECILIA JIMENEZ MORENO",11587000,null,null,0,null,11587000,11393393,"2020-03-03","2020-03-03","2020-07-02",120,null,null,null,null,null,null,null,null,"X",null,0.98329101579356171,{"$f":"IF(SUMPRODUCT((A$14:A39=A39)*(B$14:B39=B39)*(D$14:D39=D39))>1,0,1)","v":1},"Contratos de prestación de servicios profesionales y de apoyo a la gestión","Contratación directa",{"$f":"IF(ISBLANK(G39),1,IFERROR(VLOOKUP(G39,Tipo!$C$12:$C$27,1,FALSE),\"NO\"))","v":"Prestación de servicios profesionales y de apoyo a la gestión, o para la ejecución de trabajos artísticos que sólo puedan encomendarse a determinadas personas naturales;"},"Inversión",{"$f":"IF(ISBLANK(K39),1,IFERROR(VLOOKUP(K39,Eje_Pilar_Prop!C21:C122,1,FALSE),\"NO\"))","v":45},"SECOP II",1,"Bogotá Mejor para Todos"]
[28,2020,"SECOP II","FDLC-CPS-028-2020","Contratos de prestación de servicios profesionales y de apoyo a la gestión","Contratación directa","Prestación de servicios profesionales y de apoyo a la gestión, o para la ejecución de trabajos artísticos que sólo puedan encomendarse a determinadas personas naturales;","PRESTACIÓN DE SERVICIOS DE APOYO TÉCNICO EN LA ADMINISTRACIÓN DE LAS CASAS COMUNITARIAS DE LA LOCALIDAD DE LA CANDELARIA DE CONFORMIDAD CON EL ACUERDO LOCAL 006 DE 2013","Inversión","Bogotá Mejor para Todos",45,{"$f":"IF(ISERROR(VLOOKUP(K40,Eje_Pilar_Prop!$C$2:$E$104,2,FALSE)),\" \",VLOOKUP(K40,Eje_Pilar_Prop!$C$2:$E$104,2,FALSE))","v":"Gobernanza e influencia local, regional e internacional"},{"$f":"IF(ISERROR(VLOOKUP(K40,Eje_Pilar_Prop!$C$2:$E$104,3,FALSE)),\" \",VLOOKUP(K40,Eje_Pilar_Prop!$C$2:$E$104,3,FALSE))","v":"Eje Transversal 4 Gobierno Legitimo, Fortalecimiento Local y Eficiencia"},1395,52219649,"INDIRA BETANCOURT MACUASE",11587000,null,null,0,null,11587000,11587000,"2020-03-03","2020-03-03","2020-07-02",120,null,null,null,null,null,null,null,null,null,"X",1,{"$f":"IF(SUMPRODUCT((A$14:A40=A40)*(B$14:B40=B40)*(D$14:D40=D40))>1,0,1)","v":1},"Contratos de prestación de servicios profesionales y de apoyo a la gestión","Contratación directa",{"$f":"IF(ISBLANK(G40),1,IFERROR(VLOOKUP(G40,Tipo!$C$12:$C$27,1,FALSE),\"NO\"))","v":"Prestación de servicios profesionales y de apoyo a la gestión, o para la ejecución de trabajos artísticos que sólo puedan encomendarse a determinadas personas naturales;"},"Inversión",{"$f":"IF(ISBLANK(K40),1,IFERROR(VLOOKUP(K40,Eje_Pilar_Prop!C22:C123,1,FALSE),\"NO\"))","v":45},"SECOP II",1,"Bogotá Mejor para Todos"]
[29,2020,"SECOP II","FDLC-CPS-029-2020","Contratos de prestación de servicios profesionales y de apoyo a la gestión","Contratación directa","Prestación de servicios profesionales y de apoyo a la gestión, o para la ejecución de trabajos artísticos que sólo puedan encomendarse a determinadas personas naturales;","PRESTACIÓN DE SERVICIOS PROFESIONALES PARA APOYAR JURÍDICAMENTE LA EJECUCIÓN DE LAS ACCIONES REQUERIDAS PARA LA DEPURACIÓN DE LAS ACTUACIONES ADMINISTRATIVAS QUE CURSAN EN LA ALCALDÍA LOCAL","Inversión","Bogotá Mejor para Todos",45,{"$f":"IF(ISERROR(VLOOKUP(K41,Eje_Pilar_Prop!$C$2:$E$104,2,FALSE)),\" \",VLOOKUP(K41,Eje_Pilar_Prop!$C$2:$E$104,2,FALSE))","v":"Gobernanza e influencia local, regional e internacional"},{"$f":"IF(ISERROR(VLOOKUP(K41,Eje_Pilar_Prop!$C$2:$E$104,3,FALSE)),\" \",VLOOKUP(K41,Eje_Pilar_Prop!$C$2:$E$104,3,FALSE))","v":"Eje Transversal 4 Gobierno Legitimo, Fortalecimiento Local y Eficiencia"},1395,41794885,"TERESA HERREÑO SOLANO",17907180,null,null,0,null,17907180,17907180,"2020-03-03","2020-03-03","2020-07-02",120,null,null,null,null,null,null,null,null,null,"X",1,{"$f":"IF(SUMPRODUCT((A$14:A41=A41)*(B$14:B41=B41)*(D$14:D41=D41))>1,0,1)","v":1},"Contratos de prestación de servicios profesionales y de apoyo a la gestión","Contratación directa",{"$f":"IF(ISBLANK(G41),1,IFERROR(VLOOKUP(G41,Tipo!$C$12:$C$27,1,FALSE),\"NO\"))","v":"Prestación de servicios profesionales y de apoyo a la gestión, o para la ejecución de trabajos artísticos que sólo puedan encomendarse a determinadas personas naturales;"},"Inversión",{"$f":"IF(ISBLANK(K41),1,IFERROR(VLOOKUP(K41,Eje_Pilar_Prop!C23:C124,1,FALSE),\"NO\"))","v":45},"SECOP II",1,"Bogotá Mejor para Todos"]
[30,2020,"SECOP II","FDLC-CPS-030-2020","Contratos de prestación de servicios profesionales y de apoyo a la gestión","Contratación directa","Prestación de servicios profesionales y de apoyo a la gestión, o para la ejecución de trabajos artísticos que sólo puedan encomendarse a determinadas personas naturales;","PRESTACIÓN DE SERVICIOS PROFESIONALES PARA APOYAR JURÍDICAMENTE LA EJECUCIÓN DE LAS ACCIONES REQUERIDAS PARA LA DEPURACIÓN DE LAS ACTUACIONES ADMINISTRATIVAS QUE CURSAN EN LA ALCALDÍA LOCAL","Inversión","Bogotá Mejor para Todos",45,{"$f":"IF(ISERROR(VLOOKUP(K42,Eje_Pilar_Prop!$C$2:$E$104,2,FALSE)),\" \",VLOOKUP(K42,Eje_Pilar_Prop!$C$2:$E$104,2,FALSE))","v":"Gobernanza e influencia local, regional e internacional"},{"$f":"IF(ISERROR(VLOOKUP(K42,Eje_Pilar_Prop!$C$2:$E$104,3,FALSE)),\" \",VLOOKUP(K42,Eje_Pilar_Prop!$C$2:$E$104,3,FALSE))","v":"Eje Transversal 4 Gobierno Legitimo, Fortalecimiento Local y Eficiencia"},1395,"1018433933\n51875915","CINDY MERCEDES GOMEZ GUERRERO CEDIDO A LUZ SOFIA AMAYA CASTAÑEDA A PARTIR DEL 1  DE JUNIO DE 2020",17907181,null,null,0,null,17907181,17907181,"2020-03-03","2020-03-03","2020-07-02",120,null,null,51875915,"LUZ SOFIA AMAYA","2020-06-01",4476795,null,null,null,"X",1,{"$f":"IF(SUMPRODUCT((A$14:A42=A42)*(B$14:B42=B42)*(D$14:D42=D42))>1,0,1)","v":1},"Contratos de prestación de servicios profesionales y de apoyo a la gestión","Contratación directa",{"$f":"IF(ISBLANK(G42),1,IFERROR(VLOOKUP(G42,Tipo!$C$12:$C$27,1,FALSE),\"NO\"))","v":"Prestación de servicios profesionales y de apoyo a la gestión, o para la ejecución de trabajos artísticos que sólo puedan encomendarse a determinadas personas naturales;"},"Inversión",{"$f":"IF(ISBLANK(K42),1,IFERROR(VLOOKUP(K42,Eje_Pilar_Prop!C24:C125,1,FALSE),\"NO\"))","v":45},"SECOP II",1,"Bogotá Mejor para Todos"]
[31,2020,"SECOP II","FDLC-CPS-031-2020","Contratos de prestación de servicios profesionales y de apoyo a la gestión","Contratación directa","Prestación de servicios profesionales y de apoyo a la gestión, o para la ejecución de trabajos artísticos que sólo puedan encomendarse a determinadas personas naturales;","PRESTAR SERVICIOS DE APOYO ADMINISTRATIVO Y ASISTENCIAL AL ÁREA DE GESTIÓN DE DESARROLLO LOCAL, EN LOS PROCESOS DE COMPETENCIA DE LA OFICINA DE PLANEACIÓN DE LA ALCALDÍA LOCAL DE LA CANDELARIA","Inversión","Bogotá Mejor para Todos",45,{"$f":"IF(ISERROR(VLOOKUP(K43,Eje_Pilar_Prop!$C$2:$E$104,2,FALSE)),\" \",VLOOKUP(K43,Eje_Pilar_Prop!$C$2:$E$104,2,FALSE))","v":"Gobernanza e influencia local, regional e internacional"},{"$f":"IF(ISERROR(VLOOKUP(K43,Eje_Pilar_Prop!$C$2:$E$104,3,FALSE)),\" \",VLOOKUP(K43,Eje_Pilar_Prop!$C$2:$E$104,3,FALSE))","v":"Eje Transversal 4 Gobierno Legitimo, Fortalecimiento Local y Eficiencia"},1395,1010198763,"Carlos Mauricio Palomar Covaleda",7020000,null,null,0,0,7020000,7019500,"2020-03-04","2020-03-04","2020-07-03",120,null,null,null,null,null,null,null,null,null,"X",0.99992877492877497,{"$f":"IF(SUMPRODUCT((A$14:A43=A43)*(B$14:B43=B43)*(D$14:D43=D43))>1,0,1)","v":1},"Contratos de prestación de servicios profesionales y de apoyo a la gestión","Contratación directa",{"$f":"IF(ISBLANK(G43),1,IFERROR(VLOOKUP(G43,Tipo!$C$12:$C$27,1,FALSE),\"NO\"))","v":"Prestación de servicios profesionales y de apoyo a la gestión, o para la ejecución de trabajos artísticos que sólo puedan encomendarse a determinadas personas naturales;"},"Inversión",{"$f":"IF(ISBLANK(K43),1,IFERROR(VLOOKUP(K43,Eje_Pilar_Prop!C25:C126,1,FALSE),\"NO\"))","v":45},"SECOP II",1,"Bogotá Mejor para Todos"]
[32,2020,"SECOP II","FDLC-CPS-032-2020","Contratos de prestación de servicios","Contratación directa","Prestación de servicios profesionales y de apoyo a la gestión, o para la ejecución de trabajos artísticos que sólo puedan encomendarse a determinadas personas naturales;","PRESTAR SERVICIOS DE APOYO ADMINISTRATIVO Y ASISTENCIAL AL ÁREA DE GESTIÓN DE DESARROLLO LOCAL, EN LOS PROCESOS DE COMPETENCIA DE LA OFICINA DE PLANEACIÓN DE LA ALCALDÍA LOCAL DE LA CANDELARIA","Inversión","Bogotá Mejor para Todos",45,{"$f":"IF(ISERROR(VLOOKUP(K44,Eje_Pilar_Prop!$C$2:$E$104,2,FALSE)),\" \",VLOOKUP(K44,Eje_Pilar_Prop!$C$2:$E$104,2,FALSE))","v":"Gobernanza e influencia local, regional e internacional"},{"$f":"IF(ISERROR(VLOOKUP(K44,Eje_Pilar_Prop!$C$2:$E$104,3,FALSE)),\" \",VLOOKUP(K44,Eje_Pilar_Prop!$C$2:$E$104,3,FALSE))","v":"Eje Transversal 4 Gobierno Legitimo, Fortalecimiento Local y Eficiencia"},1395,1000575536,"JUAN CAMILO HERRERA FRANCO",7020000,null,null,0,null,7020000,6844500,"2020-03-04","2020-03-04","2020-07-03",120,null,null,null,null,null,null,null,null,null,"X",0.97499999999999998,{"$f":"IF(SUMPRODUCT((A$14:A44=A44)*(B$14:B44=B44)*(D$14:D44=D44))>1,0,1)","v":1},"Contratos de prestación de servicios","Contratación directa",{"$f":"IF(ISBLANK(G44),1,IFERROR(VLOOKUP(G44,Tipo!$C$12:$C$27,1,FALSE),\"NO\"))","v":"Prestación de servicios profesionales y de apoyo a la gestión, o para la ejecución de trabajos artísticos que sólo puedan encomendarse a determinadas personas naturales;"},"Inversión",{"$f":"IF(ISBLANK(K44),1,IFERROR(VLOOKUP(K44,Eje_Pilar_Prop!C26:C127,1,FALSE),\"NO\"))","v":45},"SECOP II",1,"Bogotá Mejor para Todos"]
[33,2020,"SECOP II","FDLC-CPS-033-2020","Contratos de prestación de servicios profesionales y de apoyo a la gestión","Contratación directa","Prestación de servicios profesionales y de apoyo a la gestión, o para la ejecución de trabajos artísticos que sólo puedan encomendarse a determinadas personas naturales;","PRESTAR SERVICIOS DE APOYO COMO CONDUCTOR DE LOS VEHICULOS QUE SE ENCUENTRAN A CARGO DEL FONDO DE DESARROLLO LOCAL LA CANDELARIA","Inversión","Bogotá Mejor para Todos",45,{"$f":"IF(ISERROR(VLOOKUP(K45,Eje_Pilar_Prop!$C$2:$E$104,2,FALSE)),\" \",VLOOKUP(K45,Eje_Pilar_Prop!$C$2:$E$104,2,FALSE))","v":"Gobernanza e influencia local, regional e internacional"},{"$f":"IF(ISERROR(VLOOKUP(K45,Eje_Pilar_Prop!$C$2:$E$104,3,FALSE)),\" \",VLOOKUP(K45,Eje_Pilar_Prop!$C$2:$E$104,3,FALSE))","v":"Eje Transversal 4 Gobierno Legitimo, Fortalecimiento Local y Eficiencia"},1395,79381970,"FERNANDO FORERO BRESNEIDER",9831392,null,null,0,null,9831392,9831392,"2020-03-04","2020-03-04","2020-07-03",120,null,null,null,null,null,null,null,null,null,"X",1,{"$f":"IF(SUMPRODUCT((A$14:A45=A45)*(B$14:B45=B45)*(D$14:D45=D45))>1,0,1)","v":1},"Contratos de prestación de servicios profesionales y de apoyo a la gestión","Contratación directa",{"$f":"IF(ISBLANK(G45),1,IFERROR(VLOOKUP(G45,Tipo!$C$12:$C$27,1,FALSE),\"NO\"))","v":"Prestación de servicios profesionales y de apoyo a la gestión, o para la ejecución de trabajos artísticos que sólo puedan encomendarse a determinadas personas naturales;"},"Inversión",{"$f":"IF(ISBLANK(K45),1,IFERROR(VLOOKUP(K45,Eje_Pilar_Prop!C27:C128,1,FALSE),\"NO\"))","v":45},"SECOP II",1,"Bogotá Mejor para Todos"]
[34,2020,"SECOP II","FDLC-CPS-034-2020","Contratos de prestación de servicios profesionales y de apoyo a la gestión","Contratación directa","Prestación de servicios profesionales y de apoyo a la gestión, o para la ejecución de trabajos artísticos que sólo puedan encomendarse a determinadas personas naturales;","PRESTACIÓN DE SERVICIOS PROFESIONALES PARA APOYAR JURÍDICAMENTE LA EJECUCIÓN DE LAS ACCIONES REQUERIDAS PARA LA DEPURACIÓN DE LAS ACTUACIONES ADMINISTRATIVAS QUE CURSAN EN LA ALCALDÍA LOCAL","Inversión","Bogotá Mejor para Todos",45,{"$f":"IF(ISERROR(VLOOKUP(K46,Eje_Pilar_Prop!$C$2:$E$104,2,FALSE)),\" \",VLOOKUP(K46,Eje_Pilar_Prop!$C$2:$E$104,2,FALSE))","v":"Gobernanza e influencia local, regional e internacional"},{"$f":"IF(ISERROR(VLOOKUP(K46,Eje_Pilar_Prop!$C$2:$E$104,3,FALSE)),\" \",VLOOKUP(K46,Eje_Pilar_Prop!$C$2:$E$104,3,FALSE))","v":"Eje Transversal 4 Gobierno Legitimo, Fortalecimiento Local y Eficiencia"},1395,32645897,"Miryam Esther Lopez Rodriguez",17907180,null,null,0,0,17907180,17906580,"2020-03-05","2020-03-05","2020-07-04",120,null,null,null,null,null,null,null,null,null,"X",0.99996649388680969,{"$f":"IF(SUMPRODUCT((A$14:A46=A46)*(B$14:B46=B46)*(D$14:D46=D46))>1,0,1)","v":1},"Contratos de prestación de servicios profesionales y de apoyo a la gestión","Contratación directa",{"$f":"IF(ISBLANK(G46),1,IFERROR(VLOOKUP(G46,Tipo!$C$12:$C$27,1,FALSE),\"NO\"))","v":"Prestación de servicios profesionales y de apoyo a la gestión, o para la ejecución de trabajos artísticos que sólo puedan encomendarse a determinadas personas naturales;"},"Inversión",{"$f":"IF(ISBLANK(K46),1,IFERROR(VLOOKUP(K46,Eje_Pilar_Prop!C28:C129,1,FALSE),\"NO\"))","v":45},"SECOP II",1,"Bogotá Mejor para Todos"]
[35,2020,"SECOP II","FDLC-CPS-035-2020","Contratos de prestación de servicios profesionales y de apoyo a la gestión","Contratación directa","Prestación de servicios profesionales y de apoyo a la gestión, o para la ejecución de trabajos artísticos que sólo puedan encomendarse a determinadas personas naturales;","PRESTACIÓN DE SERVICIOS DE APOYO TÉCNICO EN LA ADMINISTRACIÓN DE LAS CASAS COMUNITARIAS DE LA LOCALIDAD DE LA CANDELARIA DE CONFORMIDAD CON EL ACUERDO LOCAL 006 DE 2013","Inversión","Bogotá Mejor para Todos",45,{"$f":"IF(ISERROR(VLOOKUP(K47,Eje_Pilar_Prop!$C$2:$E$104,2,FALSE)),\" \",VLOOKUP(K47,Eje_Pilar_Prop!$C$2:$E$104,2,FALSE))","v":"Gobernanza e influencia local, regional e internacional"},{"$f":"IF(ISERROR(VLOOKUP(K47,Eje_Pilar_Prop!$C$2:$E$104,3,FALSE)),\" \",VLOOKUP(K47,Eje_Pilar_Prop!$C$2:$E$104,3,FALSE))","v":"Eje Transversal 4 Gobierno Legitimo, Fortalecimiento Local y Eficiencia"},1395,41503480,"AURA ALICIA ZAMBRANO LOPEZ",11587000,null,null,0,null,11587000,11104215,"2020-03-06","2020-03-06","2020-07-05",120,null,null,null,null,null,null,null,null,null,"X",0.95833390869077417,{"$f":"IF(SUMPRODUCT((A$14:A47=A47)*(B$14:B47=B47)*(D$14:D47=D47))>1,0,1)","v":1},"Contratos de prestación de servicios profesionales y de apoyo a la gestión","Contratación directa",{"$f":"IF(ISBLANK(G47),1,IFERROR(VLOOKUP(G47,Tipo!$C$12:$C$27,1,FALSE),\"NO\"))","v":"Prestación de servicios profesionales y de apoyo a la gestión, o para la ejecución de trabajos artísticos que sólo puedan encomendarse a determinadas personas naturales;"},"Inversión",{"$f":"IF(ISBLANK(K47),1,IFERROR(VLOOKUP(K47,Eje_Pilar_Prop!C29:C130,1,FALSE),\"NO\"))","v":45},"SECOP II",1,"Bogotá Mejor para Todos"]
[36,2020,"SECOP II","FDLC-CPS-036-2020","Contratos de prestación de servicios profesionales y de apoyo a la gestión","Contratación directa","Prestación de servicios profesionales y de apoyo a la gestión, o para la ejecución de trabajos artísticos que sólo puedan encomendarse a determinadas personas naturales;","PRESTAR LOS SERVICIOS DE APOYO LOGÍSTICO EN TODOS LOS EVENTOS Y ACTIVIDADES DE LA ADMINISTRACIÓN LOCAL DE LA LOCALIDAD 17 DE LA CANDELARIA","Inversión","Bogotá Mejor para Todos",45,{"$f":"IF(ISERROR(VLOOKUP(K48,Eje_Pilar_Prop!$C$2:$E$104,2,FALSE)),\" \",VLOOKUP(K48,Eje_Pilar_Prop!$C$2:$E$104,2,FALSE))","v":"Gobernanza e influencia local, regional e internacional"},{"$f":"IF(ISERROR(VLOOKUP(K48,Eje_Pilar_Prop!$C$2:$E$104,3,FALSE)),\" \",VLOOKUP(K48,Eje_Pilar_Prop!$C$2:$E$104,3,FALSE))","v":"Eje Transversal 4 Gobierno Legitimo, Fortalecimiento Local y Eficiencia"},1395,1010200869,"JOHAN STEVEN ROBLES SANDOVAL",9831393,null,null,0,0,9831393,9831392,"2020-03-09","2020-03-10","2020-07-09",120,null,null,null,null,null,null,null,null,null,"X",0.99999989828501412,{"$f":"IF(SUMPRODUCT((A$14:A48=A48)*(B$14:B48=B48)*(D$14:D48=D48))>1,0,1)","v":1},"Contratos de prestación de servicios profesionales y de apoyo a la gestión","Contratación directa",{"$f":"IF(ISBLANK(G48),1,IFERROR(VLOOKUP(G48,Tipo!$C$12:$C$27,1,FALSE),\"NO\"))","v":"Prestación de servicios profesionales y de apoyo a la gestión, o para la ejecución de trabajos artísticos que sólo puedan encomendarse a determinadas personas naturales;"},"Inversión",{"$f":"IF(ISBLANK(K48),1,IFERROR(VLOOKUP(K48,Eje_Pilar_Prop!C30:C131,1,FALSE),\"NO\"))","v":45},"SECOP II",1,"Bogotá Mejor para Todos"]
[37,2020,"SECOP II","FDLC-CPS-037-2020","Contratos de prestación de servicios profesionales y de apoyo a la gestión","Contratación directa","Prestación de servicios profesionales y de apoyo a la gestión, o para la ejecución de trabajos artísticos que sólo puedan encomendarse a determinadas personas naturales;","PRESTAR LOS SERVICIOS DE APOYO LOGÍSTICO EN TODOS LOS EVENTOS Y ACTIVIDADES DE LA ADMINISTRACIÓN LOCAL DE LA LOCALIDAD 17 DE LA CANDELARIA","Inversión","Bogotá Mejor para Todos",45,{"$f":"IF(ISERROR(VLOOKUP(K49,Eje_Pilar_Prop!$C$2:$E$104,2,FALSE)),\" \",VLOOKUP(K49,Eje_Pilar_Prop!$C$2:$E$104,2,FALSE))","v":"Gobernanza e influencia local, regional e internacional"},{"$f":"IF(ISERROR(VLOOKUP(K49,Eje_Pilar_Prop!$C$2:$E$104,3,FALSE)),\" \",VLOOKUP(K49,Eje_Pilar_Prop!$C$2:$E$104,3,FALSE))","v":"Eje Transversal 4 Gobierno Legitimo, Fortalecimiento Local y Eficiencia"},1395,1085280532,"DEIVIS ARAVIT GORDILLO GUTIERREZ",9831393,null,null,0,0,9831393,9831393,"2020-03-09","2020-03-10","2020-07-09",120,null,null,null,null,null,null,null,null,null,"X",1,{"$f":"IF(SUMPRODUCT((A$14:A49=A49)*(B$14:B49=B49)*(D$14:D49=D49))>1,0,1)","v":1},"Contratos de prestación de servicios profesionales y de apoyo a la gestión","Contratación directa",{"$f":"IF(ISBLANK(G49),1,IFERROR(VLOOKUP(G49,Tipo!$C$12:$C$27,1,FALSE),\"NO\"))","v":"Prestación de servicios profesionales y de apoyo a la gestión, o para la ejecución de trabajos artísticos que sólo puedan encomendarse a determinadas personas naturales;"},"Inversión",{"$f":"IF(ISBLANK(K49),1,IFERROR(VLOOKUP(K49,Eje_Pilar_Prop!C31:C132,1,FALSE),\"NO\"))","v":45},"SECOP II",1,"Bogotá Mejor para Todos"]
[38,2020,"SECOP II","FDLC-CPS-038-2020","Contratos de prestación de servicios profesionales y de apoyo a la gestión","Contratación directa","Prestación de servicios profesionales y de apoyo a la gestión, o para la ejecución de trabajos artísticos que sólo puedan encomendarse a determinadas personas naturales;","PRESTAR LOS SERVICIOS DE APOYO LOGÍSTICO EN TODOS LOS EVENTOS Y ACTIVIDADES DE LA ADMINISTRACIÓN LOCAL DE LA LOCALIDAD 17 DE LA CANDELARIA","Inversión","Bogotá Mejor para Todos",45,{"$f":"IF(ISERROR(VLOOKUP(K50,Eje_Pilar_Prop!$C$2:$E$104,2,FALSE)),\" \",VLOOKUP(K50,Eje_Pilar_Prop!$C$2:$E$104,2,FALSE))","v":"Gobernanza e influencia local, regional e internacional"},{"$f":"IF(ISERROR(VLOOKUP(K50,Eje_Pilar_Prop!$C$2:$E$104,3,FALSE)),\" \",VLOOKUP(K50,Eje_Pilar_Prop!$C$2:$E$104,3,FALSE))","v":"Eje Transversal 4 Gobierno Legitimo, Fortalecimiento Local y Eficiencia"},1395,65788328,"Emperatriz Gonzalez Palencia",9831393,null,null,0,0,9831393,9831392,"2020-03-09","2020-03-10","2020-07-09",120,null,null,null,null,null,null,null,null,null,"X",0.99999989828501412,{"$f":"IF(SUMPRODUCT((A$14:A50=A50)*(B$14:B50=B50)*(D$14:D50=D50))>1,0,1)","v":1},"Contratos de prestación de servicios profesionales y de apoyo a la gestión","Contratación directa",{"$f":"IF(ISBLANK(G50),1,IFERROR(VLOOKUP(G50,Tipo!$C$12:$C$27,1,FALSE),\"NO\"))","v":"Prestación de servicios profesionales y de apoyo a la gestión, o para la ejecución de trabajos artísticos que sólo puedan encomendarse a determinadas personas naturales;"},"Inversión",{"$f":"IF(ISBLANK(K50),1,IFERROR(VLOOKUP(K50,Eje_Pilar_Prop!C32:C133,1,FALSE),\"NO\"))","v":45},"SECOP II",1,"Bogotá Mejor para Todos"]
[39,2020,"SECOP II","FDLC-CPS-039-2020","Contratos de prestación de servicios profesionales y de apoyo a la gestión","Contratación directa","Prestación de servicios profesionales y de apoyo a la gestión, o para la ejecución de trabajos artísticos que sólo puedan encomendarse a determinadas personas naturales;","APOYAR LA FORMULACIÓN, EJECUCIÓN, SEGUIMIENTO Y MEJORA CONTINUA DE LAS HERRAMIENTAS QUE CONFORMAN LA GESTIÓN AMBIENTAL INSTITUCIONAL DE LA ALCALDÍA LOCAL","Inversión","Bogotá Mejor para Todos",38,{"$f":"IF(ISERROR(VLOOKUP(K51,Eje_Pilar_Prop!$C$2:$E$104,2,FALSE)),\" \",VLOOKUP(K51,Eje_Pilar_Prop!$C$2:$E$104,2,FALSE))","v":"Recuperación y manejo de la Estructura Ecológica Principal"},{"$f":"IF(ISERROR(VLOOKUP(K51,Eje_Pilar_Prop!$C$2:$E$104,3,FALSE)),\" \",VLOOKUP(K51,Eje_Pilar_Prop!$C$2:$E$104,3,FALSE))","v":"Eje Transversal 3 Sostenibilidad Ambiental basada en la eficiencia energética"},1393,1066727887,"ENIRIS ESTER ACOSTA ESQUIVEL",36000000,null,null,0,0,36000000,21922775,"2020-03-11","2020-03-12","2020-12-11",270,null,null,null,null,null,null,null,null,"X",null,0.60896597222222226,{"$f":"IF(SUMPRODUCT((A$14:A51=A51)*(B$14:B51=B51)*(D$14:D51=D51))>1,0,1)","v":1},"Contratos de prestación de servicios profesionales y de apoyo a la gestión","Contratación directa",{"$f":"IF(ISBLANK(G51),1,IFERROR(VLOOKUP(G51,Tipo!$C$12:$C$27,1,FALSE),\"NO\"))","v":"Prestación de servicios profesionales y de apoyo a la gestión, o para la ejecución de trabajos artísticos que sólo puedan encomendarse a determinadas personas naturales;"},"Inversión",{"$f":"IF(ISBLANK(K51),1,IFERROR(VLOOKUP(K51,Eje_Pilar_Prop!C33:C134,1,FALSE),\"NO\"))","v":38},"SECOP II",1,"Bogotá Mejor para Todos"]
[40,2020,"SECOP II","FDLC-CPS-040-2020","Contratos de prestación de servicios profesionales y de apoyo a la gestión","Contratación directa","Prestación de servicios profesionales y de apoyo a la gestión, o para la ejecución de trabajos artísticos que sólo puedan encomendarse a determinadas personas naturales;","PRESTACIÓN DE SERVICIOS PROFESIONALES PARA LA IMPLEMENTACIÓN Y FORTALECIMIENTO DEL TURISMO CULTURAL EN LA LOCALIDAD 17 DE LA CANDELARIA A TRAVÉS DE LA GESTIÓN, ARTICULACIÓN E INTERLOCUCIÓN CON CIUDADANÍA Y ENTIDADES PÚBLICAS Y PRIVADAS","Inversión","Bogotá Mejor para Todos",45,{"$f":"IF(ISERROR(VLOOKUP(K52,Eje_Pilar_Prop!$C$2:$E$104,2,FALSE)),\" \",VLOOKUP(K52,Eje_Pilar_Prop!$C$2:$E$104,2,FALSE))","v":"Gobernanza e influencia local, regional e internacional"},{"$f":"IF(ISERROR(VLOOKUP(K52,Eje_Pilar_Prop!$C$2:$E$104,3,FALSE)),\" \",VLOOKUP(K52,Eje_Pilar_Prop!$C$2:$E$104,3,FALSE))","v":"Eje Transversal 4 Gobierno Legitimo, Fortalecimiento Local y Eficiencia"},1395,1026580236,"Laura Esther Nieto Romero",15452000,null,null,0,null,15452000,15451999,"2020-03-11","2020-03-12","2020-07-11",120,null,null,null,null,null,null,null,null,null,"X",0.99999993528345843,{"$f":"IF(SUMPRODUCT((A$14:A52=A52)*(B$14:B52=B52)*(D$14:D52=D52))>1,0,1)","v":1},"Contratos de prestación de servicios profesionales y de apoyo a la gestión","Contratación directa",{"$f":"IF(ISBLANK(G52),1,IFERROR(VLOOKUP(G52,Tipo!$C$12:$C$27,1,FALSE),\"NO\"))","v":"Prestación de servicios profesionales y de apoyo a la gestión, o para la ejecución de trabajos artísticos que sólo puedan encomendarse a determinadas personas naturales;"},"Inversión",{"$f":"IF(ISBLANK(K52),1,IFERROR(VLOOKUP(K52,Eje_Pilar_Prop!C34:C135,1,FALSE),\"NO\"))","v":45},"SECOP II",1,"Bogotá Mejor para Todos"]
[41,2020,"SECOP II","FDLC-CPS-041-2020","Contratos de prestación de servicios profesionales y de apoyo a la gestión","Contratación directa","Prestación de servicios profesionales y de apoyo a la gestión, o para la ejecución de trabajos artísticos que sólo puedan encomendarse a determinadas personas naturales;","PRESTAR SUS SERVICIOS PARA APOYAR EN LAS TAREAS OPERATIVAS DE CARÁCTER ARCHIVÍSTICO DESARROLLADAS EN LA ALCALDÍA LOCAL PARA GARANTIZAR LA APLICACIÓN CORRECTA DE LOS PROCEDIMIENTOS TÉCNICOS","Inversión","Bogotá Mejor para Todos",45,{"$f":"IF(ISERROR(VLOOKUP(K53,Eje_Pilar_Prop!$C$2:$E$104,2,FALSE)),\" \",VLOOKUP(K53,Eje_Pilar_Prop!$C$2:$E$104,2,FALSE))","v":"Gobernanza e influencia local, regional e internacional"},{"$f":"IF(ISERROR(VLOOKUP(K53,Eje_Pilar_Prop!$C$2:$E$104,3,FALSE)),\" \",VLOOKUP(K53,Eje_Pilar_Prop!$C$2:$E$104,3,FALSE))","v":"Eje Transversal 4 Gobierno Legitimo, Fortalecimiento Local y Eficiencia"},1395,1010175770,"TEOFILO LEONARDO RAMIREZ HERNANDEZ",12600000,null,null,0,null,12600000,12555000,"2020-03-11","2020-03-11","2020-07-10",120,null,null,null,null,null,null,null,null,null,"X",0.99642857142857144,{"$f":"IF(SUMPRODUCT((A$14:A53=A53)*(B$14:B53=B53)*(D$14:D53=D53))>1,0,1)","v":1},"Contratos de prestación de servicios profesionales y de apoyo a la gestión","Contratación directa",{"$f":"IF(ISBLANK(G53),1,IFERROR(VLOOKUP(G53,Tipo!$C$12:$C$27,1,FALSE),\"NO\"))","v":"Prestación de servicios profesionales y de apoyo a la gestión, o para la ejecución de trabajos artísticos que sólo puedan encomendarse a determinadas personas naturales;"},"Inversión",{"$f":"IF(ISBLANK(K53),1,IFERROR(VLOOKUP(K53,Eje_Pilar_Prop!C35:C136,1,FALSE),\"NO\"))","v":45},"SECOP II",1,"Bogotá Mejor para Todos"]
[42,2020,"SECOP II","FDLC-CPS-042-2020","Contratos de prestación de servicios profesionales y de apoyo a la gestión","Contratación directa","Prestación de servicios profesionales y de apoyo a la gestión, o para la ejecución de trabajos artísticos que sólo puedan encomendarse a determinadas personas naturales;","PRESTACIÓN DE SERVICIOS PROFESIONALES AL FONDO DE DESARROLLO LOCAL DE LA CANDELARIA, EN LOS TRÁMITES RELACIONADOS CON LOS PROCESOS PRECONTRACTUALES, CONTRACTUALES Y POS CONTRACTUALES Y EN LAS DEMÁS ACTIVIDADES QUE ALLÍ SE REQUIERAN, DE CONFORMIDAD CON LOS ESTUDIOS PREVIOS","Inversión","Bogotá Mejor para Todos",45,{"$f":"IF(ISERROR(VLOOKUP(K54,Eje_Pilar_Prop!$C$2:$E$104,2,FALSE)),\" \",VLOOKUP(K54,Eje_Pilar_Prop!$C$2:$E$104,2,FALSE))","v":"Gobernanza e influencia local, regional e internacional"},{"$f":"IF(ISERROR(VLOOKUP(K54,Eje_Pilar_Prop!$C$2:$E$104,3,FALSE)),\" \",VLOOKUP(K54,Eje_Pilar_Prop!$C$2:$E$104,3,FALSE))","v":"Eje Transversal 4 Gobierno Legitimo, Fortalecimiento Local y Eficiencia"},1395,1032363826,"PAOLA ANDREA PADILLA AYARZA",16000000,null,null,0,null,16000000,16000000,"2020-03-11","2020-03-12","2020-07-11",120,null,null,null,null,null,null,null,null,null,"X",1,{"$f":"IF(SUMPRODUCT((A$14:A54=A54)*(B$14:B54=B54)*(D$14:D54=D54))>1,0,1)","v":1},"Contratos de prestación de servicios profesionales y de apoyo a la gestión","Contratación directa",{"$f":"IF(ISBLANK(G54),1,IFERROR(VLOOKUP(G54,Tipo!$C$12:$C$27,1,FALSE),\"NO\"))","v":"Prestación de servicios profesionales y de apoyo a la gestión, o para la ejecución de trabajos artísticos que sólo puedan encomendarse a determinadas personas naturales;"},"Inversión",{"$f":"IF(ISBLANK(K54),1,IFERROR(VLOOKUP(K54,Eje_Pilar_Prop!C36:C137,1,FALSE),\"NO\"))","v":45},"SECOP II",1,"Bogotá Mejor para Todos"]
[43,2020,"SECOP II","FDLC-CPS-043-2020","Contratos de prestación de servicios profesionales y de apoyo a la gestión","Contratación directa","Prestación de servicios profesionales y de apoyo a la gestión, o para la ejecución de trabajos artísticos que sólo puedan encomendarse a determinadas personas naturales;","PRESTACIÓN DE SERVICIOS PROFESIONALES PARA FORTALECER LA ETAPA CONTRACTUAL Y POSCONTRACTUAL DE LOS CONTRATOS CELEBRADOS POR EL FONDO DE DESARROLLO LOCAL DE LA CANDELARIA, APOYANDO SU SUPERVISIÓN Y LIQUIDACIÓN DE ACUERDO CON LOS PROCEDIMIENTOS ESTABLECIDOS EN LA NORMATIVIDAD VIGENTE.","Inversión","Bogotá Mejor para Todos",45,{"$f":"IF(ISERROR(VLOOKUP(K55,Eje_Pilar_Prop!$C$2:$E$104,2,FALSE)),\" \",VLOOKUP(K55,Eje_Pilar_Prop!$C$2:$E$104,2,FALSE))","v":"Gobernanza e influencia local, regional e internacional"},{"$f":"IF(ISERROR(VLOOKUP(K55,Eje_Pilar_Prop!$C$2:$E$104,3,FALSE)),\" \",VLOOKUP(K55,Eje_Pilar_Prop!$C$2:$E$104,3,FALSE))","v":"Eje Transversal 4 Gobierno Legitimo, Fortalecimiento Local y Eficiencia"},1395,92512746,"REINALDO DE JESUS FUNEZ RIVERA",16000000,null,null,0,0,16000000,15733333,"2020-03-16","2020-04-03","2020-08-02",120,null,null,null,null,null,null,null,null,null,"X",0.9833333125,{"$f":"IF(SUMPRODUCT((A$14:A55=A55)*(B$14:B55=B55)*(D$14:D55=D55))>1,0,1)","v":1},"Contratos de prestación de servicios profesionales y de apoyo a la gestión","Contratación directa",{"$f":"IF(ISBLANK(G55),1,IFERROR(VLOOKUP(G55,Tipo!$C$12:$C$27,1,FALSE),\"NO\"))","v":"Prestación de servicios profesionales y de apoyo a la gestión, o para la ejecución de trabajos artísticos que sólo puedan encomendarse a determinadas personas naturales;"},"Inversión",{"$f":"IF(ISBLANK(K55),1,IFERROR(VLOOKUP(K55,Eje_Pilar_Prop!C37:C138,1,FALSE),\"NO\"))","v":45},"SECOP II",1,"Bogotá Mejor para Todos"]
[44,2020,"SECOP II","FDLC-CIA-044-2020","Contratos interadministrativos","Contratación directa","Contratos interadministrativos","REALIZAR ACCIONES DE MANTENIMIENTO, REHABILITACIÓN Y EMBELLECIMIENTO DE ÁREAS VERDES, PUNTOS CRÍTICOS, Y DE ACUMULACIÓN EN LA LOCALIDAD DE LA CANDELARIA","Inversión","Bogotá Mejor para Todos",38,{"$f":"IF(ISERROR(VLOOKUP(K56,Eje_Pilar_Prop!$C$2:$E$104,2,FALSE)),\" \",VLOOKUP(K56,Eje_Pilar_Prop!$C$2:$E$104,2,FALSE))","v":"Recuperación y manejo de la Estructura Ecológica Principal"},{"$f":"IF(ISERROR(VLOOKUP(K56,Eje_Pilar_Prop!$C$2:$E$104,3,FALSE)),\" \",VLOOKUP(K56,Eje_Pilar_Prop!$C$2:$E$104,3,FALSE))","v":"Eje Transversal 3 Sostenibilidad Ambiental basada en la eficiencia energética"},1393,830128286,"AGUAS DE BOGOTA S.A. E.S.P.","172.051.096",null,null,0,0,172051096,0,"2020-03-17","2020-07-21","2020-11-20",120,null,null,null,null,null,null,"X",null,null,null,0,{"$f":"IF(SUMPRODUCT((A$14:A56=A56)*(B$14:B56=B56)*(D$14:D56=D56))>1,0,1)","v":1},"Contratos interadministrativos","Contratación directa",{"$f":"IF(ISBLANK(G56),1,IFERROR(VLOOKUP(G56,Tipo!$C$12:$C$27,1,FALSE),\"NO\"))","v":"Contratos interadministrativos"},"Inversión",{"$f":"IF(ISBLANK(K56),1,IFERROR(VLOOKUP(K56,Eje_Pilar_Prop!C38:C139,1,FALSE),\"NO\"))","v":38},"SECOP II",1,"Bogotá Mejor para Todos"]
[45,2020,"SECOP II","FDLC-CPS-045-2020","Contratos de prestación de servicios profesionales y de apoyo a la gestión","Contratación directa","Prestación de servicios profesionales y de apoyo a la gestión, o para la ejecución de trabajos artísticos que sólo puedan encomendarse a determinadas personas naturales;","PRESTAR SUS SERVICIOS PARA APOYAR EN LAS TAREAS OPERATIVAS DE CARÁCTER ARCHIVÍSTICO DESARROLLADAS EN LA ALCALDÍA LOCAL PARA GARANTIZAR LA APLICACIÓN CORRECTA DE LOS PROCEDIMIENTOS TÉCNICOS","Inversión","Bogotá Mejor para Todos",45,{"$f":"IF(ISERROR(VLOOKUP(K57,Eje_Pilar_Prop!$C$2:$E$104,2,FALSE)),\" \",VLOOKUP(K57,Eje_Pilar_Prop!$C$2:$E$104,2,FALSE))","v":"Gobernanza e influencia local, regional e internacional"},{"$f":"IF(ISERROR(VLOOKUP(K57,Eje_Pilar_Prop!$C$2:$E$104,3,FALSE)),\" \",VLOOKUP(K57,Eje_Pilar_Prop!$C$2:$E$104,3,FALSE))","v":"Eje Transversal 4 Gobierno Legitimo, Fortalecimiento Local y Eficiencia"},1395,79984961,"JOHN TIMBERLAKE OSORIO",12600000,null,null,0,0,{"$f":"+Q57+S57+U57","v":12600000},12600000,"2020-03-11","2020-03-30","2020-07-29",120,null,null,null,null,null,null,null,null,null,"X",1,{"$f":"IF(SUMPRODUCT((A$14:A57=A57)*(B$14:B57=B57)*(D$14:D57=D57))>1,0,1)","v":1},"Contratos de prestación de servicios profesionales y de apoyo a la gestión","Contratación directa",{"$f":"IF(ISBLANK(G57),1,IFERROR(VLOOKUP(G57,Tipo!$C$12:$C$27,1,FALSE),\"NO\"))","v":"Prestación de servicios profesionales y de apoyo a la gestión, o para la ejecución de trabajos artísticos que sólo puedan encomendarse a determinadas personas naturales;"},"Inversión",{"$f":"IF(ISBLANK(K57),1,IFERROR(VLOOKUP(K57,Eje_Pilar_Prop!C39:C140,1,FALSE),\"NO\"))","v":45},"SECOP II",1,"Bogotá Mejor para Todos"]
[47,2020,"SECOP II","FDLC-CPS-047-2020","Suministro","Contratación mínima cuantia","No aplica","SUMINISTRO DE BIENES Y SERVICIOS NECESARIOS PARA LA REALIZACIÓN DE UN EVENTO POR LA INTEGRACIÓN Y PARTICIPACIÓN DE LA COMUNIDAD LGTBI DE LA CANDELARIA Y FORMACIÓN EN PARTICIPACIÓN A TRAVÉS DE LAS TECNOLOGÍAS DE LA INFORMACIÓN Y LAS COMUNICACIONES \"CANDELARIA MÁS DIVERSA 2.0\" DIRIGIDO A POBLACIÓN LGBTI DE LA LOCALIDAD DE LA CANDELARIA.","Inversión","Bogotá Mejor para Todos",45,"Gobernanza e influencia local, regional e internacional",{"$f":"IF(ISERROR(VLOOKUP(K58,Eje_Pilar_Prop!$C$2:$E$104,3,FALSE)),\" \",VLOOKUP(K58,Eje_Pilar_Prop!$C$2:$E$104,3,FALSE))","v":"Eje Transversal 4 Gobierno Legitimo, Fortalecimiento Local y Eficiencia"},1396,9005217807,"B2 NETWORKS SAS",10334075,null,null,null,null,10334075,null,"2020-03-19",null,null,120,null,null,null,null,null,null,"X",null,null,null,0,{"$f":"IF(SUMPRODUCT((A$14:A78=A78)*(B$14:B78=B78)*(D$14:D78=D78))>1,0,1)","v":1}]
[48,2020,"SECOP II","FDLS-CPS-048-2020","Contratos de prestación de servicios profesionales y de apoyo a la gestión","Contratación directa","Prestación de servicios profesionales y de apoyo a la gestión, o para la ejecución de trabajos artísticos que sólo puedan encomendarse a determinadas personas naturales;","PRESTACIÓN DE SERVICIOS PROFESIONALES PARA APOYAR LA GESTIÓN DEL ÁREA DE PLANEACIÓN EN LA FORMULACION, PRESENTACIÓN, EVALUACION Y SEGUIMIENTO DE LOS PROYECTOS SOCIALES Y DE SALUD EN LA LOCALIDAD Y DE COMPETENCIA DEL FONDO DE DESARROLLO LOCAL LA CANDELARIA","Inversión","Bogotá Mejor para Todos",45,{"$f":"IF(ISERROR(VLOOKUP(K59,Eje_Pilar_Prop!$C$2:$E$104,2,FALSE)),\" \",VLOOKUP(K59,Eje_Pilar_Prop!$C$2:$E$104,2,FALSE))","v":"Gobernanza e influencia local, regional e internacional"},{"$f":"IF(ISERROR(VLOOKUP(K59,Eje_Pilar_Prop!$C$2:$E$104,3,FALSE)),\" \",VLOOKUP(K59,Eje_Pilar_Prop!$C$2:$E$104,3,FALSE))","v":"Eje Transversal 4 Gobierno Legitimo, Fortalecimiento Local y Eficiencia"},1395,52472048,"LISSETTE MARITZA RAMIREZ JARAMILLO",21067272,null,null,0,null,{"$f":"+Q59+S59+U59","v":21067272},21066641,"2020-03-30","2020-04-02","2020-08-01",120,null,null,51614136,"ANA MERCEDES VASQUEZ ","2020-06-23",5969060,null,null,null,"X",0.99997004832899106,{"$f":"IF(SUMPRODUCT((A$14:A59=A59)*(B$14:B59=B59)*(D$14:D59=D59))>1,0,1)","v":1},"Contratos de prestación de servicios profesionales y de apoyo a la gestión","Contratación directa",{"$f":"IF(ISBLANK(G59),1,IFERROR(VLOOKUP(G59,Tipo!$C$12:$C$27,1,FALSE),\"NO\"))","v":"Prestación de servicios profesionales y de apoyo a la gestión, o para la ejecución de trabajos artísticos que sólo puedan encomendarse a determinadas personas naturales;"},"Inversión",{"$f":"IF(ISBLANK(K59),1,IFERROR(VLOOKUP(K59,Eje_Pilar_Prop!C40:C141,1,FALSE),\"NO\"))","v":45},"SECOP II",1,"Bogotá Mejor para Todos"]
[49,2020,"SECOP I","ORDEN DE COMPRA 46537","Suministro","Selección abreviada","Acuerdo marco de precios ","SUMINISTRO INTEGRAL DEL SERVICIO DE ASEO Y CAFETERIA PARA LAS INSTALACIONES DE PROPIEDAD DEL FONDO DE DESARROLLO LOCAL DE LA CANDERIA","Funcionamiento","Bogotá Mejor para Todos","No aplica","No Aplica","No Aplica","No Aplica","901351411-8","Union Temporal ECOLIMPIEZA",194908451,null,null,0,null,194908451,127077884,"2020-03-25","2020-04-06","2021-03-05",330,null,null,null,null,null,null,null,"X",null,null,0.65198755286398535,{"$f":"IF(SUMPRODUCT((A$14:A60=A60)*(B$14:B60=B60)*(D$14:D60=D60))>1,0,1)","v":1},"Suministro","Selección abreviada",{"$f":"IF(ISBLANK(G60),1,IFERROR(VLOOKUP(G60,Tipo!$C$12:$C$27,1,FALSE),\"NO\"))","v":"Acuerdo marco de precios "},"Funcionamiento",{"$f":"IF(ISBLANK(K60),1,IFERROR(VLOOKUP(K60,Eje_Pilar_Prop!C41:C142,1,FALSE),\"NO\"))","v":"NO"},"SECOP I",1,"Bogotá Mejor para Todos"]
[50,2020,"SECOP II","FDLC-CPS-050-2020","Contratos de prestación de servicios profesionales y de apoyo a la gestión","Contratación directa","Prestación de servicios profesionales y de apoyo a la gestión, o para la ejecución de trabajos artísticos que sólo puedan encomendarse a determinadas personas naturales;","PRESTAR SERVICIOS PROFESIONALES AL AREA DEGESTION DE DESARROLLO LOCAL OFICINA DE PLANEACION, EN LA FORMULACIÓN, PRESENTACIÓN,EVALUACIÓN Y SEGUIMIENTO DE LOS PROYECTOS DE INFRAESTRUCTURA Y OBRAS CIVILES QUE DESARROLLE LA ENTIDAD, Y APOYO EN LOS REQUERMIENTOS DE INFRAESTRUCTURA CIVIL QUE TENGA ELFONDO DE DESARROLLO LOCAL LA CANDELARIA","Inversión","Bogotá Mejor para Todos",18,{"$f":"IF(ISERROR(VLOOKUP(K61,Eje_Pilar_Prop!$C$2:$E$104,2,FALSE)),\" \",VLOOKUP(K61,Eje_Pilar_Prop!$C$2:$E$104,2,FALSE))","v":"Mejor movilidad para todos"},{"$f":"IF(ISERROR(VLOOKUP(K61,Eje_Pilar_Prop!$C$2:$E$104,3,FALSE)),\" \",VLOOKUP(K61,Eje_Pilar_Prop!$C$2:$E$104,3,FALSE))","v":"Pilar 2 Democracía Urbana"},1391,1090435721,"JORGE ENRIQUE ABREO REYES",17907180,null,null,0,null,{"$f":"+Q61+S61+U61","v":17907180},17907180,"2020-03-31","2020-03-31","2020-07-30",120,null,null,null,null,null,null,null,null,null,"X",1,{"$f":"IF(SUMPRODUCT((A$14:A61=A61)*(B$14:B61=B61)*(D$14:D61=D61))>1,0,1)","v":1},"Contratos de prestación de servicios profesionales y de apoyo a la gestión","Contratación directa",{"$f":"IF(ISBLANK(G61),1,IFERROR(VLOOKUP(G61,Tipo!$C$12:$C$27,1,FALSE),\"NO\"))","v":"Prestación de servicios profesionales y de apoyo a la gestión, o para la ejecución de trabajos artísticos que sólo puedan encomendarse a determinadas personas naturales;"},"Inversión",{"$f":"IF(ISBLANK(K61),1,IFERROR(VLOOKUP(K61,Eje_Pilar_Prop!C42:C143,1,FALSE),\"NO\"))","v":"NO"},"SECOP II",1,"Bogotá Mejor para Todos"]
[51,2020,"SECOP II","CONTRATO DE SUMINISTRO No.051-2020","Contratos de prestación de servicios","Contratación directa","Urgencia manifiesta","REALIZAR ACCIONES DE ATENCIÓN HUMANITARIA A PERSONAS AFECTADAS POR EL ESTADO CALAMIDAD SANITARIA, ASÍ COMO EL SUMINISTRO DE BIENES Y SERVICIOS NECESARIOS PARA LA PRESERVACIÓN DE LA VIDA Y MITIGACIÓN DEL RIESGO ORIGINADO EN LA CRISIS PROVOCADA POR LA PANDEMIA DEL NUEVO CORONAVIRUS (COVID-19)","Inversión","Bogotá Mejor para Todos",3,{"$f":"IF(ISERROR(VLOOKUP(K62,Eje_Pilar_Prop!$C$2:$E$104,2,FALSE)),\" \",VLOOKUP(K62,Eje_Pilar_Prop!$C$2:$E$104,2,FALSE))","v":"Igualdad y autonomía para una Bogotá incluyente"},{"$f":"IF(ISERROR(VLOOKUP(K62,Eje_Pilar_Prop!$C$2:$E$104,3,FALSE)),\" \",VLOOKUP(K62,Eje_Pilar_Prop!$C$2:$E$104,3,FALSE))","v":"Pilar 1 Igualdad de Calidad de Vida"},1386,"860070301-1","CRUZ ROJA BOGOTA SECCIONAL CUNDINAMRACA Y BOGOTA","190.240.000",null,null,0,null,190240000,171216000,"2020-04-01","2020-04-06","2020-05-05",30,null,null,null,null,null,null,null,null,"X",null,0.9,{"$f":"IF(SUMPRODUCT((A$14:A62=A62)*(B$14:B62=B62)*(D$14:D62=D62))>1,0,1)","v":1},"Contratos de prestación de servicios","Contratación directa",{"$f":"IF(ISBLANK(G62),1,IFERROR(VLOOKUP(G62,Tipo!$C$12:$C$27,1,FALSE),\"NO\"))","v":"Urgencia manifiesta"},"Inversión",{"$f":"IF(ISBLANK(K62),1,IFERROR(VLOOKUP(K62,Eje_Pilar_Prop!C43:C144,1,FALSE),\"NO\"))","v":"NO"},"SECOP II",1,"Bogotá Mejor para Todos"]
[52,2020,"SECOP II","FDLC-CPS-052-2020","Contratos de prestación de servicios profesionales y de apoyo a la gestión","Contratación directa","Prestación de servicios profesionales y de apoyo a la gestión, o para la ejecución de trabajos artísticos que sólo puedan encomendarse a determinadas personas naturales;","PRESTACIÓN DE SERVICIOS PROFESIONALES PARA APOYAR Y FORTALECER LA OFICINA DE PLANEACION DEL FONDO DE DESARROLLO LOCAL EN LAS GESTIONES FINANCIERAS DE LA ENTIDAD","Inversión","Bogotá Mejor para Todos",45,{"$f":"IF(ISERROR(VLOOKUP(K63,Eje_Pilar_Prop!$C$2:$E$104,2,FALSE)),\" \",VLOOKUP(K63,Eje_Pilar_Prop!$C$2:$E$104,2,FALSE))","v":"Gobernanza e influencia local, regional e internacional"},{"$f":"IF(ISERROR(VLOOKUP(K63,Eje_Pilar_Prop!$C$2:$E$104,3,FALSE)),\" \",VLOOKUP(K63,Eje_Pilar_Prop!$C$2:$E$104,3,FALSE))","v":"Eje Transversal 4 Gobierno Legitimo, Fortalecimiento Local y Eficiencia"},1395,52520044,"PAOLA ANDREA OYUELA VARGAS",16000000,null,null,0,null,16000000,16000000,"2020-04-02","2020-04-03","2020-08-02",120,null,null,null,null,null,null,null,null,null,"X",1,{"$f":"IF(SUMPRODUCT((A$14:A63=A63)*(B$14:B63=B63)*(D$14:D63=D63))>1,0,1)","v":1},"Contratos de prestación de servicios profesionales y de apoyo a la gestión","Contratación directa",{"$f":"IF(ISBLANK(G63),1,IFERROR(VLOOKUP(G63,Tipo!$C$12:$C$27,1,FALSE),\"NO\"))","v":"Prestación de servicios profesionales y de apoyo a la gestión, o para la ejecución de trabajos artísticos que sólo puedan encomendarse a determinadas personas naturales;"},"Inversión",{"$f":"IF(ISBLANK(K63),1,IFERROR(VLOOKUP(K63,Eje_Pilar_Prop!C44:C145,1,FALSE),\"NO\"))","v":45},"SECOP II",1,"Bogotá Mejor para Todos"]
[53,2020,"SECOP II","FDLC-CPS-053-2020","Contratos de prestación de servicios profesionales y de apoyo a la gestión","Contratación directa","Prestación de servicios profesionales y de apoyo a la gestión, o para la ejecución de trabajos artísticos que sólo puedan encomendarse a determinadas personas naturales;","PRESTACIÓN DE SERVICIOS PROFESIONALES PARA APOYAR LA GESTIÓN DEL ÁREA DE DESARROLLO LOCAL EN LA FORMULACION, PRESENTACIÓN, EVALUACION Y SEGUIMIENTO DE LOS PROYECTOS DE GESTION ARTISTICA Y CULTURAL DE LOS TERRITORIOS Y APOYAR EN GENERAL TODOS LOS PROCESOS DE GESTIONES CULTURALES EN LA LOCALIDAD Y DE COMPETENCIA DEL FONDO DE DESARROLLO LOCAL LA CANDELARIA","Inversión","Bogotá Mejor para Todos",45,{"$f":"IF(ISERROR(VLOOKUP(K64,Eje_Pilar_Prop!$C$2:$E$104,2,FALSE)),\" \",VLOOKUP(K64,Eje_Pilar_Prop!$C$2:$E$104,2,FALSE))","v":"Gobernanza e influencia local, regional e internacional"},{"$f":"IF(ISERROR(VLOOKUP(K64,Eje_Pilar_Prop!$C$2:$E$104,3,FALSE)),\" \",VLOOKUP(K64,Eje_Pilar_Prop!$C$2:$E$104,3,FALSE))","v":"Eje Transversal 4 Gobierno Legitimo, Fortalecimiento Local y Eficiencia"},1395,1026557848,"LAURA ANDREA DAZA OCAMPO",17907180,null,null,0,null,17907180,7908975,"2020-04-03","2020-04-08","2020-08-07",120,null,null,null,null,null,null,null,null,"X",null,0.44166501928276813,{"$f":"IF(SUMPRODUCT((A$14:A64=A64)*(B$14:B64=B64)*(D$14:D64=D64))>1,0,1)","v":1},"Contratos de prestación de servicios profesionales y de apoyo a la gestión","Contratación directa",{"$f":"IF(ISBLANK(G64),1,IFERROR(VLOOKUP(G64,Tipo!$C$12:$C$27,1,FALSE),\"NO\"))","v":"Prestación de servicios profesionales y de apoyo a la gestión, o para la ejecución de trabajos artísticos que sólo puedan encomendarse a determinadas personas naturales;"},"Inversión",{"$f":"IF(ISBLANK(K64),1,IFERROR(VLOOKUP(K64,Eje_Pilar_Prop!C45:C146,1,FALSE),\"NO\"))","v":45},"SECOP II",1,"Bogotá Mejor para Todos"]
[55,2020,"SECOP II","FDLC-CPS-055-2020","Contratos de prestación de servicios profesionales y de apoyo a la gestión","Contratación directa","Prestación de servicios profesionales y de apoyo a la gestión, o para la ejecución de trabajos artísticos que sólo puedan encomendarse a determinadas personas naturales;","PRESTAR SERVICIOS PROFESIONALES AL AREA DEGESTION DE DESARROLLO LOCAL OFICINA DE PLANEACION, EN LA FORMULACIÓN, PRESENTACIÓN,EVALUACIÓN Y SEGUIMIENTO DE LOS PROYECTOS DE INFRAESTRUCTURA Y OBRAS CIVILES QUE DESARROLLE LA ENTIDAD, Y APOYO EN LOS REQUERMIENTOS DE INFRAESTRUCTURA CIVIL QUE TENGA ELFONDO DE DESARROLLO LOCAL LA CANDELARIA","Inversión","Bogotá Mejor para Todos",18,{"$f":"IF(ISERROR(VLOOKUP(K65,Eje_Pilar_Prop!$C$2:$E$104,2,FALSE)),\" \",VLOOKUP(K65,Eje_Pilar_Prop!$C$2:$E$104,2,FALSE))","v":"Mejor movilidad para todos"},{"$f":"IF(ISERROR(VLOOKUP(K65,Eje_Pilar_Prop!$C$2:$E$104,3,FALSE)),\" \",VLOOKUP(K65,Eje_Pilar_Prop!$C$2:$E$104,3,FALSE))","v":"Pilar 2 Democracía Urbana"},1391,80071944,"OLIVER BAEZ SANTIAGO",17907180,null,null,0,null,{"$f":"+Q65+S65+U65","v":17907180},17011821,"2020-04-06","2020-04-07","2020-08-06",120,null,null,null,null,null,null,null,null,"X",null,0.95,{"$f":"IF(SUMPRODUCT((A$14:A65=A65)*(B$14:B65=B65)*(D$14:D65=D65))>1,0,1)","v":1},"Contratos de prestación de servicios profesionales y de apoyo a la gestión","Contratación directa",{"$f":"IF(ISBLANK(G65),1,IFERROR(VLOOKUP(G65,Tipo!$C$12:$C$27,1,FALSE),\"NO\"))","v":"Prestación de servicios profesionales y de apoyo a la gestión, o para la ejecución de trabajos artísticos que sólo puedan encomendarse a determinadas personas naturales;"},"Inversión",{"$f":"IF(ISBLANK(K65),1,IFERROR(VLOOKUP(K65,Eje_Pilar_Prop!C46:C147,1,FALSE),\"NO\"))","v":"NO"},"SECOP II",1,"Bogotá Mejor para Todos"]
[56,2020,"SECOP II","FDLC-CPS-056-2020","Contratos de prestación de servicios profesionales y de apoyo a la gestión","Contratación directa","Prestación de servicios profesionales y de apoyo a la gestión, o para la ejecución de trabajos artísticos que sólo puedan encomendarse a determinadas personas naturales;","PRESTAR LOS SERVICIOS PROFESIONALES PARA LA OPERACIÓN, PRESTACIÓN, SEGUIMIENTO Y CUMPLIMIENTO DE LOS PROCEDIMIENTOS ADMINISTRATIVOS, OPERATIVOS Y PROGRAMÁTICOS DEL SERVICIO APOYO ECONÓMICO TIPO C, QUE CONTRIBUYAN A LA GARANTÍA DE LOS DERECHOS DE LA POBLACIÓN MAYOR EN EL MARCO DE LA POLÍTICA PÚBLICA SOCIAL PARA EL ENVEJECIMIENTO Y LA VEJEZ EN EL DISTRITO CAPITAL A CARGO DE LA ALCALDÍA LOCAL","Inversión","Bogotá Mejor para Todos",3,{"$f":"IF(ISERROR(VLOOKUP(K66,Eje_Pilar_Prop!$C$2:$E$104,2,FALSE)),\" \",VLOOKUP(K66,Eje_Pilar_Prop!$C$2:$E$104,2,FALSE))","v":"Igualdad y autonomía para una Bogotá incluyente"},{"$f":"IF(ISERROR(VLOOKUP(K66,Eje_Pilar_Prop!$C$2:$E$104,3,FALSE)),\" \",VLOOKUP(K66,Eje_Pilar_Prop!$C$2:$E$104,3,FALSE))","v":"Pilar 1 Igualdad de Calidad de Vida"},1386,52760226,"NUBIA CONSUELO CHAVARRO GALINDO","17.907.180",null,null,0,null,17907180,16116462,"2020-04-07","2020-04-13","2020-08-12",120,null,null,null,null,null,null,null,null,"X",null,0.9,{"$f":"IF(SUMPRODUCT((A$14:A66=A66)*(B$14:B66=B66)*(D$14:D66=D66))>1,0,1)","v":1},"Contratos de prestación de servicios profesionales y de apoyo a la gestión","Contratación directa",{"$f":"IF(ISBLANK(G66),1,IFERROR(VLOOKUP(G66,Tipo!$C$12:$C$27,1,FALSE),\"NO\"))","v":"Prestación de servicios profesionales y de apoyo a la gestión, o para la ejecución de trabajos artísticos que sólo puedan encomendarse a determinadas personas naturales;"},"Inversión",{"$f":"IF(ISBLANK(K66),1,IFERROR(VLOOKUP(K66,Eje_Pilar_Prop!C47:C148,1,FALSE),\"NO\"))","v":"NO"},"SECOP II",1,"Bogotá Mejor para Todos"]
[57,2020,"SECOP II","FDLC-CPS-057-2020","Contratos de prestación de servicios profesionales y de apoyo a la gestión","Contratación directa","Prestación de servicios profesionales y de apoyo a la gestión, o para la ejecución de trabajos artísticos que sólo puedan encomendarse a determinadas personas naturales;","PRESTACIÓN DE SERVICIOS PROFESIONALES PARA APOYAR AL EQUIPO DE PRENSA Y COMUNICACIONES DE LA ALCALDÍA LOCAL EN LA REALIZACIÓN DE PRODUCTOS Y PIEZAS DIGITALES, IMPRESAS Y PUBLICITARIAS DE GRAN FORMATO Y DE ANIMACIÓN GRÁFICA, ASÍ COMO APOYAR LA PRODUCCIÓN Y MONTAJE DE EVENTOS","Inversión","Bogotá Mejor para Todos",45,{"$f":"IF(ISERROR(VLOOKUP(K67,Eje_Pilar_Prop!$C$2:$E$104,2,FALSE)),\" \",VLOOKUP(K67,Eje_Pilar_Prop!$C$2:$E$104,2,FALSE))","v":"Gobernanza e influencia local, regional e internacional"},{"$f":"IF(ISERROR(VLOOKUP(K67,Eje_Pilar_Prop!$C$2:$E$104,3,FALSE)),\" \",VLOOKUP(K67,Eje_Pilar_Prop!$C$2:$E$104,3,FALSE))","v":"Eje Transversal 4 Gobierno Legitimo, Fortalecimiento Local y Eficiencia"},1395,"80139300\n80258118","WILSON ALFONSO NEIRA SALGADO CEDIDO",16800000,null,null,0,null,{"$f":"+Q67+S67+U67","v":16800000},15120000,"2020-04-07","2020-04-14","2020-08-13",120,null,null,80258118,"IVAN DAVID PINTO GONZALEZ","2020-07-17",3780000,null,null,"X",null,0.9,{"$f":"IF(SUMPRODUCT((A$14:A67=A67)*(B$14:B67=B67)*(D$14:D67=D67))>1,0,1)","v":1},"Contratos de prestación de servicios profesionales y de apoyo a la gestión","Contratación directa",{"$f":"IF(ISBLANK(G67),1,IFERROR(VLOOKUP(G67,Tipo!$C$12:$C$27,1,FALSE),\"NO\"))","v":"Prestación de servicios profesionales y de apoyo a la gestión, o para la ejecución de trabajos artísticos que sólo puedan encomendarse a determinadas personas naturales;"},"Inversión",{"$f":"IF(ISBLANK(K67),1,IFERROR(VLOOKUP(K67,Eje_Pilar_Prop!C48:C149,1,FALSE),\"NO\"))","v":"NO"},"SECOP II",1,"Bogotá Mejor para Todos"]
[58,2020,"SECOP II","FDLC-CPS-058-2020","Contratos de prestación de servicios profesionales y de apoyo a la gestión","Contratación directa","Prestación de servicios profesionales y de apoyo a la gestión, o para la ejecución de trabajos artísticos que sólo puedan encomendarse a determinadas personas naturales;"," PRESTACIÓN DE SERVICIOS TECNICOS DE APOYO EN LA VISIBILIZACION DE LA GESTIÓN TURISTICA Y CULTURAL DE LA CANDELARIA EN EL MARCO DE LA DECLARATORIA COMO AREA TURISTICA SOSTENIBLE","Inversión","Bogotá Mejor para Todos",11,{"$f":"IF(ISERROR(VLOOKUP(K68,Eje_Pilar_Prop!$C$2:$E$104,2,FALSE)),\" \",VLOOKUP(K68,Eje_Pilar_Prop!$C$2:$E$104,2,FALSE))","v":"Mejores oportunidades para el desarrollo a través de la cultura, la recreación y el deporte"},{"$f":"IF(ISERROR(VLOOKUP(K68,Eje_Pilar_Prop!$C$2:$E$104,3,FALSE)),\" \",VLOOKUP(K68,Eje_Pilar_Prop!$C$2:$E$104,3,FALSE))","v":"Pilar 1 Igualdad de Calidad de Vida"},1389,80249660,"JHONNATAN ACOSTA HERRADA",11600000,null,null,0,0,11600000,11600000,"2020-04-07","2020-04-13","2020-08-12",120,null,null,null,null,null,null,null,null,null,"X",1,{"$f":"IF(SUMPRODUCT((A$14:A68=A68)*(B$14:B68=B68)*(D$14:D68=D68))>1,0,1)","v":1},"Contratos de prestación de servicios profesionales y de apoyo a la gestión","Contratación directa",{"$f":"IF(ISBLANK(G68),1,IFERROR(VLOOKUP(G68,Tipo!$C$12:$C$27,1,FALSE),\"NO\"))","v":"Prestación de servicios profesionales y de apoyo a la gestión, o para la ejecución de trabajos artísticos que sólo puedan encomendarse a determinadas personas naturales;"},"Inversión",{"$f":"IF(ISBLANK(K68),1,IFERROR(VLOOKUP(K68,Eje_Pilar_Prop!C48:C150,1,FALSE),\"NO\"))","v":"NO"},"SECOP II",1,"Bogotá Mejor para Todos"]
[59,2020,"SECOP II","FDLCP-CPS-059-2020","Contratos de prestación de servicios profesionales y de apoyo a la gestión","Contratación directa","Prestación de servicios profesionales y de apoyo a la gestión, o para la ejecución de trabajos artísticos que sólo puedan encomendarse a determinadas personas naturales;","PRESTAR LOS SERVICIOS ADMINISTRATIVOS Y ASISTENCIALES AL ÁREA DE GESTIÓN POLICIVA DE LA ALCALDÍA LOCAL DE LA CANDELARIA EN LOS TEMAS DE COMPETENCIA DE LA OFICINA DE DESCONGESTIÓN OBRAS","Inversión","Bogotá Mejor para Todos",45,{"$f":"IF(ISERROR(VLOOKUP(K69,Eje_Pilar_Prop!$C$2:$E$104,2,FALSE)),\" \",VLOOKUP(K69,Eje_Pilar_Prop!$C$2:$E$104,2,FALSE))","v":"Gobernanza e influencia local, regional e internacional"},{"$f":"IF(ISERROR(VLOOKUP(K69,Eje_Pilar_Prop!$C$2:$E$104,3,FALSE)),\" \",VLOOKUP(K69,Eje_Pilar_Prop!$C$2:$E$104,3,FALSE))","v":"Eje Transversal 4 Gobierno Legitimo, Fortalecimiento Local y Eficiencia"},1395,79907754,"JUAN ANGEL LOPEZ ARDILA",7020000,null,null,0,null,{"$f":"+Q69+S69+U69","v":7020000},7020000,"2020-04-08","2020-04-13","2020-08-12",120,null,null,null,null,null,null,null,null,null,"X",1,{"$f":"IF(SUMPRODUCT((A$14:A69=A69)*(B$14:B69=B69)*(D$14:D69=D69))>1,0,1)","v":1},"Contratos de prestación de servicios profesionales y de apoyo a la gestión","Contratación directa",{"$f":"IF(ISBLANK(G69),1,IFERROR(VLOOKUP(G69,Tipo!$C$12:$C$27,1,FALSE),\"NO\"))","v":"Prestación de servicios profesionales y de apoyo a la gestión, o para la ejecución de trabajos artísticos que sólo puedan encomendarse a determinadas personas naturales;"},"Inversión",{"$f":"IF(ISBLANK(K69),1,IFERROR(VLOOKUP(K69,Eje_Pilar_Prop!C48:C151,1,FALSE),\"NO\"))","v":"NO"},"SECOP II",1,"Bogotá Mejor para Todos"]
[60,2020,"SECOP II","FDLC-CPS-060-2020","Contratos de prestación de servicios profesionales y de apoyo a la gestión","Contratación directa","Prestación de servicios profesionales y de apoyo a la gestión, o para la ejecución de trabajos artísticos que sólo puedan encomendarse a determinadas personas naturales;","PRESTACION DE SERVICIOS PARA LIDERAR Y GARANTIZAR LA IMPLEMENTACIÓN Y SEGUIMIENTO DE LOS PROCESOS Y PROCEDIMIENTOS DEL SERVICIO SOCIAL","Inversión","Bogotá Mejor para Todos",3,{"$f":"IF(ISERROR(VLOOKUP(K70,Eje_Pilar_Prop!$C$2:$E$104,2,FALSE)),\" \",VLOOKUP(K70,Eje_Pilar_Prop!$C$2:$E$104,2,FALSE))","v":"Igualdad y autonomía para una Bogotá incluyente"},{"$f":"IF(ISERROR(VLOOKUP(K70,Eje_Pilar_Prop!$C$2:$E$104,3,FALSE)),\" \",VLOOKUP(K70,Eje_Pilar_Prop!$C$2:$E$104,3,FALSE))","v":"Pilar 1 Igualdad de Calidad de Vida"},1386,1121834435,"JUANITA DIAZ VILLALOBOS",17907180,null,null,0,null,17907180,15967235,"2020-04-08","2020-04-14","2020-08-13",120,null,null,null,null,null,null,null,null,"X",null,0.8916666387449057,{"$f":"IF(SUMPRODUCT((A$14:A70=A70)*(B$14:B70=B70)*(D$14:D70=D70))>1,0,1)","v":1},"Contratos de prestación de servicios profesionales y de apoyo a la gestión","Contratación directa",{"$f":"IF(ISBLANK(G70),1,IFERROR(VLOOKUP(G70,Tipo!$C$12:$C$27,1,FALSE),\"NO\"))","v":"Prestación de servicios profesionales y de apoyo a la gestión, o para la ejecución de trabajos artísticos que sólo puedan encomendarse a determinadas personas naturales;"},"Inversión",{"$f":"IF(ISBLANK(K70),1,IFERROR(VLOOKUP(K70,Eje_Pilar_Prop!C48:C152,1,FALSE),\"NO\"))","v":"NO"},"SECOP II",1,"Bogotá Mejor para Todos"]
[61,2020,"SECOP II","FDLC-CPS-061-2020","Contratos de prestación de servicios profesionales y de apoyo a la gestión","Contratación directa","Prestación de servicios profesionales y de apoyo a la gestión, o para la ejecución de trabajos artísticos que sólo puedan encomendarse a determinadas personas naturales;","PRESTAR SERVICIOS PROFESIONALES AL FONDO DE DESARROLLO LOCAL LA CANDELARIA, PARA FORTALECER Y PROMOVER ESTRATEGIAS DE IMPLEMENTACION, APLICACION Y CAPACITACION A LA COMUNIDAD Y DIFERENTES SECTORES, EN MATERIA DE NORMATIVIDAD REFERENTE AL ESTATUTO DEL CONSUMIDOR LEY 1480 DE 2011","Inversión","Bogotá Mejor para Todos",45,{"$f":"IF(ISERROR(VLOOKUP(K71,Eje_Pilar_Prop!$C$2:$E$104,2,FALSE)),\" \",VLOOKUP(K71,Eje_Pilar_Prop!$C$2:$E$104,2,FALSE))","v":"Gobernanza e influencia local, regional e internacional"},{"$f":"IF(ISERROR(VLOOKUP(K71,Eje_Pilar_Prop!$C$2:$E$104,3,FALSE)),\" \",VLOOKUP(K71,Eje_Pilar_Prop!$C$2:$E$104,3,FALSE))","v":"Eje Transversal 4 Gobierno Legitimo, Fortalecimiento Local y Eficiencia"},1395,19222361,"FELIX ANTONIO NAMEN BELMONTE",16000000,null,null,0,null,16000000,16000000,"2020-04-08","2020-04-13","2020-08-12",120,null,null,null,null,null,null,null,null,null,"X",1,{"$f":"IF(SUMPRODUCT((A$14:A71=A71)*(B$14:B71=B71)*(D$14:D71=D71))>1,0,1)","v":1},"Contratos de prestación de servicios profesionales y de apoyo a la gestión","Contratación directa",{"$f":"IF(ISBLANK(G71),1,IFERROR(VLOOKUP(G71,Tipo!$C$12:$C$27,1,FALSE),\"NO\"))","v":"Prestación de servicios profesionales y de apoyo a la gestión, o para la ejecución de trabajos artísticos que sólo puedan encomendarse a determinadas personas naturales;"},"Inversión",{"$f":"IF(ISBLANK(K71),1,IFERROR(VLOOKUP(K71,Eje_Pilar_Prop!C48:C153,1,FALSE),\"NO\"))","v":"NO"},"SECOP II",1,"Bogotá Mejor para Todos"]
[62,2020,"SECOP II","FDLC-CPS-062-2020","Contratos de prestación de servicios profesionales y de apoyo a la gestión","Contratación directa","Prestación de servicios profesionales y de apoyo a la gestión, o para la ejecución de trabajos artísticos que sólo puedan encomendarse a determinadas personas naturales;","APOYAR ADMINISTRATIVA Y ASISTENCIALMENTE A LAS INSPECCIONES DE POLICÍA DE LA LOCALIDAD","Inversión","Bogotá Mejor para Todos",45,{"$f":"IF(ISERROR(VLOOKUP(K72,Eje_Pilar_Prop!$C$2:$E$104,2,FALSE)),\" \",VLOOKUP(K72,Eje_Pilar_Prop!$C$2:$E$104,2,FALSE))","v":"Gobernanza e influencia local, regional e internacional"},{"$f":"IF(ISERROR(VLOOKUP(K72,Eje_Pilar_Prop!$C$2:$E$104,3,FALSE)),\" \",VLOOKUP(K72,Eje_Pilar_Prop!$C$2:$E$104,3,FALSE))","v":"Eje Transversal 4 Gobierno Legitimo, Fortalecimiento Local y Eficiencia"},1395,51838961,"María Adelaida Luna Buenaventura",7020000,null,null,0,null,7020000,7020000,"2020-04-08","2020-04-14","2020-08-13",120,null,null,null,null,null,null,null,null,null,"X",1,{"$f":"IF(SUMPRODUCT((A$14:A72=A72)*(B$14:B72=B72)*(D$14:D72=D72))>1,0,1)","v":1},"Contratos de prestación de servicios profesionales y de apoyo a la gestión","Contratación directa",{"$f":"IF(ISBLANK(G72),1,IFERROR(VLOOKUP(G72,Tipo!$C$12:$C$27,1,FALSE),\"NO\"))","v":"Prestación de servicios profesionales y de apoyo a la gestión, o para la ejecución de trabajos artísticos que sólo puedan encomendarse a determinadas personas naturales;"},"Inversión",{"$f":"IF(ISBLANK(K72),1,IFERROR(VLOOKUP(K72,Eje_Pilar_Prop!C49:C154,1,FALSE),\"NO\"))","v":"NO"},"SECOP II",1,"Bogotá Mejor para Todos"]
[64,2020,"SECOP II","FDLC-CPS-064-2020","Contratos de prestación de servicios profesionales y de apoyo a la gestión","Contratación directa","Prestación de servicios profesionales y de apoyo a la gestión, o para la ejecución de trabajos artísticos que sólo puedan encomendarse a determinadas personas naturales;","PRESTACIÓN DE SERVICIOS PROFESIONALES PARA APOYAR AL EQUIPO DE PRENSA Y COMUNICACIONES DE LA ALCALDÍA LOCAL EN LA REALIZACIÓN Y PUBLICACIÓN DE CONTENIDOS DE REDES SOCIALES Y CANALES DE DIVULGACIÓN DIGITAL (SITIO WEB) DE LA ALCALDÍA LOCAL","Inversión","Bogotá Mejor para Todos",45,{"$f":"IF(ISERROR(VLOOKUP(K73,Eje_Pilar_Prop!$C$2:$E$104,2,FALSE)),\" \",VLOOKUP(K73,Eje_Pilar_Prop!$C$2:$E$104,2,FALSE))","v":"Gobernanza e influencia local, regional e internacional"},{"$f":"IF(ISERROR(VLOOKUP(K73,Eje_Pilar_Prop!$C$2:$E$104,3,FALSE)),\" \",VLOOKUP(K73,Eje_Pilar_Prop!$C$2:$E$104,3,FALSE))","v":"Eje Transversal 4 Gobierno Legitimo, Fortalecimiento Local y Eficiencia"},1395,1033731738,"NATALIA ANDREA RUBIANO FORERO",17907180,null,null,0,0,17907180,17907180,"2020-04-14","2020-04-14","2020-08-13",120,null,null,null,null,null,null,null,null,null,"X",1,{"$f":"IF(SUMPRODUCT((A$14:A73=A73)*(B$14:B73=B73)*(D$14:D73=D73))>1,0,1)","v":1},"Contratos de prestación de servicios profesionales y de apoyo a la gestión","Contratación directa",{"$f":"IF(ISBLANK(G73),1,IFERROR(VLOOKUP(G73,Tipo!$C$12:$C$27,1,FALSE),\"NO\"))","v":"Prestación de servicios profesionales y de apoyo a la gestión, o para la ejecución de trabajos artísticos que sólo puedan encomendarse a determinadas personas naturales;"},"Inversión",{"$f":"IF(ISBLANK(K73),1,IFERROR(VLOOKUP(K73,Eje_Pilar_Prop!C51:C156,1,FALSE),\"NO\"))","v":"NO"},"SECOP II",1,"Bogotá Mejor para Todos"]
[65,2020,"SECOP II","FDLC-CPS-065-2020","Contratos de prestación de servicios profesionales y de apoyo a la gestión","Contratación directa","Prestación de servicios profesionales y de apoyo a la gestión, o para la ejecución de trabajos artísticos que sólo puedan encomendarse a determinadas personas naturales;","PRESTAR SERVICIOS PROFESIONALES PARA APOYAR AL PROMOTOR DE SEGURIDAD  EN LA FORMUACIÓN, PRESENTACIÓN, EVALUACIÓN Y SEGUIMIENTO DE LOS PROYECTOS DE SEGURIDAD Y PARTICIPACION QUE SEAN LIDERADOS POR AL AREA DE  GESTION DE DESARROLLO DEL FONDO LOCAL DE LA CANDELARIA","Inversión","Bogotá Mejor para Todos",45,{"$f":"IF(ISERROR(VLOOKUP(K74,Eje_Pilar_Prop!$C$2:$E$104,2,FALSE)),\" \",VLOOKUP(K74,Eje_Pilar_Prop!$C$2:$E$104,2,FALSE))","v":"Gobernanza e influencia local, regional e internacional"},{"$f":"IF(ISERROR(VLOOKUP(K74,Eje_Pilar_Prop!$C$2:$E$104,3,FALSE)),\" \",VLOOKUP(K74,Eje_Pilar_Prop!$C$2:$E$104,3,FALSE))","v":"Eje Transversal 4 Gobierno Legitimo, Fortalecimiento Local y Eficiencia"},1395,80037360,"JOHN JAIRO GONZALEZ ARBOLEDA",15452000,null,null,0,null,15452000,13778033,"2020-04-14","2020-04-14","2020-08-13",120,null,null,null,null,null,null,null,null,"X",null,0.89166664509448612,{"$f":"IF(SUMPRODUCT((A$14:A74=A74)*(B$14:B74=B74)*(D$14:D74=D74))>1,0,1)","v":1},"Contratos de prestación de servicios profesionales y de apoyo a la gestión","Contratación directa",{"$f":"IF(ISBLANK(G74),1,IFERROR(VLOOKUP(G74,Tipo!$C$12:$C$27,1,FALSE),\"NO\"))","v":"Prestación de servicios profesionales y de apoyo a la gestión, o para la ejecución de trabajos artísticos que sólo puedan encomendarse a determinadas personas naturales;"},"Inversión",{"$f":"IF(ISBLANK(K74),1,IFERROR(VLOOKUP(K74,Eje_Pilar_Prop!C52:C157,1,FALSE),\"NO\"))","v":"NO"},"SECOP II",1,"Bogotá Mejor para Todos"]
[67,2020,"SECOP II","FDLC-CPS-067-2020","Contratos de prestación de servicios profesionales y de apoyo a la gestión","Contratación directa","Prestación de servicios profesionales y de apoyo a la gestión, o para la ejecución de trabajos artísticos que sólo puedan encomendarse a determinadas personas naturales;","PRESTACION DE SERVICIOS PROFESIONALES PARA APOYAR LA FORMULACION, EVALUACION, PRESENTACION Y SEGUIMIENTO, ESPECIALMENTE DE LOS PROYECTOS AMBIENTALES Y DOTACIÓN INSTITUCIONES EDUCATIVAS DISTRITALES, LIDERADOS POR EL AREA de GESTION DELDESARROLLO LOCAL LA CANDELARIA","Inversión","Bogotá Mejor para Todos",45,{"$f":"IF(ISERROR(VLOOKUP(K75,Eje_Pilar_Prop!$C$2:$E$104,2,FALSE)),\" \",VLOOKUP(K75,Eje_Pilar_Prop!$C$2:$E$104,2,FALSE))","v":"Gobernanza e influencia local, regional e internacional"},{"$f":"IF(ISERROR(VLOOKUP(K75,Eje_Pilar_Prop!$C$2:$E$104,3,FALSE)),\" \",VLOOKUP(K75,Eje_Pilar_Prop!$C$2:$E$104,3,FALSE))","v":"Eje Transversal 4 Gobierno Legitimo, Fortalecimiento Local y Eficiencia"},1395,1024509446,"Lizeth Nataly González Guaje",15452000,null,null,0,null,15452000,15452000,"2020-04-15","2020-04-23","2020-08-22",120,null,null,null,null,null,null,null,null,null,"X",1,{"$f":"IF(SUMPRODUCT((A$14:A75=A75)*(B$14:B75=B75)*(D$14:D75=D75))>1,0,1)","v":1},"Contratos de prestación de servicios profesionales y de apoyo a la gestión","Contratación directa",{"$f":"IF(ISBLANK(G75),1,IFERROR(VLOOKUP(G75,Tipo!$C$12:$C$27,1,FALSE),\"NO\"))","v":"Prestación de servicios profesionales y de apoyo a la gestión, o para la ejecución de trabajos artísticos que sólo puedan encomendarse a determinadas personas naturales;"},"Inversión",{"$f":"IF(ISBLANK(K75),1,IFERROR(VLOOKUP(K75,Eje_Pilar_Prop!C53:C158,1,FALSE),\"NO\"))","v":"NO"},"SECOP II",1,"Bogotá Mejor para Todos"]
[68,2020,"SECOP I","CONTRATO INTERDMINISTRATIVO No. 068-2020","Contratos interadministrativos","Contratación directa","Contratos interadministrativos"," PRESTACIÓN DEL SERVICIO DE MENSAJERÍA Y DE CORREO CERTIFICADO QUE REQUIERA EL FONDO DE DESARROLLO LOCAL DE LA CANDELARIA","Funcionamiento","Bogotá Mejor para Todos","No aplica","No Aplica","No Aplica","No Aplica","900062917-9","SERVICIOS POSTALES NACIONALES S.A.","8.000.000",null,null,0,null,8000000,null,"2020-05-13","2020-05-13","2021-05-12",360,null,null,null,null,null,null,null,null,"X",null,0,{"$f":"IF(SUMPRODUCT((A$14:A76=A76)*(B$14:B76=B76)*(D$14:D76=D76))>1,0,1)","v":1},"Contratos interadministrativos","Contratación directa",{"$f":"IF(ISBLANK(G76),1,IFERROR(VLOOKUP(G76,Tipo!$C$12:$C$27,1,FALSE),\"NO\"))","v":"Contratos interadministrativos"},"Funcionamiento",{"$f":"IF(ISBLANK(K76),1,IFERROR(VLOOKUP(K76,Eje_Pilar_Prop!C54:C159,1,FALSE),\"NO\"))","v":"NO"},"SECOP I",1,"Bogotá Mejor para Todos"]
[69,2020,"SECOP II","FDLC-CPS-068-2020","Contratos de prestación de servicios profesionales y de apoyo a la gestión","Contratación directa","Prestación de servicios profesionales y de apoyo a la gestión, o para la ejecución de trabajos artísticos que sólo puedan encomendarse a determinadas personas naturales;","PRESTAR SUS SERVICIOS PROFESIONALES PARA APOYAR AL ALCALDE LOCAL EN LA GESTIÓN DE LOS ASUNTOS RELACIONADOS CON SEGURIDAD CIUDADANA, CONVIVENCIA Y PREVENCIÓN DE CONFLICTIVIDADES, VIOLENCIAS Y DELITOS EN LA LOCALIDAD, DE CONFORMIDAD CON EL MARCO NORMATIVO APLICABLE EN LA MATERIA","Inversión","Bogotá Mejor para Todos",45,{"$f":"IF(ISERROR(VLOOKUP(K77,Eje_Pilar_Prop!$C$2:$E$104,2,FALSE)),\" \",VLOOKUP(K77,Eje_Pilar_Prop!$C$2:$E$104,2,FALSE))","v":"Gobernanza e influencia local, regional e internacional"},{"$f":"IF(ISERROR(VLOOKUP(K77,Eje_Pilar_Prop!$C$2:$E$104,3,FALSE)),\" \",VLOOKUP(K77,Eje_Pilar_Prop!$C$2:$E$104,3,FALSE))","v":"Eje Transversal 4 Gobierno Legitimo, Fortalecimiento Local y Eficiencia"},1395,80239278,"JOHN FREDY PULIDO RINCON",20400000,null,null,0,null,{"$f":"+Q77+S77+U77","v":20400000},20400000,"2020-04-22","2020-04-22","2020-08-21",120,null,null,null,null,null,null,null,null,null,"X",1,{"$f":"IF(SUMPRODUCT((A$14:A77=A77)*(B$14:B77=B77)*(D$14:D77=D77))>1,0,1)","v":1},"Contratos de prestación de servicios profesionales y de apoyo a la gestión","Contratación directa",{"$f":"IF(ISBLANK(G77),1,IFERROR(VLOOKUP(G77,Tipo!$C$12:$C$27,1,FALSE),\"NO\"))","v":"Prestación de servicios profesionales y de apoyo a la gestión, o para la ejecución de trabajos artísticos que sólo puedan encomendarse a determinadas personas naturales;"},"Inversión",{"$f":"IF(ISBLANK(K77),1,IFERROR(VLOOKUP(K77,Eje_Pilar_Prop!C55:C160,1,FALSE),\"NO\"))","v":"NO"},"SECOP II",1,"Bogotá Mejor para Todos"]
[70,2020,"SECOP II","FDLC-CPS-070-2020","Contratos de prestación de servicios profesionales y de apoyo a la gestión","Contratación directa","Prestación de servicios profesionales y de apoyo a la gestión, o para la ejecución de trabajos artísticos que sólo puedan encomendarse a determinadas personas naturales;","PRESTACIÓN DE SERVICIOS PROFESIONALES PARA APOYAR AL ALCALDE(SA) LOCAL EN LA PROMOCIÓN, ACOMPAÑAMIENTO, COORDINACIÓN Y ATENCIÓN DE LAS INSTANCIAS DE COORDINACIÓN INTERINSTITUCIONALES Y LAS INSTANCIAS DE PARTICIPACIÓN LOCALES, ASÍ COMO LOS PROCESOS COMUNITARIOS EN LA LOCALIDAD","Inversión","Bogotá Mejor para Todos",45,{"$f":"IF(ISERROR(VLOOKUP(K78,Eje_Pilar_Prop!$C$2:$E$104,2,FALSE)),\" \",VLOOKUP(K78,Eje_Pilar_Prop!$C$2:$E$104,2,FALSE))","v":"Gobernanza e influencia local, regional e internacional"},{"$f":"IF(ISERROR(VLOOKUP(K78,Eje_Pilar_Prop!$C$2:$E$104,3,FALSE)),\" \",VLOOKUP(K78,Eje_Pilar_Prop!$C$2:$E$104,3,FALSE))","v":"Eje Transversal 4 Gobierno Legitimo, Fortalecimiento Local y Eficiencia"},1396,79318896,"Haroldo Carin Calao Gonzalez",16800000,null,null,0,null,16800000,16800000,"2020-04-22","2020-04-22","2020-08-21",120,null,null,null,null,null,null,null,null,null,"X",1,{"$f":"IF(SUMPRODUCT((A$14:A98=A98)*(B$14:B98=B98)*(D$14:D98=D98))>1,0,1)","v":1},"Contratos de prestación de servicios profesionales y de apoyo a la gestión","Contratación directa",{"$f":"IF(ISBLANK(G78),1,IFERROR(VLOOKUP(G78,Tipo!$C$12:$C$27,1,FALSE),\"NO\"))","v":"Prestación de servicios profesionales y de apoyo a la gestión, o para la ejecución de trabajos artísticos que sólo puedan encomendarse a determinadas personas naturales;"},"Inversión",{"$f":"IF(ISBLANK(K78),1,IFERROR(VLOOKUP(K78,Eje_Pilar_Prop!C56:C161,1,FALSE),\"NO\"))","v":"NO"},"SECOP II",1,{"$f":"IF(ISBLANK(J78),1,IFERROR(VLOOKUP(J78,pdd,1,FALSE),\"NO\"))","v":"Bogotá Mejor para Todos"}]
[71,2020,"SECOP II","FDLC-IMC-005-2020","Seguros","Contratación mínima cuantia","No aplica","CONTRATAR EL SEGURO DE VIDA GRUPO QUE AMPARE LOS EDILES DEL FONDO DE DESARROLLO LOCAL DE LA CANDELARIA","Funcionamiento","Bogotá Mejor para Todos","No aplica","No Aplica","No Aplica","No Aplica",860011153,"POSITIVA COMPAÑIA DE SEGUROS S.A.",5548593,null,null,0,null,5548593,5548593,"2020-04-20","2020-04-20","2021-04-20",365,null,null,null,null,null,null,null,"X",null,null,1,{"$f":"IF(SUMPRODUCT((A$14:A79=A79)*(B$14:B79=B79)*(D$14:D79=D79))>1,0,1)","v":1},"Seguros","Contratación mínima cuantia",{"$f":"IF(ISBLANK(G79),1,IFERROR(VLOOKUP(G79,Tipo!$C$12:$C$27,1,FALSE),\"NO\"))","v":"NO"},"Funcionamiento",{"$f":"IF(ISBLANK(K79),1,IFERROR(VLOOKUP(K79,Eje_Pilar_Prop!C57:C162,1,FALSE),\"NO\"))","v":"NO"},"SECOP II",1,"Bogotá Mejor para Todos"]
[72,2020,"SECOP II","FDLC-CPS-072-2020","Contratos de prestación de servicios profesionales y de apoyo a la gestión","Contratación directa","Prestación de servicios profesionales y de apoyo a la gestión, o para la ejecución de trabajos artísticos que sólo puedan encomendarse a determinadas personas naturales;","PRESTACION DE SERVICIOS DE APOYO ASISTENCIAL A LA GESTION DEL DESPACHO Y LAS DIFERENTES AREAS DEL FONDO DE DESARROLLO LOCAL DE LA CANDELARIA","Inversión","Bogotá Mejor para Todos",45,{"$f":"IF(ISERROR(VLOOKUP(K80,Eje_Pilar_Prop!$C$2:$E$104,2,FALSE)),\" \",VLOOKUP(K80,Eje_Pilar_Prop!$C$2:$E$104,2,FALSE))","v":"Gobernanza e influencia local, regional e internacional"},{"$f":"IF(ISERROR(VLOOKUP(K80,Eje_Pilar_Prop!$C$2:$E$104,3,FALSE)),\" \",VLOOKUP(K80,Eje_Pilar_Prop!$C$2:$E$104,3,FALSE))","v":"Eje Transversal 4 Gobierno Legitimo, Fortalecimiento Local y Eficiencia"},1395,52305372,"ELCY JANETH PULIDO",9831392,null,null,0,null,9831392,9831392,"2020-05-14","2020-05-15","2020-09-14",120,null,null,null,null,null,null,null,null,null,"X",1,{"$f":"IF(SUMPRODUCT((A$14:A80=A80)*(B$14:B80=B80)*(D$14:D80=D80))>1,0,1)","v":1},"Contratos de prestación de servicios profesionales y de apoyo a la gestión","Contratación directa",{"$f":"IF(ISBLANK(G80),1,IFERROR(VLOOKUP(G80,Tipo!$C$12:$C$27,1,FALSE),\"NO\"))","v":"Prestación de servicios profesionales y de apoyo a la gestión, o para la ejecución de trabajos artísticos que sólo puedan encomendarse a determinadas personas naturales;"},"Inversión",{"$f":"IF(ISBLANK(K80),1,IFERROR(VLOOKUP(K80,Eje_Pilar_Prop!C58:C163,1,FALSE),\"NO\"))","v":"NO"},"SECOP II",1,"Bogotá Mejor para Todos"]
[73,2020,"SECOP II","FDLC-CPS-073-2020","Contratos de prestación de servicios profesionales y de apoyo a la gestión","Contratación directa","Prestación de servicios profesionales y de apoyo a la gestión, o para la ejecución de trabajos artísticos que sólo puedan encomendarse a determinadas personas naturales;","PRESTAR SERVICIOS PROFESIONALES COMO ESPECIALIZADOS EN LA GESTIÓN JURÍDICA DEL DESPACHO Y DEL FONDO DE DESARROLLO LOCAL LA CANDELARIA EN MATERIA CONTRACTUAL Y EN TODOS LOS TEMAS DE ORDEN ADMINISTRATIVO QUE SE DAN EN DESARROLLO DE LAS GESTIONES DE LA ENTIDAD","Inversión","Bogotá Mejor para Todos",45,{"$f":"IF(ISERROR(VLOOKUP(K81,Eje_Pilar_Prop!$C$2:$E$104,2,FALSE)),\" \",VLOOKUP(K81,Eje_Pilar_Prop!$C$2:$E$104,2,FALSE))","v":"Gobernanza e influencia local, regional e internacional"},{"$f":"IF(ISERROR(VLOOKUP(K81,Eje_Pilar_Prop!$C$2:$E$104,3,FALSE)),\" \",VLOOKUP(K81,Eje_Pilar_Prop!$C$2:$E$104,3,FALSE))","v":"Eje Transversal 4 Gobierno Legitimo, Fortalecimiento Local y Eficiencia"},1395,79981034,"ROLANDO NIÑO PALENCIA CESION DE CAMILO DEVIA NEIRA",35600000,null,null,0,null,35600000,22546666,"2020-05-14","2020-05-15","2020-09-14",120,null,null,79981034,"ROLANDO ALFONSO NIÑO PALENCIA,","2020-08-10",10680000,null,null,"X",null,0.63333331460674158,{"$f":"IF(SUMPRODUCT((A$14:A81=A81)*(B$14:B81=B81)*(D$14:D81=D81))>1,0,1)","v":1},"Contratos de prestación de servicios profesionales y de apoyo a la gestión","Contratación directa",{"$f":"IF(ISBLANK(G81),1,IFERROR(VLOOKUP(G81,Tipo!$C$12:$C$27,1,FALSE),\"NO\"))","v":"Prestación de servicios profesionales y de apoyo a la gestión, o para la ejecución de trabajos artísticos que sólo puedan encomendarse a determinadas personas naturales;"},"Inversión",{"$f":"IF(ISBLANK(K81),1,IFERROR(VLOOKUP(K81,Eje_Pilar_Prop!C59:C164,1,FALSE),\"NO\"))","v":"NO"},"SECOP II",1,"Bogotá Mejor para Todos"]
[74,2020,"SECOP II","FDLC-CPS-074-2020","Contratos de prestación de servicios profesionales y de apoyo a la gestión","Contratación directa","Prestación de servicios profesionales y de apoyo a la gestión, o para la ejecución de trabajos artísticos que sólo puedan encomendarse a determinadas personas naturales;","PRESTACIÓN DE SERVICIOS PROFESIONALES PARA COORDINAR, LIDERAR Y ASESORAR LOS PLANES Y ESTRATEGIAS DE COMUNICACIÓN INTERNA Y EXTERNA PARA LA DIVULGACIÓN DE LOS PROGRAMAS, PROYECTOS Y ACTIVIDADES DE LA ALCALDÍA LOCAL","Inversión","Bogotá Mejor para Todos",45,{"$f":"IF(ISERROR(VLOOKUP(K82,Eje_Pilar_Prop!$C$2:$E$104,2,FALSE)),\" \",VLOOKUP(K82,Eje_Pilar_Prop!$C$2:$E$104,2,FALSE))","v":"Gobernanza e influencia local, regional e internacional"},{"$f":"IF(ISERROR(VLOOKUP(K82,Eje_Pilar_Prop!$C$2:$E$104,3,FALSE)),\" \",VLOOKUP(K82,Eje_Pilar_Prop!$C$2:$E$104,3,FALSE))","v":"Eje Transversal 4 Gobierno Legitimo, Fortalecimiento Local y Eficiencia"},1395,1020729068,"Valentina Ochoa Mayorga",26000000,null,null,0,null,26000000,26000000,"2020-05-14","2020-05-18","2020-09-17",120,null,null,null,null,null,null,null,null,null,"X",1,{"$f":"IF(SUMPRODUCT((A$14:A82=A82)*(B$14:B82=B82)*(D$14:D82=D82))>1,0,1)","v":1},"Contratos de prestación de servicios profesionales y de apoyo a la gestión","Contratación directa",{"$f":"IF(ISBLANK(G82),1,IFERROR(VLOOKUP(G82,Tipo!$C$12:$C$27,1,FALSE),\"NO\"))","v":"Prestación de servicios profesionales y de apoyo a la gestión, o para la ejecución de trabajos artísticos que sólo puedan encomendarse a determinadas personas naturales;"},"Inversión",{"$f":"IF(ISBLANK(K82),1,IFERROR(VLOOKUP(K82,Eje_Pilar_Prop!C60:C165,1,FALSE),\"NO\"))","v":"NO"},"SECOP II",1,"Bogotá Mejor para Todos"]
[75,2020,"SECOP II","FDLC-IMC-006-2020","Contratos de prestación de servicios","Contratación mínima cuantia","No aplica","PRESTACION DEL SERVICIO DE VIGILANCIA Y SEGURIDAD PRIVADA INTEGRAL PERMANENTE PARA TODOS LOS BIENES MUEBLES E INMUEBLES DE PROPIEDAD DE LA ENTIDAD, Y DE LOS QUE LEGALMENTE SEA O LLEGARE A SER RESPONSABLE EL FONDO DE DESARROLLO LOCAL DE LA CANDELARIA","Funcionamiento","Bogotá Mejor para Todos","No aplica","No Aplica","No Aplica","No Aplica",860517560,"EMPRESA DE SEGURIDAD Y VIGILANCIA SERVICONFOR LIMITADA",23064935,null,null,1,10763636,33828571,33828571,"2020-05-15","2020-05-19","2020-06-02",15,1,15,null,null,null,null,null,null,null,"X",1,{"$f":"IF(SUMPRODUCT((A$14:A83=A83)*(B$14:B83=B83)*(D$14:D83=D83))>1,0,1)","v":1},"Contratos de prestación de servicios","Contratación mínima cuantia",{"$f":"IF(ISBLANK(G83),1,IFERROR(VLOOKUP(G83,Tipo!$C$12:$C$27,1,FALSE),\"NO\"))","v":"NO"},"Funcionamiento",{"$f":"IF(ISBLANK(K83),1,IFERROR(VLOOKUP(K83,Eje_Pilar_Prop!C61:C166,1,FALSE),\"NO\"))","v":"NO"},"SECOP II",1,"Bogotá Mejor para Todos"]
[76,2020,"SECOP II","FDLC-CPS-076-2020","Contratos de prestación de servicios profesionales y de apoyo a la gestión","Contratación directa","Prestación de servicios profesionales y de apoyo a la gestión, o para la ejecución de trabajos artísticos que sólo puedan encomendarse a determinadas personas naturales;","PRESTACIÓN DE SERVICIOS PROFESIONALES DE APOYO AL FONDO DE DESARROLLO LOCAL LA CANDELARIA EN LO RELACIONADO CON LOS PROCESOS PRECONTRACTUALES, CONTRACTUALES Y POSCONTRALES DE MAYOR CUANTÍA Y DEMÁS PROCESOS QUE SE REQUIERAN","Inversión","Bogotá Mejor para Todos",45,{"$f":"IF(ISERROR(VLOOKUP(K84,Eje_Pilar_Prop!$C$2:$E$104,2,FALSE)),\" \",VLOOKUP(K84,Eje_Pilar_Prop!$C$2:$E$104,2,FALSE))","v":"Gobernanza e influencia local, regional e internacional"},{"$f":"IF(ISERROR(VLOOKUP(K84,Eje_Pilar_Prop!$C$2:$E$104,3,FALSE)),\" \",VLOOKUP(K84,Eje_Pilar_Prop!$C$2:$E$104,3,FALSE))","v":"Eje Transversal 4 Gobierno Legitimo, Fortalecimiento Local y Eficiencia"},1395,1032470720,"YAISIR MARÍA VIDAL SANCHEZ",21067272,null,null,0,null,21067272,20540590,"2020-05-21","2020-05-26","2020-09-25",120,null,null,null,null,null,null,null,null,null,"X",0.97499999050660191,{"$f":"IF(SUMPRODUCT((A$14:A84=A84)*(B$14:B84=B84)*(D$14:D84=D84))>1,0,1)","v":1},"Contratos de prestación de servicios profesionales y de apoyo a la gestión","Contratación directa",{"$f":"IF(ISBLANK(G84),1,IFERROR(VLOOKUP(G84,Tipo!$C$12:$C$27,1,FALSE),\"NO\"))","v":"Prestación de servicios profesionales y de apoyo a la gestión, o para la ejecución de trabajos artísticos que sólo puedan encomendarse a determinadas personas naturales;"},"Inversión",{"$f":"IF(ISBLANK(K84),1,IFERROR(VLOOKUP(K84,Eje_Pilar_Prop!C62:C167,1,FALSE),\"NO\"))","v":"NO"},"SECOP II",1,"Bogotá Mejor para Todos"]
[77,2020,"SECOP II","FDLC-CPS-077-2020","Contratos de prestación de servicios profesionales y de apoyo a la gestión","Contratación directa","Prestación de servicios profesionales y de apoyo a la gestión, o para la ejecución de trabajos artísticos que sólo puedan encomendarse a determinadas personas naturales;"," PRESTACION DE SERVICIOS PROFESIONALES COMO ABOGADO DE APOYO EN LA OFICINA DE DESPACHO EN LAS DIFERENTES ACTIVIDADES Y FUNCIONES QUE LE COMPETEN A ESTA DEPENDENCIA DEL FONDO DE DESARROLLO LOCAL LA CANDELARIA","Inversión","Bogotá Mejor para Todos",45,{"$f":"IF(ISERROR(VLOOKUP(K85,Eje_Pilar_Prop!$C$2:$E$104,2,FALSE)),\" \",VLOOKUP(K85,Eje_Pilar_Prop!$C$2:$E$104,2,FALSE))","v":"Gobernanza e influencia local, regional e internacional"},{"$f":"IF(ISERROR(VLOOKUP(K85,Eje_Pilar_Prop!$C$2:$E$104,3,FALSE)),\" \",VLOOKUP(K85,Eje_Pilar_Prop!$C$2:$E$104,3,FALSE))","v":"Eje Transversal 4 Gobierno Legitimo, Fortalecimiento Local y Eficiencia"},1395,52314352,"CONSTANZA DEL PILAR LEYTON RICO",16818680,null,null,0,null,16818680,15977345,"2020-05-27","2020-05-29","2020-09-28",120,null,null,null,null,null,null,null,null,"X",null,0.94997615746301134,{"$f":"IF(SUMPRODUCT((A$14:A85=A85)*(B$14:B85=B85)*(D$14:D85=D85))>1,0,1)","v":1},"Contratos de prestación de servicios profesionales y de apoyo a la gestión","Contratación directa",{"$f":"IF(ISBLANK(G85),1,IFERROR(VLOOKUP(G85,Tipo!$C$12:$C$27,1,FALSE),\"NO\"))","v":"Prestación de servicios profesionales y de apoyo a la gestión, o para la ejecución de trabajos artísticos que sólo puedan encomendarse a determinadas personas naturales;"},"Inversión",{"$f":"IF(ISBLANK(K85),1,IFERROR(VLOOKUP(K85,Eje_Pilar_Prop!C63:C168,1,FALSE),\"NO\"))","v":"NO"},{"$f":"IF(ISBLANK(C85),1,IFERROR(VLOOKUP(C85,SECOP,1,FALSE),\"NO\"))","v":"SECOP II"},1,"Bogotá Mejor para Todos"]
[78,2020,"SECOP II","FDLC-CPS-078-2020","Contratos de prestación de servicios profesionales y de apoyo a la gestión","Contratación directa","Prestación de servicios profesionales y de apoyo a la gestión, o para la ejecución de trabajos artísticos que sólo puedan encomendarse a determinadas personas naturales;","PRESTACIÓN DE SERVICIOS PROFESIONALES AL ÁREA DE GESTIÓN DE DESARROLLO LOCAL DE LA ALCALDÍA LOCAL DE LA CANDELARIA PARA LA FORMULACIÓN Y APOYO TÉCNICO EN EL SEGUIMIENTO DE PLANES, POLÍTICAS, PROGRAMAS Y PROYECTOS EN EL MARCO DE LA CONSTRUCCIÓN DEL NUEVO PLAN DE DESARROLLO","Inversión","Bogotá Mejor para Todos",45,{"$f":"IF(ISERROR(VLOOKUP(K86,Eje_Pilar_Prop!$C$2:$E$104,2,FALSE)),\" \",VLOOKUP(K86,Eje_Pilar_Prop!$C$2:$E$104,2,FALSE))","v":"Gobernanza e influencia local, regional e internacional"},{"$f":"IF(ISERROR(VLOOKUP(K86,Eje_Pilar_Prop!$C$2:$E$104,3,FALSE)),\" \",VLOOKUP(K86,Eje_Pilar_Prop!$C$2:$E$104,3,FALSE))","v":"Eje Transversal 4 Gobierno Legitimo, Fortalecimiento Local y Eficiencia"},1395,80166444,"yerney rolando rodriguez avila",21067272,null,null,0,null,21067272,20189469,"2020-05-27","2020-05-29","2020-09-28",120,null,null,null,null,null,null,null,null,"X",null,0.95833333333333337,{"$f":"IF(SUMPRODUCT((A$14:A86=A86)*(B$14:B86=B86)*(D$14:D86=D86))>1,0,1)","v":1},"Contratos de prestación de servicios profesionales y de apoyo a la gestión","Contratación directa",{"$f":"IF(ISBLANK(G86),1,IFERROR(VLOOKUP(G86,Tipo!$C$12:$C$27,1,FALSE),\"NO\"))","v":"Prestación de servicios profesionales y de apoyo a la gestión, o para la ejecución de trabajos artísticos que sólo puedan encomendarse a determinadas personas naturales;"},"Inversión",{"$f":"IF(ISBLANK(K86),1,IFERROR(VLOOKUP(K86,Eje_Pilar_Prop!C64:C169,1,FALSE),\"NO\"))","v":"NO"},"SECOP II",1,"Bogotá Mejor para Todos"]
[79,2020,"SECOP II","FDLC-CPS-079-2020","Contratos de prestación de servicios profesionales y de apoyo a la gestión","Contratación directa","Prestación de servicios profesionales y de apoyo a la gestión, o para la ejecución de trabajos artísticos que sólo puedan encomendarse a determinadas personas naturales;","PRESTACION DE SERVICIOS PROFESIONALES PARA APOYAR AL ALCALDE LOCAL EN LOS PROYECTOS, ACCIONES Y ESTRATEGIAS CULTURALES, MUSICALES Y ARTISTICAS ENFOCADAS A LAS INSTANCIAS DE PARTICIPACIÓN DE LA LOCALIDAD LA CANDELARIA DE ACUEDO CON EL PROGRAMA GOBERNANZA E INFLUNCIA LOCAL, REGIONAL E INTERNACIONAL 1389 CANDELARIA CULTURAL Y DEPORTIVA MEJOR PARA TODOS","Inversión","Bogotá Mejor para Todos",11,{"$f":"IF(ISERROR(VLOOKUP(K87,Eje_Pilar_Prop!$C$2:$E$104,2,FALSE)),\" \",VLOOKUP(K87,Eje_Pilar_Prop!$C$2:$E$104,2,FALSE))","v":"Mejores oportunidades para el desarrollo a través de la cultura, la recreación y el deporte"},{"$f":"IF(ISERROR(VLOOKUP(K87,Eje_Pilar_Prop!$C$2:$E$104,3,FALSE)),\" \",VLOOKUP(K87,Eje_Pilar_Prop!$C$2:$E$104,3,FALSE))","v":"Pilar 1 Igualdad de Calidad de Vida"},1389,1010207254,"Ely David Murillo Cordoba",11589000,null,null,0,null,11589000,3734233,"2020-06-01","2020-06-02","2020-09-01",90,null,null,null,null,null,null,null,null,"X",null,0.32222219345931485,{"$f":"IF(SUMPRODUCT((A$14:A87=A87)*(B$14:B87=B87)*(D$14:D87=D87))>1,0,1)","v":1},"Contratos de prestación de servicios profesionales y de apoyo a la gestión","Contratación directa",{"$f":"IF(ISBLANK(G87),1,IFERROR(VLOOKUP(G87,Tipo!$C$12:$C$27,1,FALSE),\"NO\"))","v":"Prestación de servicios profesionales y de apoyo a la gestión, o para la ejecución de trabajos artísticos que sólo puedan encomendarse a determinadas personas naturales;"},"Inversión",{"$f":"IF(ISBLANK(K87),1,IFERROR(VLOOKUP(K87,Eje_Pilar_Prop!C65:C170,1,FALSE),\"NO\"))","v":"NO"},"SECOP II",1,"Bogotá Mejor para Todos"]
[80,2020,"SECOP II","FDLC-CPS-080-2020","Contratos de prestación de servicios profesionales y de apoyo a la gestión","Contratación directa","Prestación de servicios profesionales y de apoyo a la gestión, o para la ejecución de trabajos artísticos que sólo puedan encomendarse a determinadas personas naturales;","PRESTACIÓN DE SERVICIOS PROFESIONALES AL ÁREA DE GESTIÓN DE DESARROLLO LOCAL DE LA ALCALDÍA LOCAL DE LA CANDELARIA PARA LA FORMULACIÓN Y APOYO TÉCNICO EN EL SEGUIMIENTO DE PLANES, POLÍTICAS, PROGRAMAS Y PROYECTOS EN EL MARCO DE LA CONSTRUCCIÓN DEL NUEVO PLAN DE DESARROLLO","Inversión","Bogotá Mejor para Todos",45,{"$f":"IF(ISERROR(VLOOKUP(K88,Eje_Pilar_Prop!$C$2:$E$104,2,FALSE)),\" \",VLOOKUP(K88,Eje_Pilar_Prop!$C$2:$E$104,2,FALSE))","v":"Gobernanza e influencia local, regional e internacional"},{"$f":"IF(ISERROR(VLOOKUP(K88,Eje_Pilar_Prop!$C$2:$E$104,3,FALSE)),\" \",VLOOKUP(K88,Eje_Pilar_Prop!$C$2:$E$104,3,FALSE))","v":"Eje Transversal 4 Gobierno Legitimo, Fortalecimiento Local y Eficiencia"},1395,55242358,"DIGNA LIANETT ARIAS CALDERIN",21067272,null,null,0,null,21067272,21067272,"2020-06-11","2020-06-11","2020-10-10",120,null,null,null,null,null,null,null,null,null,"X",1,{"$f":"IF(SUMPRODUCT((A$14:A88=A88)*(B$14:B88=B88)*(D$14:D88=D88))>1,0,1)","v":1},{"$f":"IF(ISBLANK(E88),1,IFERROR(VLOOKUP(E88,tipo,1,FALSE),\"NO\"))","v":"Contratos de prestación de servicios profesionales y de apoyo a la gestión"},{"$f":"IF(ISBLANK(F88),1,IFERROR(VLOOKUP(F88,modal,1,FALSE),\"NO\"))","v":"Contratación directa"},{"$f":"IF(ISBLANK(G88),1,IFERROR(VLOOKUP(G88,Tipo!$C$12:$C$27,1,FALSE),\"NO\"))","v":"Prestación de servicios profesionales y de apoyo a la gestión, o para la ejecución de trabajos artísticos que sólo puedan encomendarse a determinadas personas naturales;"},{"$f":"IF(ISBLANK(I88),1,IFERROR(VLOOKUP(I88,afectacion,1,FALSE),\"NO\"))","v":"Inversión"},{"$f":"IF(ISBLANK(K88),1,IFERROR(VLOOKUP(K88,Eje_Pilar_Prop!C66:C171,1,FALSE),\"NO\"))","v":"NO"},"SECOP II",1,"Bogotá Mejor para Todos"]
[81,2020,"SECOP II","FDLC-CPS-081-2020","Contratos de prestación de servicios profesionales y de apoyo a la gestión","Contratación directa","Prestación de servicios profesionales y de apoyo a la gestión, o para la ejecución de trabajos artísticos que sólo puedan encomendarse a determinadas personas naturales;","PRESTACIÓN DE SERVICIOS DE APOYO Y ASISTENCIA ADMINISTRATIVA A LA GESTION DE LA JUNTA ADMINISTRADORA LOCAL DE LA CANDELARIA","Inversión","Bogotá Mejor para Todos",45,{"$f":"IF(ISERROR(VLOOKUP(K89,Eje_Pilar_Prop!$C$2:$E$104,2,FALSE)),\" \",VLOOKUP(K89,Eje_Pilar_Prop!$C$2:$E$104,2,FALSE))","v":"Gobernanza e influencia local, regional e internacional"},{"$f":"IF(ISERROR(VLOOKUP(K89,Eje_Pilar_Prop!$C$2:$E$104,3,FALSE)),\" \",VLOOKUP(K89,Eje_Pilar_Prop!$C$2:$E$104,3,FALSE))","v":"Eje Transversal 4 Gobierno Legitimo, Fortalecimiento Local y Eficiencia"},1395,51879946,"ISABEL CRISTINA BULLA RODRIGUEZ",9831392,null,null,0,null,9831392,9831392,"2020-06-11","2020-06-11","2020-10-10",120,null,null,null,null,null,null,null,null,null,"X",1,{"$f":"IF(SUMPRODUCT((A$14:A89=A89)*(B$14:B89=B89)*(D$14:D89=D89))>1,0,1)","v":1},"Contratos de prestación de servicios profesionales y de apoyo a la gestión","Contratación directa",{"$f":"IF(ISBLANK(G89),1,IFERROR(VLOOKUP(G89,Tipo!$C$12:$C$27,1,FALSE),\"NO\"))","v":"Prestación de servicios profesionales y de apoyo a la gestión, o para la ejecución de trabajos artísticos que sólo puedan encomendarse a determinadas personas naturales;"},"Inversión",{"$f":"IF(ISBLANK(K89),1,IFERROR(VLOOKUP(K89,Eje_Pilar_Prop!C67:C172,1,FALSE),\"NO\"))","v":"NO"},"SECOP II",1,"Bogotá Mejor para Todos"]
[82,2020,"SECOP II","FDLC-CPS-082-2020","Contratos de prestación de servicios profesionales y de apoyo a la gestión","Contratación directa","Prestación de servicios profesionales y de apoyo a la gestión, o para la ejecución de trabajos artísticos que sólo puedan encomendarse a determinadas personas naturales;","PRESTACIÓN DE SERVICIOS PROFESIONALES PARA APOYAR JURÍDICAMENTE LA EJECUCIÓN DE LAS ACCIONES REQUERIDAS PARA EL TRÁMITE E IMPULSO PROCESAL DE LAS ACTUACIONES CONTRAVENCIONALES Y/O QUERELLAS QUE CURSEN EN LAS INSPECCIÓN DE POLICÍA DE LA LOCALIDADDE LA CANDELARIA","Inversión","Bogotá Mejor para Todos",45,{"$f":"IF(ISERROR(VLOOKUP(K90,Eje_Pilar_Prop!$C$2:$E$104,2,FALSE)),\" \",VLOOKUP(K90,Eje_Pilar_Prop!$C$2:$E$104,2,FALSE))","v":"Gobernanza e influencia local, regional e internacional"},{"$f":"IF(ISERROR(VLOOKUP(K90,Eje_Pilar_Prop!$C$2:$E$104,3,FALSE)),\" \",VLOOKUP(K90,Eje_Pilar_Prop!$C$2:$E$104,3,FALSE))","v":"Eje Transversal 4 Gobierno Legitimo, Fortalecimiento Local y Eficiencia"},1395,1018443671,"JOSE RICARDO PULGARIN ALVAREZ",16000000,null,null,0,null,16000000,16000000,"2020-06-11","2020-05-12","2020-10-11",120,null,null,null,null,null,null,null,null,null,"X",1,{"$f":"IF(SUMPRODUCT((A$14:A90=A90)*(B$14:B90=B90)*(D$14:D90=D90))>1,0,1)","v":1},"Contratos de prestación de servicios profesionales y de apoyo a la gestión","Contratación directa",{"$f":"IF(ISBLANK(G90),1,IFERROR(VLOOKUP(G90,Tipo!$C$12:$C$27,1,FALSE),\"NO\"))","v":"Prestación de servicios profesionales y de apoyo a la gestión, o para la ejecución de trabajos artísticos que sólo puedan encomendarse a determinadas personas naturales;"},"Inversión",{"$f":"IF(ISBLANK(K90),1,IFERROR(VLOOKUP(K90,Eje_Pilar_Prop!C68:C173,1,FALSE),\"NO\"))","v":"NO"},"SECOP II",1,"Bogotá Mejor para Todos"]
[83,2020,"SECOP II","FDLC-IMC-009-2020","Contratos de prestación de servicios","Contratación mínima cuantia","No aplica","PRESTACIÓN DEL SERVICIO DE VIGILANCIA Y SEGURIDAD PRIVADA INTEGRAL PERMANENTE PARA TODOS LOS BIENES MUEBLES E INMUEBLES DE PROPIEDAD DE LA ENTIDAD, Y DE LOS QUE LEGALMENTE SEA O LLEGARE A SER RESPONSABLE EL FONDO DE DESARROLLO LOCAL DE LA CANDELARIA","Funcionamiento","Bogotá Mejor para Todos","No aplica","No Aplica","No Aplica","No Aplica",860517560,"EMPRESA DE SEGURIDAD Y VIGILANCIA SERVICONFOR LIMITADA",24513784,null,null,2,11980754,36494538,36494538,"2020-06-12","2020-06-13","2020-07-07",25,1,9,null,null,null,null,null,null,null,"X",1,2,"Contratos de prestación de servicios","Contratación mínima cuantia",{"$f":"IF(ISBLANK(G91),1,IFERROR(VLOOKUP(G91,Tipo!$C$12:$C$27,1,FALSE),\"NO\"))","v":"NO"},"Funcionamiento",{"$f":"IF(ISBLANK(K91),1,IFERROR(VLOOKUP(K91,Eje_Pilar_Prop!C69:C174,1,FALSE),\"NO\"))","v":"NO"},"SECOP II",1,"Bogotá Mejor para Todos"]
[84,2020,"SECOP II","FDLC-CPS-084-2020","Contratos de prestación de servicios profesionales y de apoyo a la gestión","Contratación directa","Prestación de servicios profesionales y de apoyo a la gestión, o para la ejecución de trabajos artísticos que sólo puedan encomendarse a determinadas personas naturales;","PRESTACION DE SERVICIOS PROFESIONALES PARA EL SEGUIMIENTO JURIDICO DE LOS PROYECTOS DE MOVILIDAD Y ESPACIO PUBLICO EN LA LOCALIDAD DE LA CANDELARIA","Inversión","Bogotá Mejor para Todos",18,{"$f":"IF(ISERROR(VLOOKUP(K92,Eje_Pilar_Prop!$C$2:$E$104,2,FALSE)),\" \",VLOOKUP(K92,Eje_Pilar_Prop!$C$2:$E$104,2,FALSE))","v":"Mejor movilidad para todos"},{"$f":"IF(ISERROR(VLOOKUP(K92,Eje_Pilar_Prop!$C$2:$E$104,3,FALSE)),\" \",VLOOKUP(K92,Eje_Pilar_Prop!$C$2:$E$104,3,FALSE))","v":"Pilar 2 Democracía Urbana"},1391,53032699,"KAREN ANDREA SARMIENTO CAMARGO CESION A JUAN CARLOS PUELLO",23138800,null,null,0,null,{"$f":"+Q92+S92+U92","v":23138800},13304810,"2020-06-11","2020-06-12","2020-10-11",120,null,null,9237277,"JUAN CARLOS PUELLO ARRIETA,","2020-08-20",10026813,null,null,"X",null,0.57499999999999996,2,"Contratos de prestación de servicios profesionales y de apoyo a la gestión","Contratación directa",{"$f":"IF(ISBLANK(G92),1,IFERROR(VLOOKUP(G92,Tipo!$C$12:$C$27,1,FALSE),\"NO\"))","v":"Prestación de servicios profesionales y de apoyo a la gestión, o para la ejecución de trabajos artísticos que sólo puedan encomendarse a determinadas personas naturales;"},"Inversión",{"$f":"IF(ISBLANK(K92),1,IFERROR(VLOOKUP(K92,Eje_Pilar_Prop!C74:C175,1,FALSE),\"NO\"))","v":"NO"},"SECOP II",{"$f":"IF(OR(YEAR(X92)=2020,ISBLANK(X92)),1,\"NO\")","v":1},"Bogotá Mejor para Todos"]
[85,2020,"SECOP II","FDLC-IMC-008-2020","Seguros","Contratación mínima cuantia","No aplica","CONTRATAR LOS SEGUROS QUE AMPAREN LOS INTERESES PATRIMONIALES ACTUALES Y FUTUROS, ASÍ COMO LOS BIENES DE PROPIEDAD DE EL FONDO DE DESARROLLO LOCAL DE LA CANDELARIA, QUE ESTÉN BAJO SU RESPONSABILIDAD Y CUSTODIA Y AQUELLOS QUE SEAN ADQUIRIDOS PARA DESARROLLAR LAS FUNCIONES INHERENTES A SU ACTIVIDAD Y CUALQUIER OTRA PÓLIZA DE SEGUROS QUE REQUIERA LA ENTIDAD EN EL DESARROLLO DE SU ACTIVIDAD","Funcionamiento","Bogotá Mejor para Todos","No aplica","No Aplica","No Aplica","No Aplica",8600024002,"LA PREVISORA S.A. COMPAÑÍA DE SEGUROS",21667820,null,null,1,11502862,{"$f":"+Q93+S93+U93","v":33170682},32430019,"2020-06-17","2020-06-17","2020-09-27",102,1,null,null,null,null,null,null,null,null,"X",0.97767115551015804,2,"Seguros","Contratación mínima cuantia",{"$f":"IF(ISBLANK(G93),1,IFERROR(VLOOKUP(G93,Tipo!$C$12:$C$27,1,FALSE),\"NO\"))","v":"NO"},"Funcionamiento",{"$f":"IF(ISBLANK(K93),1,IFERROR(VLOOKUP(K93,Eje_Pilar_Prop!C75:C176,1,FALSE),\"NO\"))","v":"NO"},"SECOP II",1,"Bogotá Mejor para Todos"]
[86,2020,"SECOP II","FDLC-IMC-010-2020","Suministro","Contratación mínima cuantia","No aplica","CONTRATAR EL SUMINISTRO DE BIENES Y/O SERVICIOS PARA LA REALIZACIÓN DE LOS ENCUENTROS CIUDADANOS EN LA LOCALIDAD DE LA CANDELARIA, EN EL MARCO DEL PROCESO DE FORMULACIÓN DEL PLAN DE DESARROLLO LOCAL 2021-2024 A MONTO AGOTABLE MEDIANTE PRECIOS UNITARIOS FIJOS","Inversión","Bogotá Mejor para Todos",45,{"$f":"IF(ISERROR(VLOOKUP(K94,Eje_Pilar_Prop!$C$2:$E$104,2,FALSE)),\" \",VLOOKUP(K94,Eje_Pilar_Prop!$C$2:$E$104,2,FALSE))","v":"Gobernanza e influencia local, regional e internacional"},{"$f":"IF(ISERROR(VLOOKUP(K94,Eje_Pilar_Prop!$C$2:$E$104,3,FALSE)),\" \",VLOOKUP(K94,Eje_Pilar_Prop!$C$2:$E$104,3,FALSE))","v":"Eje Transversal 4 Gobierno Legitimo, Fortalecimiento Local y Eficiencia"},1396,900572437,"FUNDACIÓN PAÍS HUMANO",24000000,null,null,0,null,24000000,20118500,"2020-06-19","2020-06-19","2020-12-18",120,1,90,null,null,null,null,null,null,"X",null,{"$f":"IF(ISERROR(W94/V94),\"-\",(W94/V94))","v":0.8382708333333333},2,"Suministro","Contratación mínima cuantia",{"$f":"IF(ISBLANK(G94),1,IFERROR(VLOOKUP(G94,Tipo!$C$12:$C$27,1,FALSE),\"NO\"))","v":"NO"},"Inversión",{"$f":"IF(ISBLANK(K94),1,IFERROR(VLOOKUP(K94,Eje_Pilar_Prop!C76:C177,1,FALSE),\"NO\"))","v":"NO"},"SECOP II",1,"Bogotá Mejor para Todos"]
[87,2020,"SECOP II","FDLC-CPS-087-2020","Contratos de prestación de servicios profesionales y de apoyo a la gestión","Contratación directa","Prestación de servicios profesionales y de apoyo a la gestión, o para la ejecución de trabajos artísticos que sólo puedan encomendarse a determinadas personas naturales;","PRESTACIÓN DE SERVICIOS PROFESIONALES COMO ADMINISTRADOR DE RED LOCAL Y ENLACE CON LA SECRETARIA DISTRITAL DE GOBIERNO, BRINDANDO SOPORTE EN MATERIA DE SISTEMAS (SOFTWARE Y HARDWARE) A LOS USUARIOS INTERNOS Y EXTERNOS DE LAS DIFERENTES ÁREAS DE LA ALCALDÍA LOCAL LA CANDELARIA","Inversión","Bogotá Mejor para Todos",45,{"$f":"IF(ISERROR(VLOOKUP(K95,Eje_Pilar_Prop!$C$2:$E$104,2,FALSE)),\" \",VLOOKUP(K95,Eje_Pilar_Prop!$C$2:$E$104,2,FALSE))","v":"Gobernanza e influencia local, regional e internacional"},{"$f":"IF(ISERROR(VLOOKUP(K95,Eje_Pilar_Prop!$C$2:$E$104,3,FALSE)),\" \",VLOOKUP(K95,Eje_Pilar_Prop!$C$2:$E$104,3,FALSE))","v":"Eje Transversal 4 Gobierno Legitimo, Fortalecimiento Local y Eficiencia"},1395,79814029,"AGUSTIN LARA BELTRAN",19978796,null,null,0,null,{"$f":"+Q95+S95+U95","v":19978796},19978796,"2020-06-19","2020-06-19","2020-10-18",120,null,null,null,null,null,null,null,null,null,"X",1,2,"Contratos de prestación de servicios profesionales y de apoyo a la gestión","Contratación directa",{"$f":"IF(ISBLANK(G95),1,IFERROR(VLOOKUP(G95,Tipo!$C$12:$C$27,1,FALSE),\"NO\"))","v":"Prestación de servicios profesionales y de apoyo a la gestión, o para la ejecución de trabajos artísticos que sólo puedan encomendarse a determinadas personas naturales;"},"Inversión",{"$f":"IF(ISBLANK(K95),1,IFERROR(VLOOKUP(K95,Eje_Pilar_Prop!C77:C178,1,FALSE),\"NO\"))","v":"NO"},"SECOP II",1,"Bogotá Mejor para Todos"]
[88,2020,"SECOP II","FDLC-IMC-011-2020","Suministro","Contratación mínima cuantia","No aplica","SUMINISTRO A MONTO AGOTABLE DE REFRIGERIOS A PRECIOS UNITARIOS FIJOS, PARA EL FORTALECIMIENTO DE LA PARTICIPACIÓN Y DE LAS ACTIVIDADES DE PROMOCIÓN INSTITUCIONAL DE LA ALCALDÍA LOCAL DE LA CANDELARIA","Inversión","Bogotá Mejor para Todos",45,{"$f":"IF(ISERROR(VLOOKUP(K96,Eje_Pilar_Prop!$C$2:$E$104,2,FALSE)),\" \",VLOOKUP(K96,Eje_Pilar_Prop!$C$2:$E$104,2,FALSE))","v":"Gobernanza e influencia local, regional e internacional"},{"$f":"IF(ISERROR(VLOOKUP(K96,Eje_Pilar_Prop!$C$2:$E$104,3,FALSE)),\" \",VLOOKUP(K96,Eje_Pilar_Prop!$C$2:$E$104,3,FALSE))","v":"Eje Transversal 4 Gobierno Legitimo, Fortalecimiento Local y Eficiencia"},1396,900893468,"LOGISTICS & SERVICES S.A.S.",12000000,null,null,0,null,12000000,3816000,"2020-06-24","2020-06-24","2020-12-23",180,null,null,null,null,null,null,null,"X",null,null,0.318,2,"Suministro","Contratación mínima cuantia",{"$f":"IF(ISBLANK(G96),1,IFERROR(VLOOKUP(G96,Tipo!$C$12:$C$27,1,FALSE),\"NO\"))","v":"NO"},"Inversión",{"$f":"IF(ISBLANK(K96),1,IFERROR(VLOOKUP(K96,Eje_Pilar_Prop!C78:C179,1,FALSE),\"NO\"))","v":"NO"},"SECOP II",1,"Bogotá Mejor para Todos"]
[89,2020,"SECOP II","FDLC-CPS-089-2020","Contratos de prestación de servicios profesionales y de apoyo a la gestión","Contratación directa","Prestación de servicios profesionales y de apoyo a la gestión, o para la ejecución de trabajos artísticos que sólo puedan encomendarse a determinadas personas naturales;","PRESTAR SERVICIOS DE APOYO COMO CONDUCTOR DE LOS VEHICULOS QUE SE ENCUENTRAN A CARGO DEL FONDO DE DESARROLLO LOCAL LA CANDELARIA","Inversión","Bogotá Mejor para Todos",45,{"$f":"IF(ISERROR(VLOOKUP(K97,Eje_Pilar_Prop!$C$2:$E$104,2,FALSE)),\" \",VLOOKUP(K97,Eje_Pilar_Prop!$C$2:$E$104,2,FALSE))","v":"Gobernanza e influencia local, regional e internacional"},{"$f":"IF(ISERROR(VLOOKUP(K97,Eje_Pilar_Prop!$C$2:$E$104,3,FALSE)),\" \",VLOOKUP(K97,Eje_Pilar_Prop!$C$2:$E$104,3,FALSE))","v":"Eje Transversal 4 Gobierno Legitimo, Fortalecimiento Local y Eficiencia"},1395,1010187694,"CHRISTIAM CAMILO ROMERO WALTEROS",9838393,null,null,0,null,9838393,9838393,"2020-06-23","2020-06-24","2020-10-23",120,null,null,null,null,null,null,null,null,null,"X",1,2,"Contratos de prestación de servicios profesionales y de apoyo a la gestión","Contratación directa",{"$f":"IF(ISBLANK(G97),1,IFERROR(VLOOKUP(G97,Tipo!$C$12:$C$27,1,FALSE),\"NO\"))","v":"Prestación de servicios profesionales y de apoyo a la gestión, o para la ejecución de trabajos artísticos que sólo puedan encomendarse a determinadas personas naturales;"},"Inversión",{"$f":"IF(ISBLANK(K97),1,IFERROR(VLOOKUP(K97,Eje_Pilar_Prop!C79:C180,1,FALSE),\"NO\"))","v":"NO"},"SECOP II",1,"Bogotá Mejor para Todos"]
[90,2020,"SECOP II","FDLC-CPS-090-2020","Contratos de prestación de servicios profesionales y de apoyo a la gestión","Contratación directa","Prestación de servicios profesionales y de apoyo a la gestión, o para la ejecución de trabajos artísticos que sólo puedan encomendarse a determinadas personas naturales;","PRESTAR SERVICIOS DE APOYO COMO CONDUCTOR DE LOS VEHICULOS QUE SE ENCUENTRAN A CARGO DEL FONDO DE DESARROLLO LOCAL LA CANDELARIA","Inversión","Bogotá Mejor para Todos",45,{"$f":"IF(ISERROR(VLOOKUP(K98,Eje_Pilar_Prop!$C$2:$E$104,2,FALSE)),\" \",VLOOKUP(K98,Eje_Pilar_Prop!$C$2:$E$104,2,FALSE))","v":"Gobernanza e influencia local, regional e internacional"},{"$f":"IF(ISERROR(VLOOKUP(K98,Eje_Pilar_Prop!$C$2:$E$104,3,FALSE)),\" \",VLOOKUP(K98,Eje_Pilar_Prop!$C$2:$E$104,3,FALSE))","v":"Eje Transversal 4 Gobierno Legitimo, Fortalecimiento Local y Eficiencia"},1395,79714948,"OSCAR ANTONIO ZAMBRANO GUTIERREZ",9838393,null,null,0,null,9838393,9838393,"2020-06-24","2020-06-24","2020-10-23",120,null,null,null,null,null,null,null,null,null,"X",1,3,"Contratos de prestación de servicios profesionales y de apoyo a la gestión","Contratación directa",{"$f":"IF(ISBLANK(G98),1,IFERROR(VLOOKUP(G98,Tipo!$C$12:$C$27,1,FALSE),\"NO\"))","v":"Prestación de servicios profesionales y de apoyo a la gestión, o para la ejecución de trabajos artísticos que sólo puedan encomendarse a determinadas personas naturales;"},"Inversión",{"$f":"IF(ISBLANK(K98),1,IFERROR(VLOOKUP(K98,Eje_Pilar_Prop!C80:C181,1,FALSE),\"NO\"))","v":"NO"},"SECOP II",1,"Bogotá Mejor para Todos"]
[91,2020,"SECOP II","FDLC-CPS-091-2020","Contratos de prestación de servicios profesionales y de apoyo a la gestión","Contratación directa","Prestación de servicios profesionales y de apoyo a la gestión, o para la ejecución de trabajos artísticos que sólo puedan encomendarse a determinadas personas naturales;","PRESTAR SERVICIOS PROFESIONALES PARA COORDINAR LA ARTICULACIÓN, ASISTENCIA Y ACOMPAÑAMIENTO DE LOS PROCESOS DE PLANEACIÓN LOCAL, PARA LA PROMOCIÓN DE LA PARTICIPACIÓN DE LAS MUJERES Y DE LA EQUIDAD DE GÉNERO, PARA MATERIALIZAR EN LA LOCALIDAD LAS ESTRATEGIAS DE TERRITORIALIZACIÓN Y TRANSVERSALIZACIÓN DE LA POLÍTICA PUBLICA DE MUJERES Y EQUIDAD DE GÉNERO, PPMYEG","Inversión","Bogotá Mejor para Todos",45,{"$f":"IF(ISERROR(VLOOKUP(K99,Eje_Pilar_Prop!$C$2:$E$104,2,FALSE)),\" \",VLOOKUP(K99,Eje_Pilar_Prop!$C$2:$E$104,2,FALSE))","v":"Gobernanza e influencia local, regional e internacional"},{"$f":"IF(ISERROR(VLOOKUP(K99,Eje_Pilar_Prop!$C$2:$E$104,3,FALSE)),\" \",VLOOKUP(K99,Eje_Pilar_Prop!$C$2:$E$104,3,FALSE))","v":"Eje Transversal 4 Gobierno Legitimo, Fortalecimiento Local y Eficiencia"},1395,1106786140,"MONICA ANDREA LEAL DIAZ",16362248,null,null,0,null,16362248,16362248,"2020-06-26","2020-06-26","2020-10-25",120,null,null,null,null,null,null,null,null,null,"X",1,2,"Contratos de prestación de servicios profesionales y de apoyo a la gestión","Contratación directa",{"$f":"IF(ISBLANK(G99),1,IFERROR(VLOOKUP(G99,Tipo!$C$12:$C$27,1,FALSE),\"NO\"))","v":"Prestación de servicios profesionales y de apoyo a la gestión, o para la ejecución de trabajos artísticos que sólo puedan encomendarse a determinadas personas naturales;"},"Inversión",{"$f":"IF(ISBLANK(K99),1,IFERROR(VLOOKUP(K99,Eje_Pilar_Prop!C81:C182,1,FALSE),\"NO\"))","v":"NO"},"SECOP II",1,"Bogotá Mejor para Todos"]
[92,2020,"SECOP II","092-2020 CONTRATO INTERADMINISTRATIVO","Contratos interadministrativos","Contratación directa","Contratos interadministrativos","PROVEER UNA PLATAFORMA VIRTUAL Y SERVICIOS TECNOLÓGICOS NECESARIOS A LOS FONDOS DE DESARROLLO LOCAL, EN LA REALIZACIÓN DE LAS ASAMBLEAS, EVENTOS Y FOROS DIGITALES, EN EL MARCO DE LOS ENCUENTROS CIUDADANOS Y PRESUPUESTOS PARTICIPATIVOS, DE ACUERDO CON LOS LINEAMIENTOS ESTRATÉGICOS QUE DETERMINEN LOS FDL","Inversión","Bogotá Mejor para Todos",45,{"$f":"IF(ISERROR(VLOOKUP(K100,Eje_Pilar_Prop!$C$2:$E$104,2,FALSE)),\" \",VLOOKUP(K100,Eje_Pilar_Prop!$C$2:$E$104,2,FALSE))","v":"Gobernanza e influencia local, regional e internacional"},{"$f":"IF(ISERROR(VLOOKUP(K100,Eje_Pilar_Prop!$C$2:$E$104,3,FALSE)),\" \",VLOOKUP(K100,Eje_Pilar_Prop!$C$2:$E$104,3,FALSE))","v":"Eje Transversal 4 Gobierno Legitimo, Fortalecimiento Local y Eficiencia"},1396,899999115,"EMPRESA DE TELECOMUNICACIONES DE BOGOTA SA ESP",23434653,null,null,0,null,23434653,0,"2020-06-23","2020-06-23","2020-07-31",39,null,null,null,null,null,null,null,null,"X",null,0,2,"Contratos interadministrativos","Contratación directa",{"$f":"IF(ISBLANK(G100),1,IFERROR(VLOOKUP(G100,Tipo!$C$12:$C$27,1,FALSE),\"NO\"))","v":"Contratos interadministrativos"},"Inversión",{"$f":"IF(ISBLANK(K100),1,IFERROR(VLOOKUP(K100,Eje_Pilar_Prop!C82:C183,1,FALSE),\"NO\"))","v":"NO"},"SECOP II",1,"Bogotá Mejor para Todos"]
[93,2020,"SECOP II","FDLC-CPS-093-2020","Contratos de prestación de servicios profesionales y de apoyo a la gestión","Contratación directa","Prestación de servicios profesionales y de apoyo a la gestión, o para la ejecución de trabajos artísticos que sólo puedan encomendarse a determinadas personas naturales;","APOYAR LA GESTION DOCUMENTAL DE LA ALCALDIA LOCAL, ACOMPAÑANDO EL EQUIPO JURIDICO DE DEPURACIÓN EN LAS LABOR ES OPERATIVAS QUE GENERA EL PROCESO DE IMPULSO DE LAS ACTUACIONES ADMINISTRATIVAS EXISTENTES EN LA ALCALDÍA LOCAL DE LA CANDELARIA","Inversión","Bogotá Mejor para Todos",45,{"$f":"IF(ISERROR(VLOOKUP(K101,Eje_Pilar_Prop!$C$2:$E$104,2,FALSE)),\" \",VLOOKUP(K101,Eje_Pilar_Prop!$C$2:$E$104,2,FALSE))","v":"Gobernanza e influencia local, regional e internacional"},{"$f":"IF(ISERROR(VLOOKUP(K101,Eje_Pilar_Prop!$C$2:$E$104,3,FALSE)),\" \",VLOOKUP(K101,Eje_Pilar_Prop!$C$2:$E$104,3,FALSE))","v":"Eje Transversal 4 Gobierno Legitimo, Fortalecimiento Local y Eficiencia"},1395,49729700,"NEREIDA HERNANDEZ FLOREZ",9831200,null,null,0,null,9831200,9831200,"2020-06-26","2020-06-26","2020-10-25",120,null,null,null,null,null,null,null,null,null,"X",1,2,"Contratos de prestación de servicios profesionales y de apoyo a la gestión","Contratación directa",{"$f":"IF(ISBLANK(G101),1,IFERROR(VLOOKUP(G101,Tipo!$C$12:$C$27,1,FALSE),\"NO\"))","v":"Prestación de servicios profesionales y de apoyo a la gestión, o para la ejecución de trabajos artísticos que sólo puedan encomendarse a determinadas personas naturales;"},"Inversión",{"$f":"IF(ISBLANK(K101),1,IFERROR(VLOOKUP(K101,Eje_Pilar_Prop!C83:C184,1,FALSE),\"NO\"))","v":"NO"},"SECOP II",1,"Bogotá Mejor para Todos"]
[94,2020,"SECOP II","FDLC-CPS-094-2020","Contratos de prestación de servicios profesionales y de apoyo a la gestión","Contratación directa","Prestación de servicios profesionales y de apoyo a la gestión, o para la ejecución de trabajos artísticos que sólo puedan encomendarse a determinadas personas naturales;","PRESTAR SERVICIOS PROFESIONALES ESPECIALIZADOS PARA BRINDAR LINEAMIENTOS JURIDICOS, EVALUAR Y ORIENTAR TEMAS PRIORITARIOS DEL DESPACHO DE LA ALCALDÍA LOCAL DE LA CANDELARIA","Inversión","Bogotá Mejor para Todos",45,{"$f":"IF(ISERROR(VLOOKUP(K102,Eje_Pilar_Prop!$C$2:$E$104,2,FALSE)),\" \",VLOOKUP(K102,Eje_Pilar_Prop!$C$2:$E$104,2,FALSE))","v":"Gobernanza e influencia local, regional e internacional"},{"$f":"IF(ISERROR(VLOOKUP(K102,Eje_Pilar_Prop!$C$2:$E$104,3,FALSE)),\" \",VLOOKUP(K102,Eje_Pilar_Prop!$C$2:$E$104,3,FALSE))","v":"Eje Transversal 4 Gobierno Legitimo, Fortalecimiento Local y Eficiencia"},1395,52518431,"DIANA CRISTINA PALACIOS NOVOA",35568577,null,null,0,null,35568577,35568577,"2020-06-26","2020-06-26","2020-10-25",120,null,null,null,null,null,null,null,null,null,"X",1,2,"Contratos de prestación de servicios profesionales y de apoyo a la gestión","Contratación directa",{"$f":"IF(ISBLANK(G102),1,IFERROR(VLOOKUP(G102,Tipo!$C$12:$C$27,1,FALSE),\"NO\"))","v":"Prestación de servicios profesionales y de apoyo a la gestión, o para la ejecución de trabajos artísticos que sólo puedan encomendarse a determinadas personas naturales;"},"Inversión",{"$f":"IF(ISBLANK(K102),1,IFERROR(VLOOKUP(K102,Eje_Pilar_Prop!C84:C185,1,FALSE),\"NO\"))","v":"NO"},"SECOP II",1,"Bogotá Mejor para Todos"]
[95,2020,"SECOP II","FDLC-CPS-095-2020","Contratos de prestación de servicios profesionales y de apoyo a la gestión","Contratación directa","Prestación de servicios profesionales y de apoyo a la gestión, o para la ejecución de trabajos artísticos que sólo puedan encomendarse a determinadas personas naturales;","PRESTAR SERVICIOS PROFESIONALES AL ÁREA DE GESTION POLICIVA DEL FONDO DE DESARROLLO LOCAL LA CANDELARIA, PARA FORTALECER Y PROMOVER ESTRATEGIAS DE IMPLEMENTACION, APLICACION Y CAPACITACION A LA COMUNIDAD Y DIFERENTES SECTORES, EN MATERIA DE NORMATIVIDAD REFERENTE AL CODIGO DE POLICIA Y FRENTES LOCALES DE SEGURIDAD","Inversión","Bogotá Mejor para Todos",45,{"$f":"IF(ISERROR(VLOOKUP(K103,Eje_Pilar_Prop!$C$2:$E$104,2,FALSE)),\" \",VLOOKUP(K103,Eje_Pilar_Prop!$C$2:$E$104,2,FALSE))","v":"Gobernanza e influencia local, regional e internacional"},{"$f":"IF(ISERROR(VLOOKUP(K103,Eje_Pilar_Prop!$C$2:$E$104,3,FALSE)),\" \",VLOOKUP(K103,Eje_Pilar_Prop!$C$2:$E$104,3,FALSE))","v":"Eje Transversal 4 Gobierno Legitimo, Fortalecimiento Local y Eficiencia"},1395,1077967370,"EMERSON LINARES GORDILLO",15905790,null,null,0,null,15905790,15905790,"2020-06-24","2020-06-26","2020-10-25",120,null,null,null,null,null,null,null,null,null,"X",1,2,"Contratos de prestación de servicios profesionales y de apoyo a la gestión","Contratación directa",{"$f":"IF(ISBLANK(G103),1,IFERROR(VLOOKUP(G103,Tipo!$C$12:$C$27,1,FALSE),\"NO\"))","v":"Prestación de servicios profesionales y de apoyo a la gestión, o para la ejecución de trabajos artísticos que sólo puedan encomendarse a determinadas personas naturales;"},"Inversión",{"$f":"IF(ISBLANK(K103),1,IFERROR(VLOOKUP(K103,Eje_Pilar_Prop!C85:C186,1,FALSE),\"NO\"))","v":"NO"},"SECOP II",1,"Bogotá Mejor para Todos"]
[96,2020,"SECOP II","FDLC-CPS-096-2020","Contratos de prestación de servicios profesionales y de apoyo a la gestión","Contratación directa","Prestación de servicios profesionales y de apoyo a la gestión, o para la ejecución de trabajos artísticos que sólo puedan encomendarse a determinadas personas naturales;","PRESTACIÓN DE SERVICIOS DE APOYO TÉCNICO EN LA ADMINISTRACIÓN DE LAS CASAS COMUNITARIAS DE LA LOCALIDAD DE LA CANDELARIA DE CONFORMIDAD CON EL ACUERDO LOCAL 006 DE 2013","Inversión","Bogotá Mejor para Todos",45,{"$f":"IF(ISERROR(VLOOKUP(K104,Eje_Pilar_Prop!$C$2:$E$104,2,FALSE)),\" \",VLOOKUP(K104,Eje_Pilar_Prop!$C$2:$E$104,2,FALSE))","v":"Gobernanza e influencia local, regional e internacional"},{"$f":"IF(ISERROR(VLOOKUP(K104,Eje_Pilar_Prop!$C$2:$E$104,3,FALSE)),\" \",VLOOKUP(K104,Eje_Pilar_Prop!$C$2:$E$104,3,FALSE))","v":"Eje Transversal 4 Gobierno Legitimo, Fortalecimiento Local y Eficiencia"},1395,41621560,"NELLY PARRA TOCORA",11587000,null,null,0,null,11587000,11587000,"2020-06-26","2020-06-26","2020-10-25",120,null,null,null,null,null,null,null,null,null,"X",1,2,"Contratos de prestación de servicios profesionales y de apoyo a la gestión","Contratación directa",{"$f":"IF(ISBLANK(G104),1,IFERROR(VLOOKUP(G104,Tipo!$C$12:$C$27,1,FALSE),\"NO\"))","v":"Prestación de servicios profesionales y de apoyo a la gestión, o para la ejecución de trabajos artísticos que sólo puedan encomendarse a determinadas personas naturales;"},"Inversión",{"$f":"IF(ISBLANK(K104),1,IFERROR(VLOOKUP(K104,Eje_Pilar_Prop!C86:C187,1,FALSE),\"NO\"))","v":"NO"},"SECOP II",1,"Bogotá Mejor para Todos"]
[97,2020,"SECOP II","FDLC-CPS-097-2020","Contratos de prestación de servicios profesionales y de apoyo a la gestión","Contratación directa","Prestación de servicios profesionales y de apoyo a la gestión, o para la ejecución de trabajos artísticos que sólo puedan encomendarse a determinadas personas naturales;","PRESTACIÓN DE SERVICIOS PROFESIONALES AL ÁREA DE GESTIÓN DE DESARROLLO LOCAL DE LA ALCALDÍA LOCAL DE LA CANDELARIA EN TEMAS RELACIONADOS CON LAS DISTINTAS ACTUACIONES QUE ADELANTEN LOS ÓRGANOS DE CONTROL Y VIGILANCIA FISCAL EN EL MARCO DE LAS AUDITORÍAS, ACTUACIONES ESPECIALES DE FISCALIZACIÓN Y DEMÁS ACTIVIDADES EN LAS QUE SE EVALÚE Y VIGILE LA GESTIÓN","Inversión","Bogotá Mejor para Todos",45,{"$f":"IF(ISERROR(VLOOKUP(K105,Eje_Pilar_Prop!$C$2:$E$104,2,FALSE)),\" \",VLOOKUP(K105,Eje_Pilar_Prop!$C$2:$E$104,2,FALSE))","v":"Gobernanza e influencia local, regional e internacional"},{"$f":"IF(ISERROR(VLOOKUP(K105,Eje_Pilar_Prop!$C$2:$E$104,3,FALSE)),\" \",VLOOKUP(K105,Eje_Pilar_Prop!$C$2:$E$104,3,FALSE))","v":"Eje Transversal 4 Gobierno Legitimo, Fortalecimiento Local y Eficiencia"},1395,88136151,"JAIRO ENRIQUE PEÑARANDA TORRADO",21067272,null,null,0,null,21067272,16678257,"2020-06-26","2020-06-26","2020-10-25",120,null,null,null,null,null,null,null,null,"X",null,0.79166666666666663,2,"Contratos de prestación de servicios profesionales y de apoyo a la gestión","Contratación directa",{"$f":"IF(ISBLANK(G105),1,IFERROR(VLOOKUP(G105,Tipo!$C$12:$C$27,1,FALSE),\"NO\"))","v":"Prestación de servicios profesionales y de apoyo a la gestión, o para la ejecución de trabajos artísticos que sólo puedan encomendarse a determinadas personas naturales;"},"Inversión",{"$f":"IF(ISBLANK(K105),1,IFERROR(VLOOKUP(K105,Eje_Pilar_Prop!C87:C188,1,FALSE),\"NO\"))","v":"NO"},"SECOP II",1,"Bogotá Mejor para Todos"]
[98,2020,"SECOP II","FDLC-CPS-098-2020","Contratos de prestación de servicios profesionales y de apoyo a la gestión","Contratación directa","Prestación de servicios profesionales y de apoyo a la gestión, o para la ejecución de trabajos artísticos que sólo puedan encomendarse a determinadas personas naturales;","PRESTACIÓN DE SERVICIOS TÉCNICOS DE APOYO A LA OFICINA DEL ALMACÉN DEL FONDO DE DESARROLLO LOCAL LA CANDELARIA","Inversión","Bogotá Mejor para Todos",45,{"$f":"IF(ISERROR(VLOOKUP(K106,Eje_Pilar_Prop!$C$2:$E$104,2,FALSE)),\" \",VLOOKUP(K106,Eje_Pilar_Prop!$C$2:$E$104,2,FALSE))","v":"Gobernanza e influencia local, regional e internacional"},{"$f":"IF(ISERROR(VLOOKUP(K106,Eje_Pilar_Prop!$C$2:$E$104,3,FALSE)),\" \",VLOOKUP(K106,Eje_Pilar_Prop!$C$2:$E$104,3,FALSE))","v":"Eje Transversal 4 Gobierno Legitimo, Fortalecimiento Local y Eficiencia"},1395,79277986,"JOSE EDYS ROJAS ROJAS",12991484,null,null,0,null,12991484,12991424,"2020-06-26","2020-06-26","2020-10-25",120,null,null,null,null,null,null,null,null,null,"X",0.99999538158997081,2,"Contratos de prestación de servicios profesionales y de apoyo a la gestión","Contratación directa",{"$f":"IF(ISBLANK(G106),1,IFERROR(VLOOKUP(G106,Tipo!$C$12:$C$27,1,FALSE),\"NO\"))","v":"Prestación de servicios profesionales y de apoyo a la gestión, o para la ejecución de trabajos artísticos que sólo puedan encomendarse a determinadas personas naturales;"},"Inversión",{"$f":"IF(ISBLANK(K106),1,IFERROR(VLOOKUP(K106,Eje_Pilar_Prop!C88:C189,1,FALSE),\"NO\"))","v":"NO"},"SECOP II",1,"Bogotá Mejor para Todos"]
[99,2020,"SECOP II","FDLC-CPS-099-2020","Contratos de prestación de servicios profesionales y de apoyo a la gestión","Contratación directa","Prestación de servicios profesionales y de apoyo a la gestión, o para la ejecución de trabajos artísticos que sólo puedan encomendarse a determinadas personas naturales;","PRESTACIÓN DE SERVICIOS PROFESIONALES PARA APOYAR JURÍDICAMENTE LA EJECUCIÓN DE LAS ACCIONES REQUERIDAS PARA LA DEPURACIÓN DE LAS ACTUACIONES ADMINISTRATIVAS QUE CURSAN EN LA ALCALDÍA LOCAL","Inversión","Bogotá Mejor para Todos",45,{"$f":"IF(ISERROR(VLOOKUP(K107,Eje_Pilar_Prop!$C$2:$E$104,2,FALSE)),\" \",VLOOKUP(K107,Eje_Pilar_Prop!$C$2:$E$104,2,FALSE))","v":"Gobernanza e influencia local, regional e internacional"},{"$f":"IF(ISERROR(VLOOKUP(K107,Eje_Pilar_Prop!$C$2:$E$104,3,FALSE)),\" \",VLOOKUP(K107,Eje_Pilar_Prop!$C$2:$E$104,3,FALSE))","v":"Eje Transversal 4 Gobierno Legitimo, Fortalecimiento Local y Eficiencia"},1395,1022973767,"CAROLINA ROJAS CARVAJAL",17907181,null,null,0,null,17907181,17907181,"2020-06-26","2020-06-26","2020-10-25",120,null,null,null,null,null,null,null,null,null,"X",1,2,"Contratos de prestación de servicios profesionales y de apoyo a la gestión","Contratación directa",{"$f":"IF(ISBLANK(G107),1,IFERROR(VLOOKUP(G107,Tipo!$C$12:$C$27,1,FALSE),\"NO\"))","v":"Prestación de servicios profesionales y de apoyo a la gestión, o para la ejecución de trabajos artísticos que sólo puedan encomendarse a determinadas personas naturales;"},"Inversión",{"$f":"IF(ISBLANK(K107),1,IFERROR(VLOOKUP(K107,Eje_Pilar_Prop!C89:C190,1,FALSE),\"NO\"))","v":"NO"},"SECOP II",1,"Bogotá Mejor para Todos"]
[100,2020,"SECOP II","FDLC-CPS-100-2020","Contratos de prestación de servicios profesionales y de apoyo a la gestión","Contratación directa","Prestación de servicios profesionales y de apoyo a la gestión, o para la ejecución de trabajos artísticos que sólo puedan encomendarse a determinadas personas naturales;","PRESTACION DE SERVICIOS PROFESIONALES PARA APOYAR LA FORMULACIÓN, GESTIÓN Y SEGUIMIENTO DE ACTIVIDADES ENFOCADAS A LA GESTIÓN AMBIENTAL EXTERNA, ENCAMINADAS A LA MITIGACIÓN DE LOS DIFERENTES IMPACTOS AMBIENTALES Y LA CONSERVACIÓN DE LOS RECURSOS NATURALES DE LA LOCALIDAD","Inversión","Bogotá Mejor para Todos",45,{"$f":"IF(ISERROR(VLOOKUP(K108,Eje_Pilar_Prop!$C$2:$E$104,2,FALSE)),\" \",VLOOKUP(K108,Eje_Pilar_Prop!$C$2:$E$104,2,FALSE))","v":"Gobernanza e influencia local, regional e internacional"},{"$f":"IF(ISERROR(VLOOKUP(K108,Eje_Pilar_Prop!$C$2:$E$104,3,FALSE)),\" \",VLOOKUP(K108,Eje_Pilar_Prop!$C$2:$E$104,3,FALSE))","v":"Eje Transversal 4 Gobierno Legitimo, Fortalecimiento Local y Eficiencia"},1395,80194800,"PEDRO ANDRES BARRERA ALVARADO",16800000,null,null,0,null,16800000,8400000,"2020-07-01","2020-07-01","2020-10-31",120,null,null,null,null,null,null,null,null,"X",null,0.5,2,"Contratos de prestación de servicios profesionales y de apoyo a la gestión","Contratación directa",{"$f":"IF(ISBLANK(G108),1,IFERROR(VLOOKUP(G108,Tipo!$C$12:$C$27,1,FALSE),\"NO\"))","v":"Prestación de servicios profesionales y de apoyo a la gestión, o para la ejecución de trabajos artísticos que sólo puedan encomendarse a determinadas personas naturales;"},"Inversión",{"$f":"IF(ISBLANK(K108),1,IFERROR(VLOOKUP(K108,Eje_Pilar_Prop!C90:C191,1,FALSE),\"NO\"))","v":"NO"},"SECOP II",1,"Bogotá Mejor para Todos"]
[101,2020,"SECOP II","FDLC-CPS-101-2020","Contratos de prestación de servicios profesionales y de apoyo a la gestión","Contratación directa","Prestación de servicios profesionales y de apoyo a la gestión, o para la ejecución de trabajos artísticos que sólo puedan encomendarse a determinadas personas naturales;","PRESTACIÓN DE SERVICIOS PROFESIONALES PARA APOYAR Y FORTALECER LA OFICINA DE PRESUPUESTO DEL FONDO DE DESARROLLO LOCAL EN LAS GESTIONES ADMINISTRATIVAS Y FINANCIERAS DE LA ENTIDAD","Inversión","Bogotá Mejor para Todos",45,{"$f":"IF(ISERROR(VLOOKUP(K109,Eje_Pilar_Prop!$C$2:$E$104,2,FALSE)),\" \",VLOOKUP(K109,Eje_Pilar_Prop!$C$2:$E$104,2,FALSE))","v":"Gobernanza e influencia local, regional e internacional"},{"$f":"IF(ISERROR(VLOOKUP(K109,Eje_Pilar_Prop!$C$2:$E$104,3,FALSE)),\" \",VLOOKUP(K109,Eje_Pilar_Prop!$C$2:$E$104,3,FALSE))","v":"Eje Transversal 4 Gobierno Legitimo, Fortalecimiento Local y Eficiencia"},1395,41648295,"ISABEL SANCHEZ RODRIGUEZ",17345400,null,null,0,null,17345400,17345400,"2020-07-01","2020-07-01","2020-10-31",120,null,null,null,null,null,null,null,null,null,"X",1,2,"Contratos de prestación de servicios profesionales y de apoyo a la gestión","Contratación directa",{"$f":"IF(ISBLANK(G109),1,IFERROR(VLOOKUP(G109,Tipo!$C$12:$C$27,1,FALSE),\"NO\"))","v":"Prestación de servicios profesionales y de apoyo a la gestión, o para la ejecución de trabajos artísticos que sólo puedan encomendarse a determinadas personas naturales;"},"Inversión",{"$f":"IF(ISBLANK(K109),1,IFERROR(VLOOKUP(K109,Eje_Pilar_Prop!C91:C192,1,FALSE),\"NO\"))","v":"NO"},"SECOP II",1,"Bogotá Mejor para Todos"]
[102,2020,"SECOP II","FDLC-CPS-102-2020 ","Contratos de prestación de servicios profesionales y de apoyo a la gestión","Contratación directa","Prestación de servicios profesionales y de apoyo a la gestión, o para la ejecución de trabajos artísticos que sólo puedan encomendarse a determinadas personas naturales;","PRESTACION DE SERVICIOS PROFESIONALES PARA APOYAR TÉCNICAMENTE LAS DISTINTAS ETAPAS DE LOS PROCESOS DE COMPETENCIA DE LA ALCALDÍA LOCAL PARA LA DEPURACIÓN DE ACTUACIONES ADMINISTRATIVAS","Inversión","Bogotá Mejor para Todos",45,{"$f":"IF(ISERROR(VLOOKUP(K110,Eje_Pilar_Prop!$C$2:$E$104,2,FALSE)),\" \",VLOOKUP(K110,Eje_Pilar_Prop!$C$2:$E$104,2,FALSE))","v":"Gobernanza e influencia local, regional e internacional"},{"$f":"IF(ISERROR(VLOOKUP(K110,Eje_Pilar_Prop!$C$2:$E$104,3,FALSE)),\" \",VLOOKUP(K110,Eje_Pilar_Prop!$C$2:$E$104,3,FALSE))","v":"Eje Transversal 4 Gobierno Legitimo, Fortalecimiento Local y Eficiencia"},1395,79507928,"FRANCISCO JAVIER HIGUERA NOVA",16818704,null,null,0,null,16818704,16818703,"2020-07-03","2020-07-03","2020-11-02",120,null,null,null,null,null,null,null,null,null,"X",0.99999994054238661,2,"Contratos de prestación de servicios profesionales y de apoyo a la gestión","Contratación directa",{"$f":"IF(ISBLANK(G110),1,IFERROR(VLOOKUP(G110,Tipo!$C$12:$C$27,1,FALSE),\"NO\"))","v":"Prestación de servicios profesionales y de apoyo a la gestión, o para la ejecución de trabajos artísticos que sólo puedan encomendarse a determinadas personas naturales;"},"Inversión",{"$f":"IF(ISBLANK(K110),1,IFERROR(VLOOKUP(K110,Eje_Pilar_Prop!C92:C193,1,FALSE),\"NO\"))","v":"NO"},"SECOP II",1,"Bogotá Mejor para Todos"]
[103,2020,"SECOP II","FDLC-CPS-103-2020","Contratos de prestación de servicios profesionales y de apoyo a la gestión","Contratación directa","Prestación de servicios profesionales y de apoyo a la gestión, o para la ejecución de trabajos artísticos que sólo puedan encomendarse a determinadas personas naturales;","PRESTACION DE SERVICIOS PROFESIONALES DE APOYO EN LA ADMINISTRACION DEL PUNTO VIVE DIGITAL DE LA LOCALIDAD LA CANDELARIA PARA FOMENTAR EN LA COMUNIDAD LAS TICS","Inversión","Bogotá Mejor para Todos",45,{"$f":"IF(ISERROR(VLOOKUP(K111,Eje_Pilar_Prop!$C$2:$E$104,2,FALSE)),\" \",VLOOKUP(K111,Eje_Pilar_Prop!$C$2:$E$104,2,FALSE))","v":"Gobernanza e influencia local, regional e internacional"},{"$f":"IF(ISERROR(VLOOKUP(K111,Eje_Pilar_Prop!$C$2:$E$104,3,FALSE)),\" \",VLOOKUP(K111,Eje_Pilar_Prop!$C$2:$E$104,3,FALSE))","v":"Eje Transversal 4 Gobierno Legitimo, Fortalecimiento Local y Eficiencia"},1395,79322403,"EDGAR YESID SILVA BUSTOS",16000000,null,null,0,null,16000000,16000000,"2020-07-06","2020-07-06","2020-11-05",120,null,null,null,null,null,null,null,null,null,"X",1,3,"Contratos de prestación de servicios profesionales y de apoyo a la gestión","Contratación directa",{"$f":"IF(ISBLANK(G111),1,IFERROR(VLOOKUP(G111,Tipo!$C$12:$C$27,1,FALSE),\"NO\"))","v":"Prestación de servicios profesionales y de apoyo a la gestión, o para la ejecución de trabajos artísticos que sólo puedan encomendarse a determinadas personas naturales;"},"Inversión",{"$f":"IF(ISBLANK(K111),1,IFERROR(VLOOKUP(K111,Eje_Pilar_Prop!C93:C194,1,FALSE),\"NO\"))","v":"NO"},"SECOP II",1,"Bogotá Mejor para Todos"]
[104,2020,"SECOP II","FDLC-CPS-104-2020","Contratos de prestación de servicios profesionales y de apoyo a la gestión","Contratación directa","Prestación de servicios profesionales y de apoyo a la gestión, o para la ejecución de trabajos artísticos que sólo puedan encomendarse a determinadas personas naturales;","PRESTACION DE SERVICIOS PROFESIONALES PARA APOYAR TÉCNICAMENTE LAS DISTINTAS ETAPAS DE LOS PROCESOS DE COMPETENCIA DE LA ALCALDÍA LOCAL PARA LA DEPURACIÓN DE ACTUACIONES ADMINISTRATIVAS","Inversión","Bogotá Mejor para Todos",45,{"$f":"IF(ISERROR(VLOOKUP(K112,Eje_Pilar_Prop!$C$2:$E$104,2,FALSE)),\" \",VLOOKUP(K112,Eje_Pilar_Prop!$C$2:$E$104,2,FALSE))","v":"Gobernanza e influencia local, regional e internacional"},{"$f":"IF(ISERROR(VLOOKUP(K112,Eje_Pilar_Prop!$C$2:$E$104,3,FALSE)),\" \",VLOOKUP(K112,Eje_Pilar_Prop!$C$2:$E$104,3,FALSE))","v":"Eje Transversal 4 Gobierno Legitimo, Fortalecimiento Local y Eficiencia"},1395,3023764906,"PAOLA ANDREA RANGEL MARTINEZ",16818704,null,null,0,null,16818704,15837613,"2020-07-08","2020-07-08","2020-11-07",120,null,null,null,null,null,null,null,null,null,"X",0.94166667063050757,2,"Contratos de prestación de servicios profesionales y de apoyo a la gestión","Contratación directa",{"$f":"IF(ISBLANK(G112),1,IFERROR(VLOOKUP(G112,Tipo!$C$12:$C$27,1,FALSE),\"NO\"))","v":"Prestación de servicios profesionales y de apoyo a la gestión, o para la ejecución de trabajos artísticos que sólo puedan encomendarse a determinadas personas naturales;"},"Inversión",{"$f":"IF(ISBLANK(K112),1,IFERROR(VLOOKUP(K112,Eje_Pilar_Prop!C94:C195,1,FALSE),\"NO\"))","v":"NO"},"SECOP II",1,"Bogotá Mejor para Todos"]
[105,2020,"SECOP II","FDLC-CPS-105-2020","Contratos de prestación de servicios profesionales y de apoyo a la gestión","Contratación directa","Prestación de servicios profesionales y de apoyo a la gestión, o para la ejecución de trabajos artísticos que sólo puedan encomendarse a determinadas personas naturales;","PRESTACIÓN DE SERVICIOS ASISTENCIALES DE APOYO A LA GESTION DEL FONDO DE DESARROLLO LOCAL DE LA CANDELARIA CDI PARA EL MANEJO Y PROESO DE DISTRIBUCIÓN DE CORRESPONDENCIA EN GENERAL","Inversión","Bogotá Mejor para Todos",45,{"$f":"IF(ISERROR(VLOOKUP(K113,Eje_Pilar_Prop!$C$2:$E$104,2,FALSE)),\" \",VLOOKUP(K113,Eje_Pilar_Prop!$C$2:$E$104,2,FALSE))","v":"Gobernanza e influencia local, regional e internacional"},{"$f":"IF(ISERROR(VLOOKUP(K113,Eje_Pilar_Prop!$C$2:$E$104,3,FALSE)),\" \",VLOOKUP(K113,Eje_Pilar_Prop!$C$2:$E$104,3,FALSE))","v":"Eje Transversal 4 Gobierno Legitimo, Fortalecimiento Local y Eficiencia"},1395,1010227910,"CARLOS ARMANDO GONZÁLEZ RASGO",9831392,null,null,0,null,9831392,9749463,"2020-07-09","2020-07-09","2020-11-08",120,null,null,null,null,null,null,null,null,null,"X",0.99166659207566943,3,"Contratos de prestación de servicios profesionales y de apoyo a la gestión","Contratación directa",{"$f":"IF(ISBLANK(G113),1,IFERROR(VLOOKUP(G113,Tipo!$C$12:$C$27,1,FALSE),\"NO\"))","v":"Prestación de servicios profesionales y de apoyo a la gestión, o para la ejecución de trabajos artísticos que sólo puedan encomendarse a determinadas personas naturales;"},"Inversión",{"$f":"IF(ISBLANK(K113),1,IFERROR(VLOOKUP(K113,Eje_Pilar_Prop!C95:C196,1,FALSE),\"NO\"))","v":"NO"},"SECOP II",1,"Bogotá Mejor para Todos"]
[106,2020,"SECOP II","FDLC-IMC-012-2020","Suministro","Contratación mínima cuantia","No aplica","ADQUIRIR A TODO COSTO, EL SERVICIO DE MANTENIMIENTO PREVENTIVO Y CORRECTIVO INTEGRAL CON SUMINISTRO DE REPUESTOS Y MANO DE OBRA PARA LOS VEHÍCULOS QUE CONFORMAN EL PARQUE AUTOMOTOR DEL FONDO DE DESARROLLO LOCAL DE LA CANDELARIA","Funcionamiento","Bogotá Mejor para Todos","No aplica","No Aplica","No Aplica","No Aplica",830134871,"TECNI CENTRO AUTOMOTRIZ JJ LTDA",19474650,null,null,0,null,19474650,null,"2020-07-10","2020-07-15","2021-02-14",210,null,null,null,null,null,null,null,"X",null,null,0,2,"Suministro","Contratación mínima cuantia",{"$f":"IF(ISBLANK(G114),1,IFERROR(VLOOKUP(G114,Tipo!$C$12:$C$27,1,FALSE),\"NO\"))","v":"NO"},"Funcionamiento",{"$f":"IF(ISBLANK(K114),1,IFERROR(VLOOKUP(K114,Eje_Pilar_Prop!C96:C197,1,FALSE),\"NO\"))","v":"NO"},"SECOP II",1,"Bogotá Mejor para Todos"]
[107,2020,"SECOP II","FDLC-CPS-107-2020","Contratos de prestación de servicios profesionales y de apoyo a la gestión","Contratación directa","Prestación de servicios profesionales y de apoyo a la gestión, o para la ejecución de trabajos artísticos que sólo puedan encomendarse a determinadas personas naturales;","PRESTACIÓN DE SERVICIOS PROFESIONALES PARA APOYAR JURÍDICAMENTE LA EJECUCIÓN DE LAS ACCIONES REQUERIDAS PARA LA DEPURACIÓN DE LAS ACTUACIONES ADMINISTRATIVAS QUE CURSAN EN LA ALCALDÍA LOCAL","Inversión","Bogotá Mejor para Todos",45,{"$f":"IF(ISERROR(VLOOKUP(K115,Eje_Pilar_Prop!$C$2:$E$104,2,FALSE)),\" \",VLOOKUP(K115,Eje_Pilar_Prop!$C$2:$E$104,2,FALSE))","v":"Gobernanza e influencia local, regional e internacional"},{"$f":"IF(ISERROR(VLOOKUP(K115,Eje_Pilar_Prop!$C$2:$E$104,3,FALSE)),\" \",VLOOKUP(K115,Eje_Pilar_Prop!$C$2:$E$104,3,FALSE))","v":"Eje Transversal 4 Gobierno Legitimo, Fortalecimiento Local y Eficiencia"},1395,51875915,"LUZ SOFIA AMAYA CASTAÑEDA",17907180,null,null,0,null,17907180,17907180,"2020-07-10","2020-07-10","2020-11-09",120,null,null,null,null,null,null,null,null,null,"X",1,2,"Contratos de prestación de servicios profesionales y de apoyo a la gestión","Contratación directa",{"$f":"IF(ISBLANK(G115),1,IFERROR(VLOOKUP(G115,Tipo!$C$12:$C$27,1,FALSE),\"NO\"))","v":"Prestación de servicios profesionales y de apoyo a la gestión, o para la ejecución de trabajos artísticos que sólo puedan encomendarse a determinadas personas naturales;"},"Inversión",{"$f":"IF(ISBLANK(K115),1,IFERROR(VLOOKUP(K115,Eje_Pilar_Prop!C97:C198,1,FALSE),\"NO\"))","v":"NO"},"SECOP II",1,"Bogotá Mejor para Todos"]
[108,2020,"SECOP II","FDLC-CPS-108-2020","Contratos de prestación de servicios profesionales y de apoyo a la gestión","Contratación directa","Prestación de servicios profesionales y de apoyo a la gestión, o para la ejecución de trabajos artísticos que sólo puedan encomendarse a determinadas personas naturales;"," PRESTACIÓN DE SERVICIOS PROFESIONALES PARA APOYAR JURÍDICAMENTE LA EJECUCIÓN DE LAS ACCIONES REQUERIDAS PARA LA DEPURACIÓN DE LAS ACTUACIONES ADMINISTRATIVAS QUE CURSAN EN LA ALCALDÍA LOCAL","Inversión","Bogotá Mejor para Todos",45,{"$f":"IF(ISERROR(VLOOKUP(K116,Eje_Pilar_Prop!$C$2:$E$104,2,FALSE)),\" \",VLOOKUP(K116,Eje_Pilar_Prop!$C$2:$E$104,2,FALSE))","v":"Gobernanza e influencia local, regional e internacional"},{"$f":"IF(ISERROR(VLOOKUP(K116,Eje_Pilar_Prop!$C$2:$E$104,3,FALSE)),\" \",VLOOKUP(K116,Eje_Pilar_Prop!$C$2:$E$104,3,FALSE))","v":"Eje Transversal 4 Gobierno Legitimo, Fortalecimiento Local y Eficiencia"},1395,41794885,"TERESA HERREÑO SOLANO",17907180,null,null,0,null,17907180,17907180,"2020-07-10","2020-07-10","2020-11-09",120,null,null,null,null,null,null,null,null,null,"X",1,2,"Contratos de prestación de servicios profesionales y de apoyo a la gestión","Contratación directa",{"$f":"IF(ISBLANK(G116),1,IFERROR(VLOOKUP(G116,Tipo!$C$12:$C$27,1,FALSE),\"NO\"))","v":"Prestación de servicios profesionales y de apoyo a la gestión, o para la ejecución de trabajos artísticos que sólo puedan encomendarse a determinadas personas naturales;"},"Inversión",{"$f":"IF(ISBLANK(K116),1,IFERROR(VLOOKUP(K116,Eje_Pilar_Prop!C98:C199,1,FALSE),\"NO\"))","v":"NO"},"SECOP II",1,"Bogotá Mejor para Todos"]
[109,2020,"SECOP II","FDLC-CPS-109-2020","Contratos de prestación de servicios profesionales y de apoyo a la gestión","Contratación directa","Prestación de servicios profesionales y de apoyo a la gestión, o para la ejecución de trabajos artísticos que sólo puedan encomendarse a determinadas personas naturales;"," PRESTACIÓN DE SERVICIOS PROFESIONALES PARA APOYAR JURÍDICAMENTE LA EJECUCIÓN DE LAS ACCIONES REQUERIDAS PARA LA DEPURACIÓN DE LAS ACTUACIONES ADMINISTRATIVAS QUE CURSAN EN LA ALCALDÍA LOCAL","Inversión","Bogotá Mejor para Todos",45,{"$f":"IF(ISERROR(VLOOKUP(K117,Eje_Pilar_Prop!$C$2:$E$104,2,FALSE)),\" \",VLOOKUP(K117,Eje_Pilar_Prop!$C$2:$E$104,2,FALSE))","v":"Gobernanza e influencia local, regional e internacional"},{"$f":"IF(ISERROR(VLOOKUP(K117,Eje_Pilar_Prop!$C$2:$E$104,3,FALSE)),\" \",VLOOKUP(K117,Eje_Pilar_Prop!$C$2:$E$104,3,FALSE))","v":"Eje Transversal 4 Gobierno Legitimo, Fortalecimiento Local y Eficiencia"},1395,79691880,"JORGE ELIECER DURAN CONSUEGRA",17907180,null,null,0,null,17907180,17907180,"2020-07-10","2020-07-10","2020-11-09",120,null,null,null,null,null,null,null,null,null,"X",1,2,"Contratos de prestación de servicios profesionales y de apoyo a la gestión","Contratación directa",{"$f":"IF(ISBLANK(G117),1,IFERROR(VLOOKUP(G117,Tipo!$C$12:$C$27,1,FALSE),\"NO\"))","v":"Prestación de servicios profesionales y de apoyo a la gestión, o para la ejecución de trabajos artísticos que sólo puedan encomendarse a determinadas personas naturales;"},"Inversión",{"$f":"IF(ISBLANK(K117),1,IFERROR(VLOOKUP(K117,Eje_Pilar_Prop!C99:C200,1,FALSE),\"NO\"))","v":"NO"},"SECOP II",1,"Bogotá Mejor para Todos"]
[110,2020,"SECOP II","FDLC-CPS-110-2020","Contratos de prestación de servicios profesionales y de apoyo a la gestión","Contratación directa","Prestación de servicios profesionales y de apoyo a la gestión, o para la ejecución de trabajos artísticos que sólo puedan encomendarse a determinadas personas naturales;","PRESTACIÓN DE SERVICIOS PROFESIONALES AL FONDO DE DESARROLLO LOCAL DE LA CANDELARIA, EN LOS TRÁMITES RELACIONADOS CON LOS PROCESOS PRECONTRACTUALES, CONTRACTUALES Y POS CONTRACTUALES Y EN LAS DEMÁS ACTIVIDADES QUE ALLÍ SE REQUIERAN, DE CONFORMIDAD CON LOS ESTUDIOS PREVIOS","Inversión","Bogotá Mejor para Todos",45,{"$f":"IF(ISERROR(VLOOKUP(K118,Eje_Pilar_Prop!$C$2:$E$104,2,FALSE)),\" \",VLOOKUP(K118,Eje_Pilar_Prop!$C$2:$E$104,2,FALSE))","v":"Gobernanza e influencia local, regional e internacional"},{"$f":"IF(ISERROR(VLOOKUP(K118,Eje_Pilar_Prop!$C$2:$E$104,3,FALSE)),\" \",VLOOKUP(K118,Eje_Pilar_Prop!$C$2:$E$104,3,FALSE))","v":"Eje Transversal 4 Gobierno Legitimo, Fortalecimiento Local y Eficiencia"},1395,1032363826,"PAOLA ANDREA PADILLA AYARZA ",16134016,null,null,0,null,16134016,16134016,"2020-07-13","2020-07-13","2020-11-12",120,null,null,null,null,null,null,null,null,null,"X",1,2,"Contratos de prestación de servicios profesionales y de apoyo a la gestión","Contratación directa",{"$f":"IF(ISBLANK(G118),1,IFERROR(VLOOKUP(G118,Tipo!$C$12:$C$27,1,FALSE),\"NO\"))","v":"Prestación de servicios profesionales y de apoyo a la gestión, o para la ejecución de trabajos artísticos que sólo puedan encomendarse a determinadas personas naturales;"},"Inversión",{"$f":"IF(ISBLANK(K118),1,IFERROR(VLOOKUP(K118,Eje_Pilar_Prop!C100:C201,1,FALSE),\"NO\"))","v":"NO"},"SECOP II",1,"Bogotá Mejor para Todos"]
[111,2020,"SECOP II","FDLC-IMC-013-2020","Contratos de prestación de servicios profesionales y de apoyo a la gestión","Contratación directa","No aplica","ADQUIRIR A MONTO AGOTABLE LOS ELEMENTOS DE PROTECCIÓN PERSONAL Y DE BIOSEGURIDAD NECESARIOS PARA LA PROTECCIÓN DEL PERSONAL DE LA ALCALDÍA LOCAL DE LA CANDELARIA, CON OCASIÓN DEL CORONAVIRUS COVID 19","Inversión","Bogotá Mejor para Todos",45,{"$f":"IF(ISERROR(VLOOKUP(K119,Eje_Pilar_Prop!$C$2:$E$104,2,FALSE)),\" \",VLOOKUP(K119,Eje_Pilar_Prop!$C$2:$E$104,2,FALSE))","v":"Gobernanza e influencia local, regional e internacional"},{"$f":"IF(ISERROR(VLOOKUP(K119,Eje_Pilar_Prop!$C$2:$E$104,3,FALSE)),\" \",VLOOKUP(K119,Eje_Pilar_Prop!$C$2:$E$104,3,FALSE))","v":"Eje Transversal 4 Gobierno Legitimo, Fortalecimiento Local y Eficiencia"},1395,8600532749,"GRUPO LOS LAGOS SAS",16600158,null,null,0,null,16600158,0,"2020-07-15","2020-07-29","2020-08-28",30,null,null,null,null,null,null,"X",null,null,null,0,2,"Contratos de prestación de servicios profesionales y de apoyo a la gestión","Contratación directa",{"$f":"IF(ISBLANK(G119),1,IFERROR(VLOOKUP(G119,Tipo!$C$12:$C$27,1,FALSE),\"NO\"))","v":"NO"},"Inversión",{"$f":"IF(ISBLANK(K119),1,IFERROR(VLOOKUP(K119,Eje_Pilar_Prop!C101:C202,1,FALSE),\"NO\"))","v":"NO"},"SECOP II",1,"Bogotá Mejor para Todos"]
[112,2020,"SECOP II","FDLC-CPS-112-2020","Contratos de prestación de servicios profesionales y de apoyo a la gestión","Contratación directa","Prestación de servicios profesionales y de apoyo a la gestión, o para la ejecución de trabajos artísticos que sólo puedan encomendarse a determinadas personas naturales;","APOYAR ADMINISTRATIVA Y ASISTENCIALMENTE A LAS INSPECCIONES DE POLICÍA DE LA LOCALIDAD","Inversión","Bogotá Mejor para Todos",45,{"$f":"IF(ISERROR(VLOOKUP(K120,Eje_Pilar_Prop!$C$2:$E$104,2,FALSE)),\" \",VLOOKUP(K120,Eje_Pilar_Prop!$C$2:$E$104,2,FALSE))","v":"Gobernanza e influencia local, regional e internacional"},{"$f":"IF(ISERROR(VLOOKUP(K120,Eje_Pilar_Prop!$C$2:$E$104,3,FALSE)),\" \",VLOOKUP(K120,Eje_Pilar_Prop!$C$2:$E$104,3,FALSE))","v":"Eje Transversal 4 Gobierno Legitimo, Fortalecimiento Local y Eficiencia"},1395,1022956077,"JARRY EMERSON RIAÑO DELGADO",7549104,null,null,0,null,7549104,7549104,"2020-07-23","2020-07-29","2020-11-28",120,null,null,null,null,null,null,null,null,null,"X",1,2,"Contratos de prestación de servicios profesionales y de apoyo a la gestión","Contratación directa",{"$f":"IF(ISBLANK(G120),1,IFERROR(VLOOKUP(G120,Tipo!$C$12:$C$27,1,FALSE),\"NO\"))","v":"Prestación de servicios profesionales y de apoyo a la gestión, o para la ejecución de trabajos artísticos que sólo puedan encomendarse a determinadas personas naturales;"},"Inversión",{"$f":"IF(ISBLANK(K120),1,IFERROR(VLOOKUP(K120,Eje_Pilar_Prop!C102:C203,1,FALSE),\"NO\"))","v":"NO"},"SECOP II",1,"Bogotá Mejor para Todos"]
[113,2020,"SECOP II","FDLC-CPS-113-2020","Contratos de prestación de servicios profesionales y de apoyo a la gestión","Contratación Directa","Prestación de servicios profesionales y de apoyo a la gestión, o para la ejecución de trabajos artísticos que sólo puedan encomendarse a determinadas personas naturales;","PRESTAR SERVICIO ASISTENCIAL DE APOYO EN EL ÁREA DE GESTIÓN DE DESARROLLO LOCAL—CDI, PARA LA NOTIFICACIÓN DE CORRESPONDENCIA EN GENERAL.","Inversión","Bogotá Mejor para Todos",45,{"$f":"IF(ISERROR(VLOOKUP(K121,Eje_Pilar_Prop!$C$2:$E$104,2,FALSE)),\" \",VLOOKUP(K121,Eje_Pilar_Prop!$C$2:$E$104,2,FALSE))","v":"Gobernanza e influencia local, regional e internacional"},{"$f":"IF(ISERROR(VLOOKUP(K121,Eje_Pilar_Prop!$C$2:$E$104,3,FALSE)),\" \",VLOOKUP(K121,Eje_Pilar_Prop!$C$2:$E$104,3,FALSE))","v":"Eje Transversal 4 Gobierno Legitimo, Fortalecimiento Local y Eficiencia"},1395,1121855155,"HERNAN EDUARDO RODRIGUEZ BEDOYA",8075788,null,null,1,4037894,12113682,10229331,"2020-07-23","2020-07-29","27/ 01/ 2021",120,1,60,null,null,null,null,null,null,"X",null,0.84444440592051206,2]
[114,2020,"SECOP II","FDLC-CPS-114-2020","Contratos de prestación de servicios profesionales y de apoyo a la gestión","Contratación directa","Prestación de servicios profesionales y de apoyo a la gestión, o para la ejecución de trabajos artísticos que sólo puedan encomendarse a determinadas personas naturales;"," PRESTAR SERVICIO ASISTENCIAL DE APOYO EN EL ÁREA DE GESTIÓN DE DESARROLLO LOCAL—CDI, PARA LA NOTIFICACIÓN DE CORRESPONDENCIA EN GENERAL.","Inversión","Bogotá Mejor para Todos",45,{"$f":"IF(ISERROR(VLOOKUP(K122,Eje_Pilar_Prop!$C$2:$E$104,2,FALSE)),\" \",VLOOKUP(K122,Eje_Pilar_Prop!$C$2:$E$104,2,FALSE))","v":"Gobernanza e influencia local, regional e internacional"},{"$f":"IF(ISERROR(VLOOKUP(K122,Eje_Pilar_Prop!$C$2:$E$104,3,FALSE)),\" \",VLOOKUP(K122,Eje_Pilar_Prop!$C$2:$E$104,3,FALSE))","v":"Eje Transversal 4 Gobierno Legitimo, Fortalecimiento Local y Eficiencia"},1395,1122727530,"JESSE JOSE VILLEGAS CABRERA",8075788,null,null,0,null,8075788,8075787,"2020-07-23","2020-07-29","2020-11-28",120,null,null,null,null,null,null,null,null,null,"X",0.9999998761730744,2,"Contratos de prestación de servicios profesionales y de apoyo a la gestión","Contratación directa",{"$f":"IF(ISBLANK(G122),1,IFERROR(VLOOKUP(G122,Tipo!$C$12:$C$27,1,FALSE),\"NO\"))","v":"Prestación de servicios profesionales y de apoyo a la gestión, o para la ejecución de trabajos artísticos que sólo puedan encomendarse a determinadas personas naturales;"},"Inversión",{"$f":"IF(ISBLANK(K122),1,IFERROR(VLOOKUP(K122,Eje_Pilar_Prop!C103:C204,1,FALSE),\"NO\"))","v":"NO"},"SECOP II",1,"Bogotá Mejor para Todos"]
[115,2020,"SECOP II","FDLC-CPS-115-2020","Contratos de prestación de servicios profesionales y de apoyo a la gestión","Contratación directa","Prestación de servicios profesionales y de apoyo a la gestión, o para la ejecución de trabajos artísticos que sólo puedan encomendarse a determinadas personas naturales;"," PRESTACIÓN DE SERVICIOS PROFESIONALES PARA APOYAR JURÍDICAMENTE LA EJECUCIÓN DE LAS ACCIONES REQUERIDAS PARA LA DEPURACIÓN DE LAS ACTUACIONES ADMINISTRATIVAS QUE CURSAN EN LA ALCALDÍA LOCA","Inversión","Bogotá Mejor para Todos",45,{"$f":"IF(ISERROR(VLOOKUP(K123,Eje_Pilar_Prop!$C$2:$E$104,2,FALSE)),\" \",VLOOKUP(K123,Eje_Pilar_Prop!$C$2:$E$104,2,FALSE))","v":"Gobernanza e influencia local, regional e internacional"},{"$f":"IF(ISERROR(VLOOKUP(K123,Eje_Pilar_Prop!$C$2:$E$104,3,FALSE)),\" \",VLOOKUP(K123,Eje_Pilar_Prop!$C$2:$E$104,3,FALSE))","v":"Eje Transversal 4 Gobierno Legitimo, Fortalecimiento Local y Eficiencia"},1395,32645897,"Miryam Esther Lopez Rodriguez",17907180,null,null,0,null,17907180,17907180,"2020-07-22","2020-07-29","2020-11-28",120,null,null,null,null,null,null,null,null,null,"X",1,{"$f":"IF(SUMPRODUCT((A$14:A123=A123)*(B$14:B123=B123)*(D$14:D123=D123))>1,0,1)","v":1},"Contratos de prestación de servicios profesionales y de apoyo a la gestión","Contratación directa",{"$f":"IF(ISBLANK(G123),1,IFERROR(VLOOKUP(G123,Tipo!$C$12:$C$27,1,FALSE),\"NO\"))","v":"Prestación de servicios profesionales y de apoyo a la gestión, o para la ejecución de trabajos artísticos que sólo puedan encomendarse a determinadas personas naturales;"},"Inversión",{"$f":"IF(ISBLANK(K123),1,IFERROR(VLOOKUP(K123,Eje_Pilar_Prop!C104:C205,1,FALSE),\"NO\"))","v":"NO"},"SECOP II",1,"Bogotá Mejor para Todos"]
[116,2020,"SECOP II","FDLC-CPS-116-2020","Contratos de prestación de servicios profesionales y de apoyo a la gestión","Contratación directa","Prestación de servicios profesionales y de apoyo a la gestión, o para la ejecución de trabajos artísticos que sólo puedan encomendarse a determinadas personas naturales;","PRESTACIÓN DE SERVICIOS PROFESIONALES PARA LA IMPLEMENTACIÓN Y FORTALECIMIENTO DEL TURISMO CULTURAL EN LA LOCALIDAD 17 DE LA CANDELARIA A TRAVÉS DE LA GESTIÓN, ARTICULACIÓN E INTERLOCUCIÓN CON CIUDADANÍA Y ENTIDADES PÚBLICAS Y PRIVADAS","Inversión","Bogotá Mejor para Todos",45,{"$f":"IF(ISERROR(VLOOKUP(K124,Eje_Pilar_Prop!$C$2:$E$104,2,FALSE)),\" \",VLOOKUP(K124,Eje_Pilar_Prop!$C$2:$E$104,2,FALSE))","v":"Gobernanza e influencia local, regional e internacional"},{"$f":"IF(ISERROR(VLOOKUP(K124,Eje_Pilar_Prop!$C$2:$E$104,3,FALSE)),\" \",VLOOKUP(K124,Eje_Pilar_Prop!$C$2:$E$104,3,FALSE))","v":"Eje Transversal 4 Gobierno Legitimo, Fortalecimiento Local y Eficiencia"},1395,1036628060,"Steffy Rossmary Zemanate Mora",15449332,null,null,0,null,15449332,11586999,"2020-07-22","2020-07-31","2020-11-30",120,null,null,null,null,null,null,null,null,"X",null,0.75,{"$f":"IF(SUMPRODUCT((A$14:A124=A124)*(B$14:B124=B124)*(D$14:D124=D124))>1,0,1)","v":1},"Contratos de prestación de servicios profesionales y de apoyo a la gestión","Contratación directa",{"$f":"IF(ISBLANK(G124),1,IFERROR(VLOOKUP(G124,Tipo!$C$12:$C$27,1,FALSE),\"NO\"))","v":"Prestación de servicios profesionales y de apoyo a la gestión, o para la ejecución de trabajos artísticos que sólo puedan encomendarse a determinadas personas naturales;"},"Inversión",{"$f":"IF(ISBLANK(K124),1,IFERROR(VLOOKUP(K124,Eje_Pilar_Prop!C105:C206,1,FALSE),\"NO\"))","v":"NO"},"SECOP II",1,"Bogotá Mejor para Todos"]
[117,2020,"SECOP II","FDLC-LP-007-2020","Contratos de prestación de servicios","Licitación pública","No aplica","PRESTACION DEL SERVICIO DE VIGILANCIA Y SEGURIDAD PRIVADA INTEGRAL PERMANENTE PARA TODOS LOS BIENES MUEBLES E INMUEBLES DE PROPIEDAD DE LA ENTIDAD, Y DE LOS QUE LEGALMENTE SEA O LLEGARE A SER RESPONSABLE EL FONDO DE DESARROLLO LOCAL DE LA CANDELARIA","Funcionamiento","Bogotá Mejor para Todos","No aplica","No Aplica","No Aplica","No Aplica",860011268,"ASOCIACIÓN MODERNA COLOMBIANA DE VIGILANCIA TÉCNICA - AMCOVIT LTDA",457431395,null,null,2,109317205,566748600,350061490,"2020-07-24","2020-07-24","2021-04-01",180,2,71,null,null,null,null,null,"X",null,null,0.61766626331322216,2,"Contratos de prestación de servicios","Licitación pública",{"$f":"IF(ISBLANK(G125),1,IFERROR(VLOOKUP(G125,Tipo!$C$12:$C$27,1,FALSE),\"NO\"))","v":"NO"},"Funcionamiento",{"$f":"IF(ISBLANK(K125),1,IFERROR(VLOOKUP(K125,Eje_Pilar_Prop!C106:C207,1,FALSE),\"NO\"))","v":"NO"},"SECOP II",1,"Bogotá Mejor para Todos"]
[118,2020,"SECOP II","FDLC-CPS-118-2020","Contratos de prestación de servicios profesionales y de apoyo a la gestión","Contratación directa","Prestación de servicios profesionales y de apoyo a la gestión, o para la ejecución de trabajos artísticos que sólo puedan encomendarse a determinadas personas naturales;","PRESTAR SERVICIOS DE APOYO COMO CONDUCTOR DE LOS VEHICULOS QUE SE ENCUENTRAN A CARGO DEL FONDO DE DESARROLLO LOCAL LA CANDELARIA","Inversión","Bogotá Mejor para Todos",45,{"$f":"IF(ISERROR(VLOOKUP(K126,Eje_Pilar_Prop!$C$2:$E$104,2,FALSE)),\" \",VLOOKUP(K126,Eje_Pilar_Prop!$C$2:$E$104,2,FALSE))","v":"Gobernanza e influencia local, regional e internacional"},{"$f":"IF(ISERROR(VLOOKUP(K126,Eje_Pilar_Prop!$C$2:$E$104,3,FALSE)),\" \",VLOOKUP(K126,Eje_Pilar_Prop!$C$2:$E$104,3,FALSE))","v":"Eje Transversal 4 Gobierno Legitimo, Fortalecimiento Local y Eficiencia"},1395,79381970,"FERNANDO FORERO BRESNEIDER",9831392,null,null,0,null,9831392,9831392,"2020-07-23","2020-07-29","2020-11-28",120,null,null,null,null,null,null,null,null,null,"X",1,2,"Contratos de prestación de servicios profesionales y de apoyo a la gestión","Contratación directa",{"$f":"IF(ISBLANK(G126),1,IFERROR(VLOOKUP(G126,Tipo!$C$12:$C$27,1,FALSE),\"NO\"))","v":"Prestación de servicios profesionales y de apoyo a la gestión, o para la ejecución de trabajos artísticos que sólo puedan encomendarse a determinadas personas naturales;"},"Inversión",{"$f":"IF(ISBLANK(K126),1,IFERROR(VLOOKUP(K126,Eje_Pilar_Prop!C107:C208,1,FALSE),\"NO\"))","v":"NO"},"SECOP II",1,"Bogotá Mejor para Todos"]
[119,2020,"SECOP II","FDLC-CPS-119-2020","Contratos de prestación de servicios profesionales y de apoyo a la gestión","Contratación directa","Prestación de servicios profesionales y de apoyo a la gestión, o para la ejecución de trabajos artísticos que sólo puedan encomendarse a determinadas personas naturales;","PRESTAR LOS SERVICIOS DE APOYO LOGÍSTICO EN TODOS LOS EVENTOS Y ACTIVIDADES DE LA ADMINISTRACIÓN LOCAL DE LA LOCALIDAD 17 DE LA CANDELARIA","Inversión","Bogotá Mejor para Todos",45,{"$f":"IF(ISERROR(VLOOKUP(K127,Eje_Pilar_Prop!$C$2:$E$104,2,FALSE)),\" \",VLOOKUP(K127,Eje_Pilar_Prop!$C$2:$E$104,2,FALSE))","v":"Gobernanza e influencia local, regional e internacional"},{"$f":"IF(ISERROR(VLOOKUP(K127,Eje_Pilar_Prop!$C$2:$E$104,3,FALSE)),\" \",VLOOKUP(K127,Eje_Pilar_Prop!$C$2:$E$104,3,FALSE))","v":"Eje Transversal 4 Gobierno Legitimo, Fortalecimiento Local y Eficiencia"},1395,65788328,"Emperatriz Gonzalez Palencia",8075788,null,null,0,null,8075788,8075788,"2020-07-23","2020-07-29","2020-11-28",120,null,null,null,null,null,null,null,null,null,"X",1,2,"Contratos de prestación de servicios profesionales y de apoyo a la gestión","Contratación directa",{"$f":"IF(ISBLANK(G127),1,IFERROR(VLOOKUP(G127,Tipo!$C$12:$C$27,1,FALSE),\"NO\"))","v":"Prestación de servicios profesionales y de apoyo a la gestión, o para la ejecución de trabajos artísticos que sólo puedan encomendarse a determinadas personas naturales;"},"Inversión",{"$f":"IF(ISBLANK(K127),1,IFERROR(VLOOKUP(K127,Eje_Pilar_Prop!C108:C209,1,FALSE),\"NO\"))","v":"NO"},"SECOP II",1,"Bogotá Mejor para Todos"]
[120,2020,"SECOP II","FDLC-CPS-120-2020","Contratos de prestación de servicios profesionales y de apoyo a la gestión","Contratación directa","Prestación de servicios profesionales y de apoyo a la gestión, o para la ejecución de trabajos artísticos que sólo puedan encomendarse a determinadas personas naturales;","PRESTACIÓN DE SERVICIOS DE APOYO TÉCNICO EN LA ADMINISTRACIÓN DE LAS CASAS COMUNITARIAS DE LA LOCALIDAD DE LA CANDELARIA DE CONFORMIDAD CON EL ACUERDO LOCAL 006 DE 2013","Inversión","Bogotá Mejor para Todos",45,{"$f":"IF(ISERROR(VLOOKUP(K128,Eje_Pilar_Prop!$C$2:$E$104,2,FALSE)),\" \",VLOOKUP(K128,Eje_Pilar_Prop!$C$2:$E$104,2,FALSE))","v":"Gobernanza e influencia local, regional e internacional"},{"$f":"IF(ISERROR(VLOOKUP(K128,Eje_Pilar_Prop!$C$2:$E$104,3,FALSE)),\" \",VLOOKUP(K128,Eje_Pilar_Prop!$C$2:$E$104,3,FALSE))","v":"Eje Transversal 4 Gobierno Legitimo, Fortalecimiento Local y Eficiencia"},1395,51653505,"DORA CECILIA JIMENEZ MORENO",11587000,null,null,0,null,11587000,8690250,"2020-07-23","2020-07-29","2020-11-28",120,null,null,null,null,null,null,null,null,"X",null,0.75,2,"Contratos de prestación de servicios profesionales y de apoyo a la gestión","Contratación directa",{"$f":"IF(ISBLANK(G128),1,IFERROR(VLOOKUP(G128,Tipo!$C$12:$C$27,1,FALSE),\"NO\"))","v":"Prestación de servicios profesionales y de apoyo a la gestión, o para la ejecución de trabajos artísticos que sólo puedan encomendarse a determinadas personas naturales;"},"Inversión",{"$f":"IF(ISBLANK(K128),1,IFERROR(VLOOKUP(K128,Eje_Pilar_Prop!C109:C210,1,FALSE),\"NO\"))","v":"NO"},"SECOP II",1,"Bogotá Mejor para Todos"]
[121,2020,"SECOP II","FDLC-CPS-121-2020","Contratos de prestación de servicios profesionales y de apoyo a la gestión","Contratación directa","Prestación de servicios profesionales y de apoyo a la gestión, o para la ejecución de trabajos artísticos que sólo puedan encomendarse a determinadas personas naturales;","PRESTAR SUS SERVICIOS PROFESIONALES PARA APOYAR LA EJECUCIÓN, SEGUIMIENTO Y EVALUACIÓN DEL CONJUNTO DE ACTIVIDADES PARA EL DESARROLLO DE LOS ENCUENTROS CIUDADANOS DE LA LOCALIDAD DE LA CANDELARIA","Inversión","Bogotá Mejor para Todos",45,{"$f":"IF(ISERROR(VLOOKUP(K129,Eje_Pilar_Prop!$C$2:$E$104,2,FALSE)),\" \",VLOOKUP(K129,Eje_Pilar_Prop!$C$2:$E$104,2,FALSE))","v":"Gobernanza e influencia local, regional e internacional"},{"$f":"IF(ISERROR(VLOOKUP(K129,Eje_Pilar_Prop!$C$2:$E$104,3,FALSE)),\" \",VLOOKUP(K129,Eje_Pilar_Prop!$C$2:$E$104,3,FALSE))","v":"Eje Transversal 4 Gobierno Legitimo, Fortalecimiento Local y Eficiencia"},1396,39650075,"LUZ ADRIANA GUTIÉRREZ BERNAL",12614028,null,null,0,null,12614028,8409352,"2020-07-27","2020-07-31","2020-10-30",90,null,null,null,null,null,null,null,null,"X",null,0.66666666666666663,2,"Contratos de prestación de servicios profesionales y de apoyo a la gestión","Contratación directa",{"$f":"IF(ISBLANK(G129),1,IFERROR(VLOOKUP(G129,Tipo!$C$12:$C$27,1,FALSE),\"NO\"))","v":"Prestación de servicios profesionales y de apoyo a la gestión, o para la ejecución de trabajos artísticos que sólo puedan encomendarse a determinadas personas naturales;"},"Inversión",{"$f":"IF(ISBLANK(K129),1,IFERROR(VLOOKUP(K129,Eje_Pilar_Prop!C110:C211,1,FALSE),\"NO\"))","v":"NO"},"SECOP II",1,"Bogotá Mejor para Todos"]
[122,2020,"SECOP II","FDLC-CPS-122-2020","Contratos de prestación de servicios profesionales y de apoyo a la gestión","Contratación directa","Prestación de servicios profesionales y de apoyo a la gestión, o para la ejecución de trabajos artísticos que sólo puedan encomendarse a determinadas personas naturales;","PRESTACIÓN DE SERVICIOS PROFESIONALES AL ÁREA DE GESTIÓN DE DESARROLLO LOCAL EN LA IMPLEMENTACIÓN, CARGE, MANEJO, VALIDACIÓN Y ACTUALIZACIÓN DE LA INFORMACIÓN PRE CONTRACTUAL EN EL APLICATIVO SIPSE","Inversión","Bogotá Mejor para Todos",45,{"$f":"IF(ISERROR(VLOOKUP(K130,Eje_Pilar_Prop!$C$2:$E$104,2,FALSE)),\" \",VLOOKUP(K130,Eje_Pilar_Prop!$C$2:$E$104,2,FALSE))","v":"Gobernanza e influencia local, regional e internacional"},{"$f":"IF(ISERROR(VLOOKUP(K130,Eje_Pilar_Prop!$C$2:$E$104,3,FALSE)),\" \",VLOOKUP(K130,Eje_Pilar_Prop!$C$2:$E$104,3,FALSE))","v":"Eje Transversal 4 Gobierno Legitimo, Fortalecimiento Local y Eficiencia"},1395,1010198763,"Carlos Mauricio Palomar Covaleda ",15449332,null,null,1,7724666,23173998,15706820,"2020-07-27","2020-07-29","2021-01-27",120,1,60,null,null,null,null,null,null,"X",null,0.67777774037954086,2,"Contratos de prestación de servicios profesionales y de apoyo a la gestión","Contratación directa",{"$f":"IF(ISBLANK(G130),1,IFERROR(VLOOKUP(G130,Tipo!$C$12:$C$27,1,FALSE),\"NO\"))","v":"Prestación de servicios profesionales y de apoyo a la gestión, o para la ejecución de trabajos artísticos que sólo puedan encomendarse a determinadas personas naturales;"},"Inversión",{"$f":"IF(ISBLANK(K130),1,IFERROR(VLOOKUP(K130,Eje_Pilar_Prop!C111:C212,1,FALSE),\"NO\"))","v":"NO"},"SECOP II",1,"Bogotá Mejor para Todos"]
[123,2020,"SECOP II","FDLC-CPS-123-2020","Contratos de prestación de servicios profesionales y de apoyo a la gestión","Contratación directa","Prestación de servicios profesionales y de apoyo a la gestión, o para la ejecución de trabajos artísticos que sólo puedan encomendarse a determinadas personas naturales;","PRESTACIÓN DE SERVICIOS PROFESIONALES PARA APOYAR AL ÁREA DE GESTIÓN DE DESARROLLO LOCAL, EN TEMAS SEGUIMIENTO DE LOS PROGRAMAS Y PROYECTOS DEL PLAN DE DESARROLLO LOCAL, ASÍ COMO DE LOS PROCESOS DE OBLIGACIONES POR PAGAR DEL FDLC","Inversión","Bogotá Mejor para Todos",45,{"$f":"IF(ISERROR(VLOOKUP(K131,Eje_Pilar_Prop!$C$2:$E$104,2,FALSE)),\" \",VLOOKUP(K131,Eje_Pilar_Prop!$C$2:$E$104,2,FALSE))","v":"Gobernanza e influencia local, regional e internacional"},{"$f":"IF(ISERROR(VLOOKUP(K131,Eje_Pilar_Prop!$C$2:$E$104,3,FALSE)),\" \",VLOOKUP(K131,Eje_Pilar_Prop!$C$2:$E$104,3,FALSE))","v":"Eje Transversal 4 Gobierno Legitimo, Fortalecimiento Local y Eficiencia"},1395,52803510,"LILIANA CAÑAVERAL DEL RIO",15905790,null,null,0,null,15905790,0,"2020-07-27","2020-07-31","2020-11-30",120,null,null,null,null,null,null,null,null,"X",null,0,3,"Contratos de prestación de servicios profesionales y de apoyo a la gestión","Contratación directa",{"$f":"IF(ISBLANK(G131),1,IFERROR(VLOOKUP(G131,Tipo!$C$12:$C$27,1,FALSE),\"NO\"))","v":"Prestación de servicios profesionales y de apoyo a la gestión, o para la ejecución de trabajos artísticos que sólo puedan encomendarse a determinadas personas naturales;"},"Inversión",{"$f":"IF(ISBLANK(K131),1,IFERROR(VLOOKUP(K131,Eje_Pilar_Prop!C112:C213,1,FALSE),\"NO\"))","v":"NO"},"SECOP II",1,"Bogotá Mejor para Todos"]
[124,2020,"SECOP II","FDLC-CPS-124-2020","Contratos de prestación de servicios profesionales y de apoyo a la gestión","Contratación directa","Prestación de servicios profesionales y de apoyo a la gestión, o para la ejecución de trabajos artísticos que sólo puedan encomendarse a determinadas personas naturales;","PRESTAR LOS SERVICIOS DE APOYO LOGÍSTICO EN TODOS LOS EVENTOS Y ACTIVIDADES DE LA ADMINISTRACIÓN LOCAL DE LA LOCALIDAD 17 DE LA CANDELARIA","Inversión","Bogotá Mejor para Todos",45,{"$f":"IF(ISERROR(VLOOKUP(K132,Eje_Pilar_Prop!$C$2:$E$104,2,FALSE)),\" \",VLOOKUP(K132,Eje_Pilar_Prop!$C$2:$E$104,2,FALSE))","v":"Gobernanza e influencia local, regional e internacional"},{"$f":"IF(ISERROR(VLOOKUP(K132,Eje_Pilar_Prop!$C$2:$E$104,3,FALSE)),\" \",VLOOKUP(K132,Eje_Pilar_Prop!$C$2:$E$104,3,FALSE))","v":"Eje Transversal 4 Gobierno Legitimo, Fortalecimiento Local y Eficiencia"},1395,1085280532,"DEIVIS ARAVIT GORDILLO GUTIERREZ",8075788,null,null,0,null,8075788,4105192,"2020-07-29","2020-07-30","2020-11-29",120,null,null,null,null,null,null,null,null,"X",null,0.50833330444038405,2,"Contratos de prestación de servicios profesionales y de apoyo a la gestión","Contratación directa",{"$f":"IF(ISBLANK(G132),1,IFERROR(VLOOKUP(G132,Tipo!$C$12:$C$27,1,FALSE),\"NO\"))","v":"Prestación de servicios profesionales y de apoyo a la gestión, o para la ejecución de trabajos artísticos que sólo puedan encomendarse a determinadas personas naturales;"},"Inversión",{"$f":"IF(ISBLANK(K132),1,IFERROR(VLOOKUP(K132,Eje_Pilar_Prop!C113:C214,1,FALSE),\"NO\"))","v":"NO"},"SECOP II",1,"Bogotá Mejor para Todos"]
[125,2020,"SECOP II","FDLC-CPS-125-2020","Contratos de prestación de servicios profesionales y de apoyo a la gestión","Contratación directa","Prestación de servicios profesionales y de apoyo a la gestión, o para la ejecución de trabajos artísticos que sólo puedan encomendarse a determinadas personas naturales;","PRESTACIÓN DE SERVICIOS DE APOYO TÉCNICO EN LA ADMINISTRACIÓN DE LAS CASAS COMUNITARIAS DE LA LOCALIDAD DE LA CANDELARIA DE CONFORMIDAD CON EL ACUERDO LOCAL 006 DE 2013","Inversión","Bogotá Mejor para Todos",45,{"$f":"IF(ISERROR(VLOOKUP(K133,Eje_Pilar_Prop!$C$2:$E$104,2,FALSE)),\" \",VLOOKUP(K133,Eje_Pilar_Prop!$C$2:$E$104,2,FALSE))","v":"Gobernanza e influencia local, regional e internacional"},{"$f":"IF(ISERROR(VLOOKUP(K133,Eje_Pilar_Prop!$C$2:$E$104,3,FALSE)),\" \",VLOOKUP(K133,Eje_Pilar_Prop!$C$2:$E$104,3,FALSE))","v":"Eje Transversal 4 Gobierno Legitimo, Fortalecimiento Local y Eficiencia"},1395,52219649,"INDIRA BETANCOURT MACUASE",11587000,null,null,0,null,11587000,11587000,"2020-07-27","2020-07-30","2020-11-29",120,null,null,null,null,null,null,null,null,null,"X",1,2,"Contratos de prestación de servicios profesionales y de apoyo a la gestión","Contratación directa",{"$f":"IF(ISBLANK(G133),1,IFERROR(VLOOKUP(G133,Tipo!$C$12:$C$27,1,FALSE),\"NO\"))","v":"Prestación de servicios profesionales y de apoyo a la gestión, o para la ejecución de trabajos artísticos que sólo puedan encomendarse a determinadas personas naturales;"},"Inversión",{"$f":"IF(ISBLANK(K133),1,IFERROR(VLOOKUP(K133,Eje_Pilar_Prop!C114:C215,1,FALSE),\"NO\"))","v":"NO"},"SECOP II",1,"Bogotá Mejor para Todos"]
[126,2020,"SECOP II","FDLC-CPS-126-2020","Contratos de prestación de servicios profesionales y de apoyo a la gestión","Contratación directa","Prestación de servicios profesionales y de apoyo a la gestión, o para la ejecución de trabajos artísticos que sólo puedan encomendarse a determinadas personas naturales;","PRESTACIÓN DE SERVICIOS PROFESIONALES AL FONDO DE DESARROLLO LOCAL DE LA CANDELARIA PARA ATENDER LAS PETICIONES PRESENTADAS POR LOS CIUDADANOS EN EJERCICIO DEL DERECHO DE PETICIÓN Y DAR RESPUESTA EN LOS TÉRMINOS LEGALES ESTABLECIDOS","Inversión","Bogotá Mejor para Todos",45,{"$f":"IF(ISERROR(VLOOKUP(K134,Eje_Pilar_Prop!$C$2:$E$104,2,FALSE)),\" \",VLOOKUP(K134,Eje_Pilar_Prop!$C$2:$E$104,2,FALSE))","v":"Gobernanza e influencia local, regional e internacional"},{"$f":"IF(ISERROR(VLOOKUP(K134,Eje_Pilar_Prop!$C$2:$E$104,3,FALSE)),\" \",VLOOKUP(K134,Eje_Pilar_Prop!$C$2:$E$104,3,FALSE))","v":"Eje Transversal 4 Gobierno Legitimo, Fortalecimiento Local y Eficiencia"},1395,52863482,"CLARA ELÍZABETH PACHON SALAZAR",15905790,null,null,0,null,15905790,15905790,"2020-07-30","2020-08-03","2020-12-02",120,null,null,null,null,null,null,null,null,null,"X",1,2,"Contratos de prestación de servicios profesionales y de apoyo a la gestión","Contratación directa",{"$f":"IF(ISBLANK(G134),1,IFERROR(VLOOKUP(G134,Tipo!$C$12:$C$27,1,FALSE),\"NO\"))","v":"Prestación de servicios profesionales y de apoyo a la gestión, o para la ejecución de trabajos artísticos que sólo puedan encomendarse a determinadas personas naturales;"},"Inversión",{"$f":"IF(ISBLANK(K134),1,IFERROR(VLOOKUP(K134,Eje_Pilar_Prop!C115:C216,1,FALSE),\"NO\"))","v":"NO"},"SECOP II",1,"Bogotá Mejor para Todos"]
[127,2020,"SECOP II","FDLC-CPS-127-2020","Contratos de prestación de servicios profesionales y de apoyo a la gestión","Contratación directa","Prestación de servicios profesionales y de apoyo a la gestión, o para la ejecución de trabajos artísticos que sólo puedan encomendarse a determinadas personas naturales;","APOYAR TÉCNICAMENTE A LOS RESPONSABLES E INTEGRANTES DE LOS PROCESOS EN LA IMPLEMENTACIÓN DE HERRAMIENTAS DE GESTIÓN, SIGUIENDO LOS LINEAMIENTOS METODOLÓGICOS ESTABLECIDOS POR LA OFICINA ASESORA DE PLANEACIÓN DE LA SECRETARÍA DISTRITAL DE GOBIERNO","Inversión","Bogotá Mejor para Todos",45,{"$f":"IF(ISERROR(VLOOKUP(K135,Eje_Pilar_Prop!$C$2:$E$104,2,FALSE)),\" \",VLOOKUP(K135,Eje_Pilar_Prop!$C$2:$E$104,2,FALSE))","v":"Gobernanza e influencia local, regional e internacional"},{"$f":"IF(ISERROR(VLOOKUP(K135,Eje_Pilar_Prop!$C$2:$E$104,3,FALSE)),\" \",VLOOKUP(K135,Eje_Pilar_Prop!$C$2:$E$104,3,FALSE))","v":"Eje Transversal 4 Gobierno Legitimo, Fortalecimiento Local y Eficiencia"},1395,1026266066,"KATHERIN JOHANA MORENO CASTAÑEDA",16818704,null,null,0,null,16818704,16818704,"2020-07-30","2020-07-31","2020-11-30",120,null,null,null,null,null,null,null,null,null,"X",1,2,"Contratos de prestación de servicios profesionales y de apoyo a la gestión","Contratación directa",{"$f":"IF(ISBLANK(G135),1,IFERROR(VLOOKUP(G135,Tipo!$C$12:$C$27,1,FALSE),\"NO\"))","v":"Prestación de servicios profesionales y de apoyo a la gestión, o para la ejecución de trabajos artísticos que sólo puedan encomendarse a determinadas personas naturales;"},"Inversión",{"$f":"IF(ISBLANK(K135),1,IFERROR(VLOOKUP(K135,Eje_Pilar_Prop!C116:C217,1,FALSE),\"NO\"))","v":"NO"},"SECOP II",1,"Bogotá Mejor para Todos"]
[128,2020,"SECOP II","FDLC-CPS-128-2020","Contratos de prestación de servicios profesionales y de apoyo a la gestión","Contratación directa","Prestación de servicios profesionales y de apoyo a la gestión, o para la ejecución de trabajos artísticos que sólo puedan encomendarse a determinadas personas naturales;","PRESTACIÓN DE SERVICIOS PROFESIONALES EN EL ÁREA DE GESTIÓN DEL DESARROLLO LOCAL DE LA ALCAL DIA LOCAL DE LA CANDELARIA, EN EL ACOMPAÑAMIENTO JURÍDICO A LA FORMULACIÓN, EJECUCIÓN, SEGUIMIENTO Y EVALUACIÓN JURÍDICA DE LAS POLITICAS, PLANES, PROGRAMAS Y PROYECTOS, PARA LOGRAR EL CUMPLIMIENTO DE LAS METAS DEL PLAN DE DESARROLLO LOCAL","Inversión","Bogotá Mejor para Todos",45,{"$f":"IF(ISERROR(VLOOKUP(K136,Eje_Pilar_Prop!$C$2:$E$104,2,FALSE)),\" \",VLOOKUP(K136,Eje_Pilar_Prop!$C$2:$E$104,2,FALSE))","v":"Gobernanza e influencia local, regional e internacional"},{"$f":"IF(ISERROR(VLOOKUP(K136,Eje_Pilar_Prop!$C$2:$E$104,3,FALSE)),\" \",VLOOKUP(K136,Eje_Pilar_Prop!$C$2:$E$104,3,FALSE))","v":"Eje Transversal 4 Gobierno Legitimo, Fortalecimiento Local y Eficiencia"},1395,797533637,"FABIAN ALFONSO BELNAVIS BARREIRO",16134016,null,null,0,null,16134016,10890460,"2020-07-30","2020-08-10","2020-12-09",120,null,null,null,null,null,null,null,null,"X"," ",0.67499995041532124,2,"Contratos de prestación de servicios profesionales y de apoyo a la gestión","Contratación directa",{"$f":"IF(ISBLANK(G136),1,IFERROR(VLOOKUP(G136,Tipo!$C$12:$C$27,1,FALSE),\"NO\"))","v":"Prestación de servicios profesionales y de apoyo a la gestión, o para la ejecución de trabajos artísticos que sólo puedan encomendarse a determinadas personas naturales;"},"Inversión",{"$f":"IF(ISBLANK(K136),1,IFERROR(VLOOKUP(K136,Eje_Pilar_Prop!C117:C218,1,FALSE),\"NO\"))","v":"NO"},"SECOP II",1,"Bogotá Mejor para Todos"]
[129,2020,"SECOP II","FDLC-CPS-129-2020","Contratos de prestación de servicios profesionales y de apoyo a la gestión","Contratación directa","Prestación de servicios profesionales y de apoyo a la gestión, o para la ejecución de trabajos artísticos que sólo puedan encomendarse a determinadas personas naturales;","PRESTACIÓN DE SERVICIOS DE APOYO TÉCNICO EN LA ADMINISTRACIÓN DE LAS CASAS COMUNITARIAS DE LA LOCALIDAD DE LA CANDELARIA DE CONFORMIDAD CON EL ACUERDO LOCAL 006 DE 2013","Inversión","Bogotá Mejor para Todos",45,{"$f":"IF(ISERROR(VLOOKUP(K137,Eje_Pilar_Prop!$C$2:$E$104,2,FALSE)),\" \",VLOOKUP(K137,Eje_Pilar_Prop!$C$2:$E$104,2,FALSE))","v":"Gobernanza e influencia local, regional e internacional"},{"$f":"IF(ISERROR(VLOOKUP(K137,Eje_Pilar_Prop!$C$2:$E$104,3,FALSE)),\" \",VLOOKUP(K137,Eje_Pilar_Prop!$C$2:$E$104,3,FALSE))","v":"Eje Transversal 4 Gobierno Legitimo, Fortalecimiento Local y Eficiencia"},1395,41503480,"AURA ALICIA ZAMBRANO LOPEZ",11587000,null,null,1,2510516,14097516,11200767,"2020-08-04","2020-08-05","2020-12-30",120,1,26,null,null,null,null,null,null,"X",null,0.79452060916263545,2,"Contratos de prestación de servicios profesionales y de apoyo a la gestión","Contratación directa",{"$f":"IF(ISBLANK(G137),1,IFERROR(VLOOKUP(G137,Tipo!$C$12:$C$27,1,FALSE),\"NO\"))","v":"Prestación de servicios profesionales y de apoyo a la gestión, o para la ejecución de trabajos artísticos que sólo puedan encomendarse a determinadas personas naturales;"},"Inversión",{"$f":"IF(ISBLANK(K137),1,IFERROR(VLOOKUP(K137,Eje_Pilar_Prop!C118:C219,1,FALSE),\"NO\"))","v":"NO"},"SECOP II",1,"Bogotá Mejor para Todos"]
[130,2020,"SECOP II","FDLC-CPS-130-2020","Contratos de prestación de servicios profesionales y de apoyo a la gestión","Contratación directa","Prestación de servicios profesionales y de apoyo a la gestión, o para la ejecución de trabajos artísticos que sólo puedan encomendarse a determinadas personas naturales;","PRESTACIÓN DE SERVICIOS PROFESIONALES PARA APOYAR Y FORTALECER EL ÁREA DE GESTIÓN DEL DESARROLLO DEL FONDO DE DESARROLLO LOCAL EN LAS GESTIONES ADMINISTRATIVAS Y FINANCIERAS DE LA ENTIDAD EN MATERIA DE CONTABILIDAD","Inversión","Bogotá Mejor para Todos",45,{"$f":"IF(ISERROR(VLOOKUP(K138,Eje_Pilar_Prop!$C$2:$E$104,2,FALSE)),\" \",VLOOKUP(K138,Eje_Pilar_Prop!$C$2:$E$104,2,FALSE))","v":"Gobernanza e influencia local, regional e internacional"},{"$f":"IF(ISERROR(VLOOKUP(K138,Eje_Pilar_Prop!$C$2:$E$104,3,FALSE)),\" \",VLOOKUP(K138,Eje_Pilar_Prop!$C$2:$E$104,3,FALSE))","v":"Eje Transversal 4 Gobierno Legitimo, Fortalecimiento Local y Eficiencia"},1395,52520044,"PAOLA ANDREA OYUELA VARGAS",16362240,null,null,2,7635712,23997952,19907392,"2020-08-05","2020-08-05","2021-01-30",120,2,56,null,null,null,null,null,null,"X",null,0.82954545454545459,2,"Contratos de prestación de servicios profesionales y de apoyo a la gestión","Contratación directa",{"$f":"IF(ISBLANK(G138),1,IFERROR(VLOOKUP(G138,Tipo!$C$12:$C$27,1,FALSE),\"NO\"))","v":"Prestación de servicios profesionales y de apoyo a la gestión, o para la ejecución de trabajos artísticos que sólo puedan encomendarse a determinadas personas naturales;"},"Inversión",{"$f":"IF(ISBLANK(K138),1,IFERROR(VLOOKUP(K138,Eje_Pilar_Prop!C119:C220,1,FALSE),\"NO\"))","v":"NO"},"SECOP II",1,"Bogotá Mejor para Todos"]
[131,2020,"SECOP II","FDLC-CPS-131-2020","Contratos de prestación de servicios profesionales y de apoyo a la gestión","Contratación directa","Prestación de servicios profesionales y de apoyo a la gestión, o para la ejecución de trabajos artísticos que sólo puedan encomendarse a determinadas personas naturales;","PRESTAR SUS SERVICIOS PARA APOYAR EN LAS TAREAS OPERATIVAS DE CARÁCTER ARCHIVÍSTICO DESARROLLADAS EN LA ALCALDÍA LOCAL PARA GARANTIZAR LA APLICACIÓN CORRECTA DE LOS PROCEDIMIENTOS TÉCNICOS","Inversión","Bogotá Mejor para Todos",45,{"$f":"IF(ISERROR(VLOOKUP(K139,Eje_Pilar_Prop!$C$2:$E$104,2,FALSE)),\" \",VLOOKUP(K139,Eje_Pilar_Prop!$C$2:$E$104,2,FALSE))","v":"Gobernanza e influencia local, regional e internacional"},{"$f":"IF(ISERROR(VLOOKUP(K139,Eje_Pilar_Prop!$C$2:$E$104,3,FALSE)),\" \",VLOOKUP(K139,Eje_Pilar_Prop!$C$2:$E$104,3,FALSE))","v":"Eje Transversal 4 Gobierno Legitimo, Fortalecimiento Local y Eficiencia"},1395,1010175770,"TEOFILO LEONARDO RAMIREZ HERNANDEZ",12517468,null,null,2,6258734,18776202,15229580,"2020-08-05","2020-08-05","2021-02-04",120,2,60,null,null,null,null,null,null,"X",null,0.81111078800707404,2,"Contratos de prestación de servicios profesionales y de apoyo a la gestión","Contratación directa",{"$f":"IF(ISBLANK(G139),1,IFERROR(VLOOKUP(G139,Tipo!$C$12:$C$27,1,FALSE),\"NO\"))","v":"Prestación de servicios profesionales y de apoyo a la gestión, o para la ejecución de trabajos artísticos que sólo puedan encomendarse a determinadas personas naturales;"},"Inversión",{"$f":"IF(ISBLANK(K139),1,IFERROR(VLOOKUP(K139,Eje_Pilar_Prop!C120:C221,1,FALSE),\"NO\"))","v":"NO"},"SECOP II",1,"Bogotá Mejor para Todos"]
[132,2020,"SECOP II","FDLC-CPS-132-2020","Contratos de prestación de servicios profesionales y de apoyo a la gestión","Contratación directa","Prestación de servicios profesionales y de apoyo a la gestión, o para la ejecución de trabajos artísticos que sólo puedan encomendarse a determinadas personas naturales;","APOYAR AL ALCALDE LOCAL EN LA FORMULACIÓN, SEGUIMIENTO E IMPLEMENTACIÓN DE LA ESTRATEGIA LOCAL PARA LA TERMINACIÓN JURÍDICA DE LAS ACTUACIONES ADMINISTRATIVAS QUE CURSAN EN LA ALCALDÍA LOCAL","Inversión","Bogotá Mejor para Todos",45,{"$f":"IF(ISERROR(VLOOKUP(K140,Eje_Pilar_Prop!$C$2:$E$104,2,FALSE)),\" \",VLOOKUP(K140,Eje_Pilar_Prop!$C$2:$E$104,2,FALSE))","v":"Gobernanza e influencia local, regional e internacional"},{"$f":"IF(ISERROR(VLOOKUP(K140,Eje_Pilar_Prop!$C$2:$E$104,3,FALSE)),\" \",VLOOKUP(K140,Eje_Pilar_Prop!$C$2:$E$104,3,FALSE))","v":"Eje Transversal 4 Gobierno Legitimo, Fortalecimiento Local y Eficiencia"},1395,1032356337,"ANDRES FERNANDO RIVERA SOLINA",26334088,null,null,1,10533635,36867723,30284201,"2020-08-13","2020-08-13","2021-01-29",120,1,48,null,null,null,null,null,null,"X",null,0.82142857045985729,2,"Contratos de prestación de servicios profesionales y de apoyo a la gestión","Contratación directa",{"$f":"IF(ISBLANK(G140),1,IFERROR(VLOOKUP(G140,Tipo!$C$12:$C$27,1,FALSE),\"NO\"))","v":"Prestación de servicios profesionales y de apoyo a la gestión, o para la ejecución de trabajos artísticos que sólo puedan encomendarse a determinadas personas naturales;"},"Inversión",{"$f":"IF(ISBLANK(K140),1,IFERROR(VLOOKUP(K140,Eje_Pilar_Prop!C121:C222,1,FALSE),\"NO\"))","v":"NO"},"SECOP II",1,"Bogotá Mejor para Todos"]
[133,2020,"SECOP II","FDLC-CPS-133-2020","Contratos de prestación de servicios profesionales y de apoyo a la gestión","Contratación directa","Prestación de servicios profesionales y de apoyo a la gestión, o para la ejecución de trabajos artísticos que sólo puedan encomendarse a determinadas personas naturales;","PRESTACIÓN DE SERVICIOS DE APOYO PROFESIONAL ÁL ÁREA DE GESTIÓN DEL\nDESARROLLO EN TEMAS RELACIONADOS CON PLANEACIÓN, PARA LA\nPRESENTACIÓN Y SEGUIMIENTO DE LOS PROYECTOS ENCAMINADOS A LA\nGESTIÓN DE RIESGOS Y CAMBIO CLIMÁTICO, ASI COMO BRINDAR APOYO A DICHO\nCOMITÉ.","Inversión","Bogotá Mejor para Todos",45,{"$f":"IF(ISERROR(VLOOKUP(K141,Eje_Pilar_Prop!$C$2:$E$104,2,FALSE)),\" \",VLOOKUP(K141,Eje_Pilar_Prop!$C$2:$E$104,2,FALSE))","v":"Gobernanza e influencia local, regional e internacional"},{"$f":"IF(ISERROR(VLOOKUP(K141,Eje_Pilar_Prop!$C$2:$E$104,3,FALSE)),\" \",VLOOKUP(K141,Eje_Pilar_Prop!$C$2:$E$104,3,FALSE))","v":"Eje Transversal 4 Gobierno Legitimo, Fortalecimiento Local y Eficiencia"},1395,80826902,"DIEGO CAMILO PLAZAS OLAYA CESION A JUAN PABLO LEAL BERNAL",19978796,null,null,0,null,19978796,11154827,"2020-08-10","2020-08-14","2020-12-13",120,null,null,79950957,"JUAN PABLO LEAL BERNAL,","2020-10-21",8823968,null,null,"X",null,0.55833329495931583,2,"Contratos de prestación de servicios profesionales y de apoyo a la gestión","Contratación directa",{"$f":"IF(ISBLANK(G141),1,IFERROR(VLOOKUP(G141,Tipo!$C$12:$C$27,1,FALSE),\"NO\"))","v":"Prestación de servicios profesionales y de apoyo a la gestión, o para la ejecución de trabajos artísticos que sólo puedan encomendarse a determinadas personas naturales;"},"Inversión",{"$f":"IF(ISBLANK(K141),1,IFERROR(VLOOKUP(K141,Eje_Pilar_Prop!C122:C223,1,FALSE),\"NO\"))","v":"NO"},"SECOP II",1,"Bogotá Mejor para Todos"]
[134,2020,"SECOP II","FDLC-CPS-134-2020","Contratos de prestación de servicios profesionales y de apoyo a la gestión","Contratación directa","Prestación de servicios profesionales y de apoyo a la gestión, o para la ejecución de trabajos artísticos que sólo puedan encomendarse a determinadas personas naturales;","PRESTACIÓN DE SERVICIOS PROFESIONALES AL FONDO DE DESARROLLO\nLOCAL DE LA CANDELARIA, EN LOS TRÁMITES RELACIONADOS CON LOS\nPROCESOS PRECONTRACTUALES, CONTRACTUALES Y POS CONTRACTUALES Y\nEN LAS DEMÁS ACTIVIDADES QUE ALLÍ SE REQUIERAN, DE CONFORMIDAD CON\nLOS ESTUDIOS PREVIOS ","Inversión","Bogotá Mejor para Todos",45,{"$f":"IF(ISERROR(VLOOKUP(K142,Eje_Pilar_Prop!$C$2:$E$104,2,FALSE)),\" \",VLOOKUP(K142,Eje_Pilar_Prop!$C$2:$E$104,2,FALSE))","v":"Gobernanza e influencia local, regional e internacional"},{"$f":"IF(ISERROR(VLOOKUP(K142,Eje_Pilar_Prop!$C$2:$E$104,3,FALSE)),\" \",VLOOKUP(K142,Eje_Pilar_Prop!$C$2:$E$104,3,FALSE))","v":"Eje Transversal 4 Gobierno Legitimo, Fortalecimiento Local y Eficiencia"},1395,1049611013,"JAIRO ALONSO VIASUS HIGUERA",16134016,null,null,0,null,16134016,13579463,"2020-08-10","2020-08-20","2020-12-19",120,null,null,null,null,null,null,null,null,"X",null,0.8416666377422708,2,"Contratos de prestación de servicios profesionales y de apoyo a la gestión","Contratación directa",{"$f":"IF(ISBLANK(G142),1,IFERROR(VLOOKUP(G142,Tipo!$C$12:$C$27,1,FALSE),\"NO\"))","v":"Prestación de servicios profesionales y de apoyo a la gestión, o para la ejecución de trabajos artísticos que sólo puedan encomendarse a determinadas personas naturales;"},"Inversión",{"$f":"IF(ISBLANK(K142),1,IFERROR(VLOOKUP(K142,Eje_Pilar_Prop!C123:C224,1,FALSE),\"NO\"))","v":"NO"},"SECOP II",1,"Bogotá Mejor para Todos"]
[135,2020,"SECOP II","FDLC-CPS-135-2020","Contratos de prestación de servicios profesionales y de apoyo a la gestión","Contratación directa","Prestación de servicios profesionales y de apoyo a la gestión, o para la ejecución de trabajos artísticos que sólo puedan encomendarse a determinadas personas naturales;","PRESTACIÓN DE SERVICIOS PROFESIONALES AL ÁREA DE GESTIÓN DE DESARROLLO LOCAL DE LA ALCALDÍA LOCAL PARA EL SEGUIMIENTO E IMPLEMENTACIÓN DE LAS MEDIDAS ESTABLECIDAS Y QUE SE ESTABLEZCAN POR PARTE DEL GOBIERNO NACIONAL Y DISTRITAL EN RELACIÓN CON LA REACTIVACION ECONOMICA EN LA LOCALIDAD","Inversión","Bogotá Mejor para Todos",45,{"$f":"IF(ISERROR(VLOOKUP(K143,Eje_Pilar_Prop!$C$2:$E$104,2,FALSE)),\" \",VLOOKUP(K143,Eje_Pilar_Prop!$C$2:$E$104,2,FALSE))","v":"Gobernanza e influencia local, regional e internacional"},{"$f":"IF(ISERROR(VLOOKUP(K143,Eje_Pilar_Prop!$C$2:$E$104,3,FALSE)),\" \",VLOOKUP(K143,Eje_Pilar_Prop!$C$2:$E$104,3,FALSE))","v":"Eje Transversal 4 Gobierno Legitimo, Fortalecimiento Local y Eficiencia"},1395,80236435,"JORGE ELIECER GARCÍA NEVA",16362244,null,null,2,6408545,22770789,18680228,"2020-08-14","2020-08-14","2021-01-30",120,2,47,null,null,null,null,null,null,"X",null,0.82035927696664357,2,"Contratos de prestación de servicios profesionales y de apoyo a la gestión","Contratación directa",{"$f":"IF(ISBLANK(G143),1,IFERROR(VLOOKUP(G143,Tipo!$C$12:$C$27,1,FALSE),\"NO\"))","v":"Prestación de servicios profesionales y de apoyo a la gestión, o para la ejecución de trabajos artísticos que sólo puedan encomendarse a determinadas personas naturales;"},"Inversión",{"$f":"IF(ISBLANK(K143),1,IFERROR(VLOOKUP(K143,Eje_Pilar_Prop!C124:C225,1,FALSE),\"NO\"))","v":"NO"},"SECOP II",1,{"$f":"IF(ISBLANK(J143),1,IFERROR(VLOOKUP(J143,pdd,1,FALSE),\"NO\"))","v":"Bogotá Mejor para Todos"}]
[136,2020,"SECOP II","FDLC-CPS-136-2020","Contratos de prestación de servicios profesionales y de apoyo a la gestión","Contratación directa","Prestación de servicios profesionales y de apoyo a la gestión, o para la ejecución de trabajos artísticos que sólo puedan encomendarse a determinadas personas naturales;"," PRESTACIÓN DE SERVICIOS PROFESIONALES PARA APOYAR A LA ALCALDESA LOCAL EN EL FORTALECIMIENTO E INCLUSIÓN DE LAS COMUNIDADES NEGRAS, AFROCOLOMBIANAS Y PALENQUERAS EN EL MARCO DE LA POLÍTICA PÚBLICA DISTRITAL RELACIONADA CON AFRODESCENDIENTES Y ESPACIOS DE PARTICIPACIÓN.","Inversión","Bogotá Mejor para Todos",45,{"$f":"IF(ISERROR(VLOOKUP(K144,Eje_Pilar_Prop!$C$2:$E$104,2,FALSE)),\" \",VLOOKUP(K144,Eje_Pilar_Prop!$C$2:$E$104,2,FALSE))","v":"Gobernanza e influencia local, regional e internacional"},{"$f":"IF(ISERROR(VLOOKUP(K144,Eje_Pilar_Prop!$C$2:$E$104,3,FALSE)),\" \",VLOOKUP(K144,Eje_Pilar_Prop!$C$2:$E$104,3,FALSE))","v":"Eje Transversal 4 Gobierno Legitimo, Fortalecimiento Local y Eficiencia"},1395,1131185112,"SAMIRA ROMAÑA CUESTA",16362248,null,null,0,null,16362248,14415671,"2020-08-14","2020-08-14","2020-12-13",120,null,null,null,null,null,null,null,null,"X",null,0.88103242292868311,3,"Contratos de prestación de servicios profesionales y de apoyo a la gestión","Contratación directa",{"$f":"IF(ISBLANK(G144),1,IFERROR(VLOOKUP(G144,Tipo!$C$12:$C$27,1,FALSE),\"NO\"))","v":"Prestación de servicios profesionales y de apoyo a la gestión, o para la ejecución de trabajos artísticos que sólo puedan encomendarse a determinadas personas naturales;"},"Inversión",{"$f":"IF(ISBLANK(K144),1,IFERROR(VLOOKUP(K144,Eje_Pilar_Prop!C125:C226,1,FALSE),\"NO\"))","v":"NO"},"SECOP II",1,"Bogotá Mejor para Todos"]
[137,2020,"SECOP II","FDLC-CPS-137-2020","Contratos de prestación de servicios profesionales y de apoyo a la gestión","Contratación directa","Prestación de servicios profesionales y de apoyo a la gestión, o para la ejecución de trabajos artísticos que sólo puedan encomendarse a determinadas personas naturales;","PRESTACIÓN DE SERVICIOS PROFESIONALES PARA APOYAR AL\nÁREA DE GESTIÓN DEL DESARROLLO LOCAL EN LA\nFORMULACION, PRESENTACIÓN, EVALUACION Y SEGUIMIENTO DE\nLOS PROYECTOS SOCIALES Y DE SALUD EN LA LOCALIDAD Y DE\nCOMPETENCIA DEL FONDO DE DESARROLLO LOCAL LA\nCANDELARIA. ","Inversión","Bogotá Mejor para Todos",45,{"$f":"IF(ISERROR(VLOOKUP(K145,Eje_Pilar_Prop!$C$2:$E$104,2,FALSE)),\" \",VLOOKUP(K145,Eje_Pilar_Prop!$C$2:$E$104,2,FALSE))","v":"Gobernanza e influencia local, regional e internacional"},{"$f":"IF(ISERROR(VLOOKUP(K145,Eje_Pilar_Prop!$C$2:$E$104,3,FALSE)),\" \",VLOOKUP(K145,Eje_Pilar_Prop!$C$2:$E$104,3,FALSE))","v":"Eje Transversal 4 Gobierno Legitimo, Fortalecimiento Local y Eficiencia"},1395,1098688455,"SERGIO ALEJANDRO CORDOBA MORENO CESION A CLARA MILENA MONTENEGRO CARDENAS",18398720,null,null,0,null,18398720,14412330,"2020-08-18","2020-08-20","2020-12-19",120,null,null,52516340,"CLARA MILENA MONTENEGRO CARDENAS,","2020-11-02",3986389,null,null,"X",null,0.78333329709892863,2,"Contratos de prestación de servicios profesionales y de apoyo a la gestión","Contratación directa",{"$f":"IF(ISBLANK(G145),1,IFERROR(VLOOKUP(G145,Tipo!$C$12:$C$27,1,FALSE),\"NO\"))","v":"Prestación de servicios profesionales y de apoyo a la gestión, o para la ejecución de trabajos artísticos que sólo puedan encomendarse a determinadas personas naturales;"},"Inversión",{"$f":"IF(ISBLANK(K145),1,IFERROR(VLOOKUP(K145,Eje_Pilar_Prop!C126:C227,1,FALSE),\"NO\"))","v":"NO"},"SECOP II",1,"Bogotá Mejor para Todos"]
[138,2020,"SECOP II","FDLC-CPS-138-2020","Contratos de prestación de servicios profesionales y de apoyo a la gestión","Contratación directa","Prestación de servicios profesionales y de apoyo a la gestión, o para la ejecución de trabajos artísticos que sólo puedan encomendarse a determinadas personas naturales;","PRESTAR SUS SERVICIOS PROFESIONALES EN LA PROMOCIÓN, ACOMPAÑAMIENTO Y ATENCIÓN EN LAS INSTANCIAS DE PARTICIPACIÓN, ASÍ COMO LOS PROCESOS COMUNITARIOS EN LA LOCALIDAD LA CANDELARIA","Inversión","Bogotá Mejor para Todos",45,{"$f":"IF(ISERROR(VLOOKUP(K146,Eje_Pilar_Prop!$C$2:$E$104,2,FALSE)),\" \",VLOOKUP(K146,Eje_Pilar_Prop!$C$2:$E$104,2,FALSE))","v":"Gobernanza e influencia local, regional e internacional"},{"$f":"IF(ISERROR(VLOOKUP(K146,Eje_Pilar_Prop!$C$2:$E$104,3,FALSE)),\" \",VLOOKUP(K146,Eje_Pilar_Prop!$C$2:$E$104,3,FALSE))","v":"Eje Transversal 4 Gobierno Legitimo, Fortalecimiento Local y Eficiencia"},1395,80037360,"JOHN JAIRO GONZALEZ ARBOLEDA",12614028,null,null,0,null,12614028,11625034,"2020-08-20","2020-08-20","2020-12-19",120,null,null,null,null,null,null,null,null,"X",null,0.92159570281594427,3,"Contratos de prestación de servicios profesionales y de apoyo a la gestión","Contratación directa",{"$f":"IF(ISBLANK(G146),1,IFERROR(VLOOKUP(G146,Tipo!$C$12:$C$27,1,FALSE),\"NO\"))","v":"Prestación de servicios profesionales y de apoyo a la gestión, o para la ejecución de trabajos artísticos que sólo puedan encomendarse a determinadas personas naturales;"},"Inversión",{"$f":"IF(ISBLANK(K146),1,IFERROR(VLOOKUP(K146,Eje_Pilar_Prop!C127:C228,1,FALSE),\"NO\"))","v":"NO"},"SECOP II",1,"Bogotá Mejor para Todos"]
[139,2020,"SECOP II","FDLC-CPS-139-2020","Contratos de prestación de servicios profesionales y de apoyo a la gestión","Contratación directa","Prestación de servicios profesionales y de apoyo a la gestión, o para la ejecución de trabajos artísticos que sólo puedan encomendarse a determinadas personas naturales;","PRESTAR SERVICIOS DE APOYO ADMINISTRATIVO Y ASISTENCIAL AL ÁREA DE GESTIÓN DE DESARROLLO LOCAL, EN LOS PROCESOS DE COMPETENCIA DE LA OFICINA DE PLANEACIÓN DE LA ALCALDÍA LOCAL DE LA CANDELARIA","Inversión","Bogotá Mejor para Todos",45,{"$f":"IF(ISERROR(VLOOKUP(K147,Eje_Pilar_Prop!$C$2:$E$104,2,FALSE)),\" \",VLOOKUP(K147,Eje_Pilar_Prop!$C$2:$E$104,2,FALSE))","v":"Gobernanza e influencia local, regional e internacional"},{"$f":"IF(ISERROR(VLOOKUP(K147,Eje_Pilar_Prop!$C$2:$E$104,3,FALSE)),\" \",VLOOKUP(K147,Eje_Pilar_Prop!$C$2:$E$104,3,FALSE))","v":"Eje Transversal 4 Gobierno Legitimo, Fortalecimiento Local y Eficiencia"},1395,79984961,"JOHN TIMBERLAKE OSORIO",6729820,null,null,0,null,6729820,6729820,"2020-08-20","2020-08-20","2020-12-19",120,null,null,null,null,null,null,null,null,null,"X",1,2,"Contratos de prestación de servicios profesionales y de apoyo a la gestión","Contratación directa",{"$f":"IF(ISBLANK(G147),1,IFERROR(VLOOKUP(G147,Tipo!$C$12:$C$27,1,FALSE),\"NO\"))","v":"Prestación de servicios profesionales y de apoyo a la gestión, o para la ejecución de trabajos artísticos que sólo puedan encomendarse a determinadas personas naturales;"},"Inversión",{"$f":"IF(ISBLANK(K147),1,IFERROR(VLOOKUP(K147,Eje_Pilar_Prop!C128:C229,1,FALSE),\"NO\"))","v":"NO"},"SECOP II",1,"Bogotá Mejor para Todos"]
[140,2020,"SECOP II","FDLC-CPS-140-2020","Contratos de prestación de servicios profesionales y de apoyo a la gestión","Contratación directa","Prestación de servicios profesionales y de apoyo a la gestión, o para la ejecución de trabajos artísticos que sólo puedan encomendarse a determinadas personas naturales;"," APOYAR AL EQUIPO DE PRENSA Y COMUNICACIONES DE LA ALCALDÍA LOCAL EN LA REALIZACIÓN DE PRODUCTOS Y PIEZAS DIGITALES, IMPRESAS Y PUBLICITARIAS DE GRAN FORMATO Y DE ANIMACIÓN GRÁFICA, ASÍ COMO APOYAR LA PRODUCCIÓN Y MONTAJE DE EVENTOS","Inversión","Bogotá Mejor para Todos",45,{"$f":"IF(ISERROR(VLOOKUP(K148,Eje_Pilar_Prop!$C$2:$E$104,2,FALSE)),\" \",VLOOKUP(K148,Eje_Pilar_Prop!$C$2:$E$104,2,FALSE))","v":"Gobernanza e influencia local, regional e internacional"},{"$f":"IF(ISERROR(VLOOKUP(K148,Eje_Pilar_Prop!$C$2:$E$104,3,FALSE)),\" \",VLOOKUP(K148,Eje_Pilar_Prop!$C$2:$E$104,3,FALSE))","v":"Eje Transversal 4 Gobierno Legitimo, Fortalecimiento Local y Eficiencia"},1395,80258118,"IVAN DAVID PINTO GONZALEZ",16362248,null,null,0,null,16362248,15315206,"2020-08-21","2020-08-22","2020-12-21",120,null,null,null,null,null,null,null,null,"X",null,0.93600867069121552,2,"Contratos de prestación de servicios profesionales y de apoyo a la gestión","Contratación directa",{"$f":"IF(ISBLANK(G148),1,IFERROR(VLOOKUP(G148,Tipo!$C$12:$C$27,1,FALSE),\"NO\"))","v":"Prestación de servicios profesionales y de apoyo a la gestión, o para la ejecución de trabajos artísticos que sólo puedan encomendarse a determinadas personas naturales;"},"Inversión",{"$f":"IF(ISBLANK(K148),1,IFERROR(VLOOKUP(K148,Eje_Pilar_Prop!C129:C230,1,FALSE),\"NO\"))","v":"NO"},"SECOP II",1,"Bogotá Mejor para Todos"]
[141,2020,"SECOP II","FDLC-CPS-141-2020","Contratos de prestación de servicios profesionales y de apoyo a la gestión","Contratación directa","Prestación de servicios profesionales y de apoyo a la gestión, o para la ejecución de trabajos artísticos que sólo puedan encomendarse a determinadas personas naturales;","PRESTACIÓN DE SERVICIOS PROFESIONALES PARA APOYAR LA GESTIÓN DEL\nÁREA DE GESTIÓN DEL DESARROLLO LOCAL EN LA FORMULACION,\nPRESENTACIÓN, EVALUACION Y SEGUIMIENTO DE LOS PROYECTOS DE GESTION\nARTÍSTICA Y CULTURAL DE LOS TERRITORIOS Y APOYAR EN GENERAL TODOS\nLOS PROCESOS DE GESTIONES CULTURALES EN LA LOCALIDAD Y DE\nCOMPETENCIA DEL FONDO DE DESARROLLO LOCAL LA CANDELARIA ","Inversión","Bogotá Mejor para Todos",45,{"$f":"IF(ISERROR(VLOOKUP(K149,Eje_Pilar_Prop!$C$2:$E$104,2,FALSE)),\" \",VLOOKUP(K149,Eje_Pilar_Prop!$C$2:$E$104,2,FALSE))","v":"Gobernanza e influencia local, regional e internacional"},{"$f":"IF(ISERROR(VLOOKUP(K149,Eje_Pilar_Prop!$C$2:$E$104,3,FALSE)),\" \",VLOOKUP(K149,Eje_Pilar_Prop!$C$2:$E$104,3,FALSE))","v":"Eje Transversal 4 Gobierno Legitimo, Fortalecimiento Local y Eficiencia"},1395,1026557848,"LAURA ANDREA DAZA OCAMPO CESION A WILSONVALENCIA ARIZA",18398720,null,null,1,6132907,24531627,14259006,"2020-08-21","2020-08-22","2021-01-30",120,1,40,79670761,"WILSON VALENCIA ARIZA,","2020-08-28",17325461,null,null,"X",null,0.58124991057462272,2,"Contratos de prestación de servicios profesionales y de apoyo a la gestión","Contratación directa",{"$f":"IF(ISBLANK(G149),1,IFERROR(VLOOKUP(G149,Tipo!$C$12:$C$27,1,FALSE),\"NO\"))","v":"Prestación de servicios profesionales y de apoyo a la gestión, o para la ejecución de trabajos artísticos que sólo puedan encomendarse a determinadas personas naturales;"},"Inversión",{"$f":"IF(ISBLANK(K149),1,IFERROR(VLOOKUP(K149,Eje_Pilar_Prop!C130:C231,1,FALSE),\"NO\"))","v":"NO"},"SECOP II",1,"Bogotá Mejor para Todos"]
[142,2020,"SECOP II","FDLC-CPS-142-2020","Contratos de prestación de servicios profesionales y de apoyo a la gestión","Contratación directa","Prestación de servicios profesionales y de apoyo a la gestión, o para la ejecución de trabajos artísticos que sólo puedan encomendarse a determinadas personas naturales;","APOYAR AL EQUIPO DE PRENSA Y COMUNICACIONES DE LA ALCALDÍA LOCAL EN LA REALIZACIÓN Y PUBLICACIÓN DE CONTENIDOS DE REDES SOCIALES Y CANALES DE DIVULGACIÓN DIGITAL (SITIO WEB) DE LA ALCALDÍA LOCAL.","Inversión","Bogotá Mejor para Todos",45,{"$f":"IF(ISERROR(VLOOKUP(K150,Eje_Pilar_Prop!$C$2:$E$104,2,FALSE)),\" \",VLOOKUP(K150,Eje_Pilar_Prop!$C$2:$E$104,2,FALSE))","v":"Gobernanza e influencia local, regional e internacional"},{"$f":"IF(ISERROR(VLOOKUP(K150,Eje_Pilar_Prop!$C$2:$E$104,3,FALSE)),\" \",VLOOKUP(K150,Eje_Pilar_Prop!$C$2:$E$104,3,FALSE))","v":"Eje Transversal 4 Gobierno Legitimo, Fortalecimiento Local y Eficiencia"},1395,1033731738,"NATALIA ANDREA RUBIANO FORERO",18398751,null,null,1,9199375,27598126,19931972,"2020-08-21","2020-08-22","2021-02-21",120,1,60,null,null,null,null,null,null,"X",null,0.72222193637350596,2,"Contratos de prestación de servicios profesionales y de apoyo a la gestión","Contratación directa",{"$f":"IF(ISBLANK(G150),1,IFERROR(VLOOKUP(G150,Tipo!$C$12:$C$27,1,FALSE),\"NO\"))","v":"Prestación de servicios profesionales y de apoyo a la gestión, o para la ejecución de trabajos artísticos que sólo puedan encomendarse a determinadas personas naturales;"},"Inversión",{"$f":"IF(ISBLANK(K150),1,IFERROR(VLOOKUP(K150,Eje_Pilar_Prop!C131:C232,1,FALSE),\"NO\"))","v":"NO"},{"$f":"IF(ISBLANK(C150),1,IFERROR(VLOOKUP(C150,SECOP,1,FALSE),\"NO\"))","v":"SECOP II"},1,"Bogotá Mejor para Todos"]
[143,2020,"SECOP II","FDLC-CPS-143-2020","Contratos de prestación de servicios profesionales y de apoyo a la gestión","Contratación directa","Prestación de servicios profesionales y de apoyo a la gestión, o para la ejecución de trabajos artísticos que sólo puedan encomendarse a determinadas personas naturales;","PRESTAR SERVICIOS DE APOYO EN LAS ACTIVIDADES DE SEGURIDAD Y CONVIVENCIA CIUDADANA, DE ACUERDO A LAS NECESIDADES Y ESTRATEGIAS EMANADAS POR EL ÁREA DE SEGURIDAD Y CONVIVENCIA DE LA ALCALDÍA LOCAL DE LA CANDELARIA","Inversión","Bogotá Mejor para Todos",19,{"$f":"IF(ISERROR(VLOOKUP(K151,Eje_Pilar_Prop!$C$2:$E$104,2,FALSE)),\" \",VLOOKUP(K151,Eje_Pilar_Prop!$C$2:$E$104,2,FALSE))","v":"Seguridad y convivencia para todos"},{"$f":"IF(ISERROR(VLOOKUP(K151,Eje_Pilar_Prop!$C$2:$E$104,3,FALSE)),\" \",VLOOKUP(K151,Eje_Pilar_Prop!$C$2:$E$104,3,FALSE))","v":"Pilar 3 Construcción de Comunidad y Cultura Ciudadana"},1392,52219688,"ENIT QUIÑONES",6000000,null,null,1,1850000,{"$f":"+Q151+S151+U151","v":7850000},6400000,"2020-08-24","2020-08-24","2021-01-29",120,1,37,null,null,null,null,null,null,"X",null,0.8152866242038217,2,"Contratos de prestación de servicios profesionales y de apoyo a la gestión","Contratación directa",{"$f":"IF(ISBLANK(G151),1,IFERROR(VLOOKUP(G151,Tipo!$C$12:$C$27,1,FALSE),\"NO\"))","v":"Prestación de servicios profesionales y de apoyo a la gestión, o para la ejecución de trabajos artísticos que sólo puedan encomendarse a determinadas personas naturales;"},"Inversión",{"$f":"IF(ISBLANK(K151),1,IFERROR(VLOOKUP(K151,Eje_Pilar_Prop!C132:C233,1,FALSE),\"NO\"))","v":"NO"},"SECOP II",1,"Bogotá Mejor para Todos"]
[144,2020,"SECOP II","FDLC-CPS-144-2020","Contratos de prestación de servicios profesionales y de apoyo a la gestión","Contratación directa","Prestación de servicios profesionales y de apoyo a la gestión, o para la ejecución de trabajos artísticos que sólo puedan encomendarse a determinadas personas naturales;","PRESTAR LOS SERVICIOS ADMINISTRATIVOS Y ASISTENCIALES AL ÁREA DE GESTIÓN POLICIVA DE LA ALCALDÍA LOCAL DE LA CANDELARIA EN LOS TEMAS DE COMPETENCIA DE LA OFICINA DE DESCONGESTIÓN OBRAS.","Inversión","Bogotá Mejor para Todos",45,{"$f":"IF(ISERROR(VLOOKUP(K152,Eje_Pilar_Prop!$C$2:$E$104,2,FALSE)),\" \",VLOOKUP(K152,Eje_Pilar_Prop!$C$2:$E$104,2,FALSE))","v":"Gobernanza e influencia local, regional e internacional"},{"$f":"IF(ISERROR(VLOOKUP(K152,Eje_Pilar_Prop!$C$2:$E$104,3,FALSE)),\" \",VLOOKUP(K152,Eje_Pilar_Prop!$C$2:$E$104,3,FALSE))","v":"Eje Transversal 4 Gobierno Legitimo, Fortalecimiento Local y Eficiencia"},1395,79907754,"JUAN ANGEL LOPEZ ARDILA",6729800,null,null,0,null,{"$f":"+Q152+S152+U152","v":6729800},6729800,"2020-08-21","2020-08-22","2020-12-21",120,null,null,null,null,null,null,null,null,null,"X",1,2,"Contratos de prestación de servicios profesionales y de apoyo a la gestión","Contratación directa",{"$f":"IF(ISBLANK(G152),1,IFERROR(VLOOKUP(G152,Tipo!$C$12:$C$27,1,FALSE),\"NO\"))","v":"Prestación de servicios profesionales y de apoyo a la gestión, o para la ejecución de trabajos artísticos que sólo puedan encomendarse a determinadas personas naturales;"},"Inversión",{"$f":"IF(ISBLANK(K152),1,IFERROR(VLOOKUP(K152,Eje_Pilar_Prop!C133:C234,1,FALSE),\"NO\"))","v":"NO"},"SECOP II",1,"Bogotá Mejor para Todos"]
[145,2020,"SECOP II","FDLC-CPS-145-2020","Contratos de prestación de servicios profesionales y de apoyo a la gestión","Contratación directa","Prestación de servicios profesionales y de apoyo a la gestión, o para la ejecución de trabajos artísticos que sólo puedan encomendarse a determinadas personas naturales;"," PRESTAR SERVICIOS DE APOYO EN LAS ACTIVIDADES DE SEGURIDAD Y CONVIVENCIA CIUDADANA, DE ACUERDO A LAS NECESIDADES Y ESTRATEGIAS EMANADAS POR EL ÁREA DE SEGURIDAD Y CONVIVENCIA DE LA ALCALDIA LOCAL DE LA CANDELARIA","Inversión","Bogotá Mejor para Todos",19,{"$f":"IF(ISERROR(VLOOKUP(K153,Eje_Pilar_Prop!$C$2:$E$104,2,FALSE)),\" \",VLOOKUP(K153,Eje_Pilar_Prop!$C$2:$E$104,2,FALSE))","v":"Seguridad y convivencia para todos"},{"$f":"IF(ISERROR(VLOOKUP(K153,Eje_Pilar_Prop!$C$2:$E$104,3,FALSE)),\" \",VLOOKUP(K153,Eje_Pilar_Prop!$C$2:$E$104,3,FALSE))","v":"Pilar 3 Construcción de Comunidad y Cultura Ciudadana"},1392,39781586,"ALEXI NORVEI OSORIO",6000000,null,null,1,1850000,7850000,6400000,"2020-08-24","2020-08-24","2021-01-29",120,1,37,null,null,null,null,null,null,"X",null,0.8152866242038217,2,{"$f":"IF(ISBLANK(E153),1,IFERROR(VLOOKUP(E153,tipo,1,FALSE),\"NO\"))","v":"Contratos de prestación de servicios profesionales y de apoyo a la gestión"},{"$f":"IF(ISBLANK(F153),1,IFERROR(VLOOKUP(F153,modal,1,FALSE),\"NO\"))","v":"Contratación directa"},{"$f":"IF(ISBLANK(G153),1,IFERROR(VLOOKUP(G153,Tipo!$C$12:$C$27,1,FALSE),\"NO\"))","v":"Prestación de servicios profesionales y de apoyo a la gestión, o para la ejecución de trabajos artísticos que sólo puedan encomendarse a determinadas personas naturales;"},{"$f":"IF(ISBLANK(I153),1,IFERROR(VLOOKUP(I153,afectacion,1,FALSE),\"NO\"))","v":"Inversión"},{"$f":"IF(ISBLANK(K153),1,IFERROR(VLOOKUP(K153,Eje_Pilar_Prop!C134:C235,1,FALSE),\"NO\"))","v":"NO"},"SECOP II",1,"Bogotá Mejor para Todos"]
[146,2020,"SECOP II","FDLC-CPS-146-2020","Contratos de prestación de servicios profesionales y de apoyo a la gestión","Contratación directa","Prestación de servicios profesionales y de apoyo a la gestión, o para la ejecución de trabajos artísticos que sólo puedan encomendarse a determinadas personas naturales;","PRESTAR SERVICIOS DE APOYO EN LAS ACTIVIDADES DE SEGURIDAD Y CONVIVENCIA CIUDADANA, DE ACUERDO A LAS NECESIDADES Y ESTRATEGIAS EMANADAS POR EL ÁREA DE SEGURIDAD Y CONVIVENCIA DE LA ALCALDÍA LOCAL DE LA CANDELARIA","Inversión","Bogotá Mejor para Todos",19,{"$f":"IF(ISERROR(VLOOKUP(K154,Eje_Pilar_Prop!$C$2:$E$104,2,FALSE)),\" \",VLOOKUP(K154,Eje_Pilar_Prop!$C$2:$E$104,2,FALSE))","v":"Seguridad y convivencia para todos"},{"$f":"IF(ISERROR(VLOOKUP(K154,Eje_Pilar_Prop!$C$2:$E$104,3,FALSE)),\" \",VLOOKUP(K154,Eje_Pilar_Prop!$C$2:$E$104,3,FALSE))","v":"Pilar 3 Construcción de Comunidad y Cultura Ciudadana"},1392,1000575536,"JUAN CAMILO HERRERA FRANCO",6000000,null,null,0,null,6000000,4850000,"2020-08-24","2020-08-24","2020-12-23",120,null,null,null,null,null,null,null,null,"X",null,0.80833333333333335,2,"Contratos de prestación de servicios profesionales y de apoyo a la gestión","Contratación directa",{"$f":"IF(ISBLANK(G154),1,IFERROR(VLOOKUP(G154,Tipo!$C$12:$C$27,1,FALSE),\"NO\"))","v":"Prestación de servicios profesionales y de apoyo a la gestión, o para la ejecución de trabajos artísticos que sólo puedan encomendarse a determinadas personas naturales;"},"Inversión",{"$f":"IF(ISBLANK(K154),1,IFERROR(VLOOKUP(K154,Eje_Pilar_Prop!C135:C236,1,FALSE),\"NO\"))","v":"NO"},"SECOP II",1,"Bogotá Mejor para Todos"]
[147,2020,"SECOP II","FDLC-CPS-147-2020","Contratos de prestación de servicios profesionales y de apoyo a la gestión","Contratación directa","Prestación de servicios profesionales y de apoyo a la gestión, o para la ejecución de trabajos artísticos que sólo puedan encomendarse a determinadas personas naturales;","PRESTAR SUS SERVICIOS PROFESIONALES PARA APOYAR AL ALCALDE LOCAL EN LA GESTIÓN DE LOS ASUNTOS RELACIONADOS CON SEGURIDAD CIUDADANA, CONVIVENCIA Y PREVENCIÓN DE CONFLICTIVIDADES, VIOLENCIAS Y DELITOS EN LA LOCALIDAD, DE CONFORMIDAD CON EL MARCO NORMATIVO APLICABLE EN LA MATERIA","Inversión","Bogotá Mejor para Todos",45,{"$f":"IF(ISERROR(VLOOKUP(K155,Eje_Pilar_Prop!$C$2:$E$104,2,FALSE)),\" \",VLOOKUP(K155,Eje_Pilar_Prop!$C$2:$E$104,2,FALSE))","v":"Gobernanza e influencia local, regional e internacional"},{"$f":"IF(ISERROR(VLOOKUP(K155,Eje_Pilar_Prop!$C$2:$E$104,3,FALSE)),\" \",VLOOKUP(K155,Eje_Pilar_Prop!$C$2:$E$104,3,FALSE))","v":"Eje Transversal 4 Gobierno Legitimo, Fortalecimiento Local y Eficiencia"},1395,80239278,"JOHN FREDY PULIDO RINCON",22000000,null,null,1,6783334,{"$f":"+Q155+S155+U155","v":28783334},17783333,"2020-08-24","2020-08-24","2021-01-29",120,1,37,null,null,null,null,null,null,"X",null,0.61783436901367994,2,"Contratos de prestación de servicios profesionales y de apoyo a la gestión","Contratación directa",{"$f":"IF(ISBLANK(G155),1,IFERROR(VLOOKUP(G155,Tipo!$C$12:$C$27,1,FALSE),\"NO\"))","v":"Prestación de servicios profesionales y de apoyo a la gestión, o para la ejecución de trabajos artísticos que sólo puedan encomendarse a determinadas personas naturales;"},"Inversión",{"$f":"IF(ISBLANK(K155),1,IFERROR(VLOOKUP(K155,Eje_Pilar_Prop!C136:C237,1,FALSE),\"NO\"))","v":"NO"},"SECOP II",1,"Bogotá Mejor para Todos"]
[148,2020,"SECOP II","FDLC-CPS-148-2020","Contratos de prestación de servicios profesionales y de apoyo a la gestión","Contratación directa","Prestación de servicios profesionales y de apoyo a la gestión, o para la ejecución de trabajos artísticos que sólo puedan encomendarse a determinadas personas naturales;","PRESTAR SERVICIOS DE APOYO EN LAS ACTIVIDADES DE\nSEGURIDAD Y CONVIVENCIA CIUDADANA, DE ACUERDO A LAS\nNECESIDADES Y ESTRATEGIAS EMANADAS POR EL ÁREA DE\nSEGURIDAD Y CONVIVENCIA DE LA ALCALDÍA LOCAL DE LA\nCANDELARIA ","Inversión","Bogotá Mejor para Todos",19,{"$f":"IF(ISERROR(VLOOKUP(K156,Eje_Pilar_Prop!$C$2:$E$104,2,FALSE)),\" \",VLOOKUP(K156,Eje_Pilar_Prop!$C$2:$E$104,2,FALSE))","v":"Seguridad y convivencia para todos"},{"$f":"IF(ISERROR(VLOOKUP(K156,Eje_Pilar_Prop!$C$2:$E$104,3,FALSE)),\" \",VLOOKUP(K156,Eje_Pilar_Prop!$C$2:$E$104,3,FALSE))","v":"Pilar 3 Construcción de Comunidad y Cultura Ciudadana"},1392,1010223608,"LAURA CAMILA QUIROGA MILLAN",6000000,null,null,1,1850000,7850000,6400000,"2020-08-24","2020-08-24","2021-01-29",120,1,37,null,null,null,null,null,null,"X",null,0.8152866242038217,{"$f":"IF(SUMPRODUCT((A$14:A156=A156)*(B$14:B156=B156)*(D$14:D156=D156))>1,0,1)","v":1},"Contratos de prestación de servicios profesionales y de apoyo a la gestión","Contratación directa",{"$f":"IF(ISBLANK(G156),1,IFERROR(VLOOKUP(G156,Tipo!$C$12:$C$27,1,FALSE),\"NO\"))","v":"Prestación de servicios profesionales y de apoyo a la gestión, o para la ejecución de trabajos artísticos que sólo puedan encomendarse a determinadas personas naturales;"},"Inversión",{"$f":"IF(ISBLANK(K156),1,IFERROR(VLOOKUP(K156,Eje_Pilar_Prop!C137:C238,1,FALSE),\"NO\"))","v":"NO"},"SECOP II",1,"Bogotá Mejor para Todos"]
[149,2020,"SECOP II","FDLC-CPS-149-2020","Contratos de prestación de servicios profesionales y de apoyo a la gestión","Contratación directa","Prestación de servicios profesionales y de apoyo a la gestión, o para la ejecución de trabajos artísticos que sólo puedan encomendarse a determinadas personas naturales;","PRESTAR SERVICIOS DE APOYO EN LAS ACTIVIDADES DE\nSEGURIDAD Y CONVIVENCIA CIUDADANA, DE ACUERDO A LAS\nNECESIDADES Y ESTRATEGIAS EMANADAS POR EL ÁREA DE\nSEGURIDAD Y CONVIVENCIA DE LA ALCALDÍA LOCAL DE LA\nCANDELARIA ","Inversión","Bogotá Mejor para Todos",19,{"$f":"IF(ISERROR(VLOOKUP(K157,Eje_Pilar_Prop!$C$2:$E$104,2,FALSE)),\" \",VLOOKUP(K157,Eje_Pilar_Prop!$C$2:$E$104,2,FALSE))","v":"Seguridad y convivencia para todos"},{"$f":"IF(ISERROR(VLOOKUP(K157,Eje_Pilar_Prop!$C$2:$E$104,3,FALSE)),\" \",VLOOKUP(K157,Eje_Pilar_Prop!$C$2:$E$104,3,FALSE))","v":"Pilar 3 Construcción de Comunidad y Cultura Ciudadana"},1392,79914457,"TARCISIO TORO ZAMBRANO",6000000,null,null,1,1850000,7850000,6700000,"2020-08-24","2020-08-24","2021-01-29",120,1,37,null,null,null,null,null,null,"X",null,0.85350318471337583,{"$f":"IF(SUMPRODUCT((A$14:A157=A157)*(B$14:B157=B157)*(D$14:D157=D157))>1,0,1)","v":1},"Contratos de prestación de servicios profesionales y de apoyo a la gestión","Contratación directa",{"$f":"IF(ISBLANK(G157),1,IFERROR(VLOOKUP(G157,Tipo!$C$12:$C$27,1,FALSE),\"NO\"))","v":"Prestación de servicios profesionales y de apoyo a la gestión, o para la ejecución de trabajos artísticos que sólo puedan encomendarse a determinadas personas naturales;"},"Inversión",{"$f":"IF(ISBLANK(K157),1,IFERROR(VLOOKUP(K157,Eje_Pilar_Prop!C138:C239,1,FALSE),\"NO\"))","v":"NO"},"SECOP II",{"$f":"IF(OR(YEAR(X157)=2020,ISBLANK(X157)),1,\"NO\")","v":1},"Bogotá Mejor para Todos"]
[150,2020,"SECOP II","FDLC-CPS-150-2020","Contratos de prestación de servicios profesionales y de apoyo a la gestión","Contratación directa","Prestación de servicios profesionales y de apoyo a la gestión, o para la ejecución de trabajos artísticos que sólo puedan encomendarse a determinadas personas naturales;","PRESTAR SERVICIOS DE APOYO EN LAS ACTIVIDADES DE\nSEGURIDAD Y CONVIVENCIA CIUDADANA, DE ACUERDO A LAS\nNECESIDADES Y ESTRATEGIAS EMANADAS POR EL ÁREA DE\nSEGURIDAD Y CONVIVENCIA DE LA ALCALDÍA LOCAL DE LA\nCANDELARIA ","Inversión","Bogotá Mejor para Todos",19,{"$f":"IF(ISERROR(VLOOKUP(K158,Eje_Pilar_Prop!$C$2:$E$104,2,FALSE)),\" \",VLOOKUP(K158,Eje_Pilar_Prop!$C$2:$E$104,2,FALSE))","v":"Seguridad y convivencia para todos"},{"$f":"IF(ISERROR(VLOOKUP(K158,Eje_Pilar_Prop!$C$2:$E$104,3,FALSE)),\" \",VLOOKUP(K158,Eje_Pilar_Prop!$C$2:$E$104,3,FALSE))","v":"Pilar 3 Construcción de Comunidad y Cultura Ciudadana"},1392,52060667,"NELLY CONTRERAS ROJAS",6000000,null,null,1,1850000,7850000,6400000,"2020-08-24","2020-08-24","2021-01-29",120,1,37,null,null,null,null,null,null,"X",null,0.8152866242038217,{"$f":"IF(SUMPRODUCT((A$14:A158=A158)*(B$14:B158=B158)*(D$14:D158=D158))>1,0,1)","v":1},"Contratos de prestación de servicios profesionales y de apoyo a la gestión","Contratación directa",{"$f":"IF(ISBLANK(G158),1,IFERROR(VLOOKUP(G158,Tipo!$C$12:$C$27,1,FALSE),\"NO\"))","v":"Prestación de servicios profesionales y de apoyo a la gestión, o para la ejecución de trabajos artísticos que sólo puedan encomendarse a determinadas personas naturales;"},"Inversión",{"$f":"IF(ISBLANK(K158),1,IFERROR(VLOOKUP(K158,Eje_Pilar_Prop!C139:C240,1,FALSE),\"NO\"))","v":"NO"},"SECOP II",1,"Bogotá Mejor para Todos"]
[151,2020,"SECOP II","FDLC-CPS-151-2020","Contratos de prestación de servicios profesionales y de apoyo a la gestión","Contratación directa","Prestación de servicios profesionales y de apoyo a la gestión, o para la ejecución de trabajos artísticos que sólo puedan encomendarse a determinadas personas naturales;","PRESTAR SERVICIOS DE APOYO EN LAS ACTIVIDADES DE\nSEGURIDAD Y CONVIVENCIA CIUDADANA, DE ACUERDO A LAS\nNECESIDADES Y ESTRATEGIAS EMANADAS POR EL ÁREA DE\nSEGURIDAD Y CONVIVENCIA DE LA ALCALDÍA LOCAL DE LA\nCANDELARIA ","Inversión","Bogotá Mejor para Todos",19,{"$f":"IF(ISERROR(VLOOKUP(K159,Eje_Pilar_Prop!$C$2:$E$104,2,FALSE)),\" \",VLOOKUP(K159,Eje_Pilar_Prop!$C$2:$E$104,2,FALSE))","v":"Seguridad y convivencia para todos"},{"$f":"IF(ISERROR(VLOOKUP(K159,Eje_Pilar_Prop!$C$2:$E$104,3,FALSE)),\" \",VLOOKUP(K159,Eje_Pilar_Prop!$C$2:$E$104,3,FALSE))","v":"Pilar 3 Construcción de Comunidad y Cultura Ciudadana"},1392,93086512,"BLADIMIR OVIEDO RUIZ",6000000,null,null,1,1800000,7800000,6350000,"2020-08-24","2020-08-24","2021-01-28",120,1,36,null,null,null,null,null,null,"X",null,{"$f":"IF(ISERROR(W159/V159),\"-\",(W159/V159))","v":0.8141025641025641},{"$f":"IF(SUMPRODUCT((A$14:A159=A159)*(B$14:B159=B159)*(D$14:D159=D159))>1,0,1)","v":1},"Contratos de prestación de servicios profesionales y de apoyo a la gestión","Contratación directa",{"$f":"IF(ISBLANK(G159),1,IFERROR(VLOOKUP(G159,Tipo!$C$12:$C$27,1,FALSE),\"NO\"))","v":"Prestación de servicios profesionales y de apoyo a la gestión, o para la ejecución de trabajos artísticos que sólo puedan encomendarse a determinadas personas naturales;"},"Inversión",{"$f":"IF(ISBLANK(K159),1,IFERROR(VLOOKUP(K159,Eje_Pilar_Prop!C140:C241,1,FALSE),\"NO\"))","v":"NO"},"SECOP II",1,"Bogotá Mejor para Todos"]
[153,2020,"SECOP I","20-22-18422","Contratos interadministrativos","Contratación directa","Contratos interadministrativos","Aunar esfuerzos para desarrollar acciones de manera articulada entre las partes, para el fortalecimiento de los procesos de creación, producción, distribución, exhibición, comercialización y promoción de bienes y servicios culturales y creativos de los agentes del sector cultura, recreación y deporte de las localidades de Bogotá D.C.,  que se prioricen en el Eje Adaptación y Transformación Productiva  de la Estrategia de Reactivación Económica Local- EMRE LOCAL, Programa Apoyo y Fortalecimiento de las Industrias Creativas y Culturales para la Adaptación y Transformación Productiva, en el marco de un  proceso de fomento.","Inversión","Bogotá Mejor para Todos",45,{"$f":"IF(ISERROR(VLOOKUP(K160,Eje_Pilar_Prop!$C$2:$E$104,2,FALSE)),\" \",VLOOKUP(K160,Eje_Pilar_Prop!$C$2:$E$104,2,FALSE))","v":"Gobernanza e influencia local, regional e internacional"},{"$f":"IF(ISERROR(VLOOKUP(K160,Eje_Pilar_Prop!$C$2:$E$104,3,FALSE)),\" \",VLOOKUP(K160,Eje_Pilar_Prop!$C$2:$E$104,3,FALSE))","v":"Eje Transversal 4 Gobierno Legitimo, Fortalecimiento Local y Eficiencia"},1396,860044113,"FUNDACION GILBERTO ALZATE AVENDAÑO - IDRD",543478261,null,null,0,null,{"$f":"+Q160+S160+U160","v":543478261},543478261,"2020-08-24","2020-08-28","2021-11-30",{"$f":"+Z160-X160","v":463},null,null,null,null,null,null,null,"X",null,null,1,{"$f":"IF(SUMPRODUCT((A$14:A160=A160)*(B$14:B160=B160)*(D$14:D160=D160))>1,0,1)","v":1},"Contratos interadministrativos","Contratación directa",{"$f":"IF(ISBLANK(G160),1,IFERROR(VLOOKUP(G160,Tipo!$C$12:$C$27,1,FALSE),\"NO\"))","v":"Contratos interadministrativos"},"Inversión",{"$f":"IF(ISBLANK(K160),1,IFERROR(VLOOKUP(K160,Eje_Pilar_Prop!C141:C242,1,FALSE),\"NO\"))","v":"NO"},"SECOP I",1,"Bogotá Mejor para Todos"]
[153,2020,"SECOP I","20-22-18422","Contratos interadministrativos","Contratación directa","Contratos interadministrativos","Aunar esfuerzos para desarrollar acciones de manera articulada entre las partes, para el fortalecimiento de los procesos de creación, producción, distribución, exhibición, comercialización y promoción de bienes y servicios culturales y creativos de los agentes del sector cultura, recreación y deporte de las localidades de Bogotá D.C.,  que se prioricen en el Eje Adaptación y Transformación Productiva  de la Estrategia de Reactivación Económica Local- EMRE LOCAL, Programa Apoyo y Fortalecimiento de las Industrias Creativas y Culturales para la Adaptación y Transformación Productiva, en el marco de un  proceso de fomento.","Inversión","Bogotá Mejor para Todos",45,{"$f":"IF(ISERROR(VLOOKUP(K161,Eje_Pilar_Prop!$C$2:$E$104,2,FALSE)),\" \",VLOOKUP(K161,Eje_Pilar_Prop!$C$2:$E$104,2,FALSE))","v":"Gobernanza e influencia local, regional e internacional"},{"$f":"IF(ISERROR(VLOOKUP(K161,Eje_Pilar_Prop!$C$2:$E$104,3,FALSE)),\" \",VLOOKUP(K161,Eje_Pilar_Prop!$C$2:$E$104,3,FALSE))","v":"Eje Transversal 4 Gobierno Legitimo, Fortalecimiento Local y Eficiencia"},1396,899999061,"SECRETARIA DISTRITAL DE CULTURA RECREACION Y DEPORTE",46968479,null,null,null,null,46968479,null,"2020-08-24","2020-08-28","2021-11-30",{"$f":"+Z161-X161","v":463},null,null,null,null,null,null,null,"X",null,null,0,{"$f":"IF(SUMPRODUCT((A$14:A161=A161)*(B$14:B161=B161)*(D$14:D161=D161))>1,0,1)","v":0}]
[155,2020,"SECOP I","20-22-18421","Contratos de prestación de servicios","Contratación directa","Urgencia manifiesta","COMPENSAR se obliga a prestar los servicios requeridos para operar el Programa de Incentivos para el Empleo con el cual se busca apoyar al tejido productivo de las localidades de Bogotá D.C., con especial énfasis en los empresarios, e incluir y/o mantener laboralmente a trabajadores mayores de 50 años, mujeres y jóvenes (18-28 años) principalmente, a través de la transferencia de incentivos a la nómina, en el marco de la contención y mitigación de los efectos del Covid-19, la declaratoria de emergencia sanitaria en todo el territorio nacional y la calamidad pública declarada en la ciudad de Bogotá D.C.  ","Inversión","Bogotá Mejor para Todos",45,{"$f":"IF(ISERROR(VLOOKUP(K162,Eje_Pilar_Prop!$C$2:$E$104,2,FALSE)),\" \",VLOOKUP(K162,Eje_Pilar_Prop!$C$2:$E$104,2,FALSE))","v":"Gobernanza e influencia local, regional e internacional"},{"$f":"IF(ISERROR(VLOOKUP(K162,Eje_Pilar_Prop!$C$2:$E$104,3,FALSE)),\" \",VLOOKUP(K162,Eje_Pilar_Prop!$C$2:$E$104,3,FALSE))","v":"Eje Transversal 4 Gobierno Legitimo, Fortalecimiento Local y Eficiencia"},1396,860066942,"CAJA DE COMPENSACION FAMILIAR COMPENSAR",1016265664,null,null,0,null,1016265664,338843663,"2020-08-27","2020-09-14","2021-07-13",300,null,null,null,null,null,null,null,"X",null,null,0.3334203594622282,{"$f":"IF(SUMPRODUCT((A$14:A162=A162)*(B$14:B162=B162)*(D$14:D162=D162))>1,0,1)","v":1},"Contratos de prestación de servicios","Contratación directa",{"$f":"IF(ISBLANK(G162),1,IFERROR(VLOOKUP(G162,Tipo!$C$12:$C$27,1,FALSE),\"NO\"))","v":"Urgencia manifiesta"},"Inversión",{"$f":"IF(ISBLANK(K162),1,IFERROR(VLOOKUP(K162,Eje_Pilar_Prop!C142:C243,1,FALSE),\"NO\"))","v":"NO"},"SECOP I",1,"Bogotá Mejor para Todos"]
[156,2020,"SECOP I","20-22-18419","Contratos interadministrativos","Contratación directa","Contratos interadministrativos","Aunar esfuerzos técnicos, administrativos y financieros, que contribuyan al cumplimiento de los protocolos de bioseguridad para la reactivación económica de las localidades de Bogotá, a través de acciones de Información, Educación y Comunicación en Salud ¿ IEC, enfocadas a orientar a los trabajadores respecto al uso adecuado de los elementos de bioseguridad contenidos en los kits, actividades que serán desarrolladas por perfiles idóneos en seguridad y salud en el trabajo, así como la entrega de los Kits de elementos de bioseguridad a microempresas, establecimientos, locales comerciales y vendedores informales; en el marco del Programa Cumplimiento de Protocolos de Bioseguridad para la Adaptación y Reactivación Económica del Eje Adaptación y Transformación Productiva de la Estrategia de Reactivación Económica Local- EMRE LOCAL","Inversión","Bogotá Mejor para Todos",19,{"$f":"IF(ISERROR(VLOOKUP(K163,Eje_Pilar_Prop!$C$2:$E$104,2,FALSE)),\" \",VLOOKUP(K163,Eje_Pilar_Prop!$C$2:$E$104,2,FALSE))","v":"Seguridad y convivencia para todos"},{"$f":"IF(ISERROR(VLOOKUP(K163,Eje_Pilar_Prop!$C$2:$E$104,3,FALSE)),\" \",VLOOKUP(K163,Eje_Pilar_Prop!$C$2:$E$104,3,FALSE))","v":"Pilar 3 Construcción de Comunidad y Cultura Ciudadana"},1392,900959051,"SUBRED INTEGRADA DE SERVICIOS DE SALUD CENTRO ORIENTE",161616299,null,null,0,null,161616299,80808150,"2020-08-27","2020-08-28","2021-11-30",180,null,null,null,null,null,null,null,"X",null,null,0.50000000309374737,{"$f":"IF(SUMPRODUCT((A$14:A163=A163)*(B$14:B163=B163)*(D$14:D163=D163))>1,0,1)","v":1},"Contratos interadministrativos","Contratación directa",{"$f":"IF(ISBLANK(G163),1,IFERROR(VLOOKUP(G163,Tipo!$C$12:$C$27,1,FALSE),\"NO\"))","v":"Contratos interadministrativos"},"Inversión",{"$f":"IF(ISBLANK(K163),1,IFERROR(VLOOKUP(K163,Eje_Pilar_Prop!C143:C244,1,FALSE),\"NO\"))","v":"NO"},"SECOP I",1,"Bogotá Mejor para Todos"]
[157,2020,"SECOP II","FDLC-CPS-157-2020","Contratos de prestación de servicios profesionales y de apoyo a la gestión","Contratación directa","Prestación de servicios profesionales y de apoyo a la gestión, o para la ejecución de trabajos artísticos que sólo puedan encomendarse a determinadas personas naturales;","PRESTAR SERVICIOS DE APOYO ADMINISTRATIVO Y ASISTENCIAL AL ÁREA DE GESTIÓN DE DESARROLLO LOCAL, EN LOS PROCESOS DE COMPETENCIA DE LA OFICINA DE PLANEACIÓN DE LA ALCALDÍA LOCAL DE LA CANDELARIA","Inversión","Bogotá Mejor para Todos",45,{"$f":"IF(ISERROR(VLOOKUP(K164,Eje_Pilar_Prop!$C$2:$E$104,2,FALSE)),\" \",VLOOKUP(K164,Eje_Pilar_Prop!$C$2:$E$104,2,FALSE))","v":"Gobernanza e influencia local, regional e internacional"},{"$f":"IF(ISERROR(VLOOKUP(K164,Eje_Pilar_Prop!$C$2:$E$104,3,FALSE)),\" \",VLOOKUP(K164,Eje_Pilar_Prop!$C$2:$E$104,3,FALSE))","v":"Eje Transversal 4 Gobierno Legitimo, Fortalecimiento Local y Eficiencia"},1395,1010236602,"IVAN FELIPE SIERRA SANCHEZ",5888592,null,null,0,null,5888592,4710871,"2020-09-07","2020-09-07","2020-12-21",105,null,null,null,null,null,null,null,null,"X",null,0.79999955846830617,{"$f":"IF(SUMPRODUCT((A$14:A164=A164)*(B$14:B164=B164)*(D$14:D164=D164))>1,0,1)","v":1},"Contratos de prestación de servicios profesionales y de apoyo a la gestión","Contratación directa",{"$f":"IF(ISBLANK(G164),1,IFERROR(VLOOKUP(G164,Tipo!$C$12:$C$27,1,FALSE),\"NO\"))","v":"Prestación de servicios profesionales y de apoyo a la gestión, o para la ejecución de trabajos artísticos que sólo puedan encomendarse a determinadas personas naturales;"},"Inversión",{"$f":"IF(ISBLANK(K164),1,IFERROR(VLOOKUP(K164,Eje_Pilar_Prop!C144:C245,1,FALSE),\"NO\"))","v":"NO"},"SECOP II",1,"Bogotá Mejor para Todos"]
[158,2020,"SECOP II","FDLC-CPS-158-2020","Contratos de prestación de servicios profesionales y de apoyo a la gestión","Contratación directa","Prestación de servicios profesionales y de apoyo a la gestión, o para la ejecución de trabajos artísticos que sólo puedan encomendarse a determinadas personas naturales;","PRESTACIÓN DE SERVICIOS PARA APOYAR LAS TAREAS OPERATIVAS DE CARÁCTER ARCHIVISTICO DESARROLLADAS EN LA ALCALDIA LOCAL PARA GARANTIZAR LA APLICACIÓN CORRECTA DE LOS PROCEDIMIENTOS TÉCNICOS","Inversión","Bogotá Mejor para Todos",45,{"$f":"IF(ISERROR(VLOOKUP(K165,Eje_Pilar_Prop!$C$2:$E$104,2,FALSE)),\" \",VLOOKUP(K165,Eje_Pilar_Prop!$C$2:$E$104,2,FALSE))","v":"Gobernanza e influencia local, regional e internacional"},{"$f":"IF(ISERROR(VLOOKUP(K165,Eje_Pilar_Prop!$C$2:$E$104,3,FALSE)),\" \",VLOOKUP(K165,Eje_Pilar_Prop!$C$2:$E$104,3,FALSE))","v":"Eje Transversal 4 Gobierno Legitimo, Fortalecimiento Local y Eficiencia"},1395,1022352287,"CINDY CATALINA OJEDA LOPEZ",10952784,null,null,0,null,10952784,10952784,"2020-09-08","2020-09-08","2020-12-22",105,null,null,null,null,null,null,null,null,null,"X",1,{"$f":"IF(SUMPRODUCT((A$14:A165=A165)*(B$14:B165=B165)*(D$14:D165=D165))>1,0,1)","v":1},"Contratos de prestación de servicios profesionales y de apoyo a la gestión","Contratación directa",{"$f":"IF(ISBLANK(G165),1,IFERROR(VLOOKUP(G165,Tipo!$C$12:$C$27,1,FALSE),\"NO\"))","v":"Prestación de servicios profesionales y de apoyo a la gestión, o para la ejecución de trabajos artísticos que sólo puedan encomendarse a determinadas personas naturales;"},"Inversión",{"$f":"IF(ISBLANK(K165),1,IFERROR(VLOOKUP(K165,Eje_Pilar_Prop!C145:C246,1,FALSE),\"NO\"))","v":"NO"},"SECOP II",1,"Bogotá Mejor para Todos"]
[159,2020,"SECOP II","FDLC-CPS-159-2020","Contratos de prestación de servicios profesionales y de apoyo a la gestión","Contratación directa","Prestación de servicios profesionales y de apoyo a la gestión, o para la ejecución de trabajos artísticos que sólo puedan encomendarse a determinadas personas naturales;","APOYAR EN LAS TAREAS OPERATIVAS DE CARÁCTER ARCHIVÍSTICO DESARROLLADAS EN LA ALCALDÍA LOCAL PARA GARANTIZAR LA APLICACIÓN CORRECTA DE LOS PROCEDIMIENTOS TÉCNICOS.","Inversión","Bogotá Mejor para Todos",45,{"$f":"IF(ISERROR(VLOOKUP(K166,Eje_Pilar_Prop!$C$2:$E$104,2,FALSE)),\" \",VLOOKUP(K166,Eje_Pilar_Prop!$C$2:$E$104,2,FALSE))","v":"Gobernanza e influencia local, regional e internacional"},{"$f":"IF(ISERROR(VLOOKUP(K166,Eje_Pilar_Prop!$C$2:$E$104,3,FALSE)),\" \",VLOOKUP(K166,Eje_Pilar_Prop!$C$2:$E$104,3,FALSE))","v":"Eje Transversal 4 Gobierno Legitimo, Fortalecimiento Local y Eficiencia"},1395,1026255127,"DELIO ALCIBIADES LADINO PEÑA",14117266,null,null,1,6050256,20167522,10083762,"2020-09-16","2020-09-16","2021-02-14",105,1,45,null,null,null,null,null,null,"X",null,0.50000004958467381,{"$f":"IF(SUMPRODUCT((A$14:A166=A166)*(B$14:B166=B166)*(D$14:D166=D166))>1,0,1)","v":1},"Contratos de prestación de servicios profesionales y de apoyo a la gestión","Contratación directa",{"$f":"IF(ISBLANK(G166),1,IFERROR(VLOOKUP(G166,Tipo!$C$12:$C$27,1,FALSE),\"NO\"))","v":"Prestación de servicios profesionales y de apoyo a la gestión, o para la ejecución de trabajos artísticos que sólo puedan encomendarse a determinadas personas naturales;"},"Inversión",{"$f":"IF(ISBLANK(K166),1,IFERROR(VLOOKUP(K166,Eje_Pilar_Prop!C146:C247,1,FALSE),\"NO\"))","v":"NO"},"SECOP II",1,"Bogotá Mejor para Todos"]
[160,2020,"SECOP II","FDLC-CPS-160-2020","Contratos de prestación de servicios profesionales y de apoyo a la gestión","Contratación directa","Prestación de servicios profesionales y de apoyo a la gestión, o para la ejecución de trabajos artísticos que sólo puedan encomendarse a determinadas personas naturales;","PRESTAR LOS SERVICIOS PROFESIONALES PARA LA OPERACIÓN, PRESTACIÓN, SEGUIMIENTO Y CUMPLIMIENTO DE LOS PROCEDIMIENTOS ADMINISTRATIVOS, OPERATIVOS Y PROGRAMÁTICOS DEL SERVICIO APOYO ECONÓMICO TIPO C, QUE CONTRIBUYAN A LA GARANTÍA DE LOS DERECHOS DE LA POBLACIÓN MAYOR EN EL MARCO DE LA POLÍTICA PÚBLICA SOCIAL PARA EL ENVEJECIMIENTO Y LA VEJEZ EN EL DISTRITO CAPITAL A CARGO DE LA ALCALDÍA LOCAL.","Inversión","Bogotá Mejor para Todos",3,{"$f":"IF(ISERROR(VLOOKUP(K167,Eje_Pilar_Prop!$C$2:$E$104,2,FALSE)),\" \",VLOOKUP(K167,Eje_Pilar_Prop!$C$2:$E$104,2,FALSE))","v":"Igualdad y autonomía para una Bogotá incluyente"},{"$f":"IF(ISERROR(VLOOKUP(K167,Eje_Pilar_Prop!$C$2:$E$104,3,FALSE)),\" \",VLOOKUP(K167,Eje_Pilar_Prop!$C$2:$E$104,3,FALSE))","v":"Pilar 1 Igualdad de Calidad de Vida"},1386,1033749239,"AZUCENA SALAZAR GIRALDO",13635200,null,null,1,4449000,18084200,9953696,"2020-09-18","2020-09-18","2021-01-29",100,1,33,null,null,null,null,null,null,"X",null,0.55040842282213198,{"$f":"IF(SUMPRODUCT((A$14:A167=A167)*(B$14:B167=B167)*(D$14:D167=D167))>1,0,1)","v":1},"Contratos de prestación de servicios profesionales y de apoyo a la gestión","Contratación directa",{"$f":"IF(ISBLANK(G167),1,IFERROR(VLOOKUP(G167,Tipo!$C$12:$C$27,1,FALSE),\"NO\"))","v":"Prestación de servicios profesionales y de apoyo a la gestión, o para la ejecución de trabajos artísticos que sólo puedan encomendarse a determinadas personas naturales;"},"Inversión",{"$f":"IF(ISBLANK(K167),1,IFERROR(VLOOKUP(K167,Eje_Pilar_Prop!C147:C248,1,FALSE),\"NO\"))","v":"NO"},"SECOP II",1,"Bogotá Mejor para Todos"]
[160,2020,"SECOP II","FDLC-CPS-160-2020","Contratos de prestación de servicios profesionales y de apoyo a la gestión","Contratación Directa","Prestación de servicios profesionales y de apoyo a la gestión, o para la ejecución de trabajos artísticos que sólo puedan encomendarse a determinadas personas naturales;","PRESTAR LOS SERVICIOS PROFESIONALES PARA LA OPERACIÓN, PRESTACIÓN, SEGUIMIENTO Y CUMPLIMIENTO DE LOS PROCEDIMIENTOS ADMINISTRATIVOS, OPERATIVOS Y PROGRAMÁTICOS DEL SERVICIO APOYO ECONÓMICO TIPO C, QUE CONTRIBUYAN A LA GARANTÍA DE LOS DERECHOS DE LA POBLACIÓN MAYOR EN EL MARCO DE LA POLÍTICA PÚBLICA SOCIAL PARA EL ENVEJECIMIENTO Y LA VEJEZ EN EL DISTRITO CAPITAL A CARGO DE LA ALCALDÍA LOCAL.","Inversión","Bogotá Mejor para Todos",45,{"$f":"IF(ISERROR(VLOOKUP(K168,Eje_Pilar_Prop!$C$2:$E$104,2,FALSE)),\" \",VLOOKUP(K168,Eje_Pilar_Prop!$C$2:$E$104,2,FALSE))","v":"Gobernanza e influencia local, regional e internacional"},{"$f":"IF(ISERROR(VLOOKUP(K168,Eje_Pilar_Prop!$C$2:$E$104,3,FALSE)),\" \",VLOOKUP(K168,Eje_Pilar_Prop!$C$2:$E$104,3,FALSE))","v":"Eje Transversal 4 Gobierno Legitimo, Fortalecimiento Local y Eficiencia"},1395,1033749239,"AZUCENA SALAZAR GIRALDO",4499616,null,null,null,null,4499616,4226912,"2020-09-18","2020-09-18","2021-01-29",100,null,null,null,null,null,null,null,null,"X",null,0.93939393939393945,{"$f":"IF(SUMPRODUCT((A$14:A168=A168)*(B$14:B168=B168)*(D$14:D168=D168))>1,0,1)","v":0}]
[161,2020,"SECOP II","FDLC-CPS-161-2020","Contratos de prestación de servicios profesionales y de apoyo a la gestión","Contratación directa","Prestación de servicios profesionales y de apoyo a la gestión, o para la ejecución de trabajos artísticos que sólo puedan encomendarse a determinadas personas naturales;","PRESTAR LOS SERVICIOS TECNICOS ADMINISTRATIVOS EN LAS DISTINTAS ETAPAS DE LOS PROCESOS CONTRACTUALES DE COMPETENCIA DE LA ALCALDIA LOCAL DE LA CANDELARIA","Inversión","Bogotá Mejor para Todos",45,{"$f":"IF(ISERROR(VLOOKUP(K169,Eje_Pilar_Prop!$C$2:$E$104,2,FALSE)),\" \",VLOOKUP(K169,Eje_Pilar_Prop!$C$2:$E$104,2,FALSE))","v":"Gobernanza e influencia local, regional e internacional"},{"$f":"IF(ISERROR(VLOOKUP(K169,Eje_Pilar_Prop!$C$2:$E$104,3,FALSE)),\" \",VLOOKUP(K169,Eje_Pilar_Prop!$C$2:$E$104,3,FALSE))","v":"Eje Transversal 4 Gobierno Legitimo, Fortalecimiento Local y Eficiencia"},1395,52305372,"ELCY JEANETH PULIDO AMORTEGUI",7663221,null,null,1,3405876,11069097,8599826,"2020-09-21","2020-09-21","2021-01-29",90,1,40,null,null,null,null,null,null,"X",null,0.77692209219957142,{"$f":"IF(SUMPRODUCT((A$14:A169=A169)*(B$14:B169=B169)*(D$14:D169=D169))>1,0,1)","v":1},"Contratos de prestación de servicios profesionales y de apoyo a la gestión","Contratación directa",{"$f":"IF(ISBLANK(G169),1,IFERROR(VLOOKUP(G169,Tipo!$C$12:$C$27,1,FALSE),\"NO\"))","v":"Prestación de servicios profesionales y de apoyo a la gestión, o para la ejecución de trabajos artísticos que sólo puedan encomendarse a determinadas personas naturales;"},"Inversión",{"$f":"IF(ISBLANK(K169),1,IFERROR(VLOOKUP(K169,Eje_Pilar_Prop!C148:C249,1,FALSE),\"NO\"))","v":"NO"},"SECOP II",1,"Bogotá Mejor para Todos"]
[162,2020,"SECOP II","FDLC-CPS-162-2020","Contratos de prestación de servicios profesionales y de apoyo a la gestión","Contratación directa","Prestación de servicios profesionales y de apoyo a la gestión, o para la ejecución de trabajos artísticos que sólo puedan encomendarse a determinadas personas naturales;","PRESTAR SERVICIOS DE APOYO EN LAS ACTIVIDADES DE SEGURIDAD Y CONVIVENCIA CIUDADANA, DE ACUERDO A LAS NECESIDADES Y ESTRATEGIAS EMANADAS POR EL ÁREA DE SEGURIDAD Y CONVIVENCIA DE LA ALCALDÍA LOCAL DE LA CANDELARIA","Inversión","Bogotá Mejor para Todos",19,{"$f":"IF(ISERROR(VLOOKUP(K170,Eje_Pilar_Prop!$C$2:$E$104,2,FALSE)),\" \",VLOOKUP(K170,Eje_Pilar_Prop!$C$2:$E$104,2,FALSE))","v":"Seguridad y convivencia para todos"},{"$f":"IF(ISERROR(VLOOKUP(K170,Eje_Pilar_Prop!$C$2:$E$104,3,FALSE)),\" \",VLOOKUP(K170,Eje_Pilar_Prop!$C$2:$E$104,3,FALSE))","v":"Pilar 3 Construcción de Comunidad y Cultura Ciudadana"},1392,1010203707,"MICHAEL FELIPE RAMIREZ GARCIA",5250000,null,null,1,2000000,7250000,5050000,"2020-09-21","2020-09-21","2021-01-29",90,1,40,null,null,null,null,null,null,"X",null,0.69655172413793098,{"$f":"IF(SUMPRODUCT((A$14:A170=A170)*(B$14:B170=B170)*(D$14:D170=D170))>1,0,1)","v":1},"Contratos de prestación de servicios profesionales y de apoyo a la gestión","Contratación directa",{"$f":"IF(ISBLANK(G170),1,IFERROR(VLOOKUP(G170,Tipo!$C$12:$C$27,1,FALSE),\"NO\"))","v":"Prestación de servicios profesionales y de apoyo a la gestión, o para la ejecución de trabajos artísticos que sólo puedan encomendarse a determinadas personas naturales;"},"Inversión",{"$f":"IF(ISBLANK(K170),1,IFERROR(VLOOKUP(K170,Eje_Pilar_Prop!C149:C250,1,FALSE),\"NO\"))","v":"NO"},"SECOP II",1,"Bogotá Mejor para Todos"]
[163,2020,"SECOP II","FDLC-CPS-163-2020","Contratos de prestación de servicios profesionales y de apoyo a la gestión","Contratación directa","Prestación de servicios profesionales y de apoyo a la gestión, o para la ejecución de trabajos artísticos que sólo puedan encomendarse a determinadas personas naturales;","PRESTAR SERVICIOS PROFESIONALES ESPECIALIZADOS EN LA GESTIÓN JURÍDICA DEL DESPACHO Y DEL FONDO DE DESARROLLO LOCAL LA CANDELARIA EN MATERIA CONTRACTUAL Y EN TODOS LOS TEMAS DE ORDEN ADMINISTRATIVO QUE SE DAN EN DESARROLLO DE LAS GESTIONES DE LA ENTIDAD.","Inversión","Bogotá Mejor para Todos",45,{"$f":"IF(ISERROR(VLOOKUP(K171,Eje_Pilar_Prop!$C$2:$E$104,2,FALSE)),\" \",VLOOKUP(K171,Eje_Pilar_Prop!$C$2:$E$104,2,FALSE))","v":"Gobernanza e influencia local, regional e internacional"},{"$f":"IF(ISERROR(VLOOKUP(K171,Eje_Pilar_Prop!$C$2:$E$104,3,FALSE)),\" \",VLOOKUP(K171,Eje_Pilar_Prop!$C$2:$E$104,3,FALSE))","v":"Eje Transversal 4 Gobierno Legitimo, Fortalecimiento Local y Eficiencia"},1395,"13543982/80763536","ROLANDO ALFONSO NIÑO PALENCIA CESION A OSCAR JAVIER FONSECA GOMEZ",26700000,null,null,1,11866667,38566667,0,"2020-09-21","2020-09-21","2021-01-29",90,1,40,80763536,"OSCAR JAVIER FONSECA","2020-10-16",19876666,null,null,"X",null,0,{"$f":"IF(SUMPRODUCT((A$14:A171=A171)*(B$14:B171=B171)*(D$14:D171=D171))>1,0,1)","v":1},"Contratos de prestación de servicios profesionales y de apoyo a la gestión","Contratación directa",{"$f":"IF(ISBLANK(G171),1,IFERROR(VLOOKUP(G171,Tipo!$C$12:$C$27,1,FALSE),\"NO\"))","v":"Prestación de servicios profesionales y de apoyo a la gestión, o para la ejecución de trabajos artísticos que sólo puedan encomendarse a determinadas personas naturales;"},"Inversión",{"$f":"IF(ISBLANK(K171),1,IFERROR(VLOOKUP(K171,Eje_Pilar_Prop!C150:C251,1,FALSE),\"NO\"))","v":"NO"},"SECOP II",1,"Bogotá Mejor para Todos"]
[164,2020,"SECOP II","FDLC-CPS-164-2020","Contratos de prestación de servicios profesionales y de apoyo a la gestión","Contratación directa","Prestación de servicios profesionales y de apoyo a la gestión, o para la ejecución de trabajos artísticos que sólo puedan encomendarse a determinadas personas naturales;","PRESTACIÓN DE SERVICIOS PROFESIONALES AL ÁREA DE GESTIÓN DE DESARROLLO LOCAL EN LA FORMULACIÓN, PRESENTACIÓN, EVALUACIÓN, SEGUIMIENTO Y APOYO EN LOS REQUERIMIENTOS DE LOS PROYECTOS DE INFRAESTRUCTURA Y OBRAS CIVILES QUE DESARROLLE LA ALCALDÍA LOCAL DE LA CANDELARIA A TRAVES DEL AREA DE PLANEACIÓN","Inversión","Bogotá Mejor para Todos",45,{"$f":"IF(ISERROR(VLOOKUP(K172,Eje_Pilar_Prop!$C$2:$E$104,2,FALSE)),\" \",VLOOKUP(K172,Eje_Pilar_Prop!$C$2:$E$104,2,FALSE))","v":"Gobernanza e influencia local, regional e internacional"},{"$f":"IF(ISERROR(VLOOKUP(K172,Eje_Pilar_Prop!$C$2:$E$104,3,FALSE)),\" \",VLOOKUP(K172,Eje_Pilar_Prop!$C$2:$E$104,3,FALSE))","v":"Eje Transversal 4 Gobierno Legitimo, Fortalecimiento Local y Eficiencia"},1395,79889548,"EDGAR HERNAN CARDOZO VARGAS",13635200,null,null,0,null,13635200,9408288,"2020-09-22","2020-09-22","2020-12-21",90,null,null,null,null,null,null,null,null,"X",null,0.69,{"$f":"IF(SUMPRODUCT((A$14:A172=A172)*(B$14:B172=B172)*(D$14:D172=D172))>1,0,1)","v":1},"Contratos de prestación de servicios profesionales y de apoyo a la gestión","Contratación directa",{"$f":"IF(ISBLANK(G172),1,IFERROR(VLOOKUP(G172,Tipo!$C$12:$C$27,1,FALSE),\"NO\"))","v":"Prestación de servicios profesionales y de apoyo a la gestión, o para la ejecución de trabajos artísticos que sólo puedan encomendarse a determinadas personas naturales;"},"Inversión",{"$f":"IF(ISBLANK(K172),1,IFERROR(VLOOKUP(K172,Eje_Pilar_Prop!C151:C252,1,FALSE),\"NO\"))","v":"NO"},"SECOP II",1,"Bogotá Mejor para Todos"]
[165,2020,"SECOP II","FDLC-CPS-165-2020","Contratos de prestación de servicios profesionales y de apoyo a la gestión","Contratación directa","Prestación de servicios profesionales y de apoyo a la gestión, o para la ejecución de trabajos artísticos que sólo puedan encomendarse a determinadas personas naturales;","COORDINAR, LIDERAR Y ASESORAR LOS PLANES Y ESTRATEGIAS DE COMUNICACIÓN INTERNA Y EXTERNA PARA LA DIVULGACIÓN DE LOS PROGRAMAS, PROYECTOS Y ACTIVIDADES DE LA ALCALDÍA LOCAL DE LA CANDELARIA","Inversión","Bogotá Mejor para Todos",45,{"$f":"IF(ISERROR(VLOOKUP(K173,Eje_Pilar_Prop!$C$2:$E$104,2,FALSE)),\" \",VLOOKUP(K173,Eje_Pilar_Prop!$C$2:$E$104,2,FALSE))","v":"Gobernanza e influencia local, regional e internacional"},{"$f":"IF(ISERROR(VLOOKUP(K173,Eje_Pilar_Prop!$C$2:$E$104,3,FALSE)),\" \",VLOOKUP(K173,Eje_Pilar_Prop!$C$2:$E$104,3,FALSE))","v":"Eje Transversal 4 Gobierno Legitimo, Fortalecimiento Local y Eficiencia"},1395,1020729068,"VALENTINA OCHOA MAYORGA",19500000,null,null,1,8450000,27950000,21450000,"2020-09-22","2020-09-22","29/ 01/ 2021",90,1,90,null,null,null,null,null,null,"X",null,0.76744186046511631,{"$f":"IF(SUMPRODUCT((A$14:A173=A173)*(B$14:B173=B173)*(D$14:D173=D173))>1,0,1)","v":1}]
[166,2020,"SECOP II","FDLC-CPS-166-2020","Contratos de prestación de servicios profesionales y de apoyo a la gestión","Contratación directa","Prestación de servicios profesionales y de apoyo a la gestión, o para la ejecución de trabajos artísticos que sólo puedan encomendarse a determinadas personas naturales;","PRESTACIÓN DE SERVICIOS TÉCNICOS DE APOYO EN LA VISIBILIZACIÓN DE LA GESTIÓN TURÍSTICA Y CULTURAL DE LA CANDELARIA EN EL MARCO DEL PLAN DE REACTIVACIÓN ECONÓMICA","Inversión","Bogotá Mejor para Todos",45,{"$f":"IF(ISERROR(VLOOKUP(K174,Eje_Pilar_Prop!$C$2:$E$104,2,FALSE)),\" \",VLOOKUP(K174,Eje_Pilar_Prop!$C$2:$E$104,2,FALSE))","v":"Gobernanza e influencia local, regional e internacional"},{"$f":"IF(ISERROR(VLOOKUP(K174,Eje_Pilar_Prop!$C$2:$E$104,3,FALSE)),\" \",VLOOKUP(K174,Eje_Pilar_Prop!$C$2:$E$104,3,FALSE))","v":"Eje Transversal 4 Gobierno Legitimo, Fortalecimiento Local y Eficiencia"},1395,80249660,"JHONNATAN ACOSTA HERRADA",9822615,null,null,1,4038187,13860802,10695736,"2020-09-23","2020-09-23","2021-01-29",90,1,37,null,null,null,null,null,null,"X",null,0.77165347286542296,{"$f":"IF(SUMPRODUCT((A$14:A174=A174)*(B$14:B174=B174)*(D$14:D174=D174))>1,0,1)","v":1},"Contratos de prestación de servicios profesionales y de apoyo a la gestión","Contratación directa",{"$f":"IF(ISBLANK(G174),1,IFERROR(VLOOKUP(G174,Tipo!$C$12:$C$27,1,FALSE),\"NO\"))","v":"Prestación de servicios profesionales y de apoyo a la gestión, o para la ejecución de trabajos artísticos que sólo puedan encomendarse a determinadas personas naturales;"},"Inversión",{"$f":"IF(ISBLANK(K174),1,IFERROR(VLOOKUP(K174,Eje_Pilar_Prop!C152:C253,1,FALSE),\"NO\"))","v":"NO"},"SECOP II",1,"Bogotá Mejor para Todos"]
[167,2020,"SECOP II","FDLC-CPS-167-2020","Contratos de prestación de servicios profesionales y de apoyo a la gestión","Contratación directa","Prestación de servicios profesionales y de apoyo a la gestión, o para la ejecución de trabajos artísticos que sólo puedan encomendarse a determinadas personas naturales;","PRESTACIÓN DE SERVICIOS PROFESIONALES PARA FORTALECER LA ETAPA CONTRACTUAL Y POSCONTRACTUAL DE LOS CONTRATOS CELEBRADOS POR EL FONDO DE DESARROLLO LOCAL DE LA CANDELARIA, APOYANDO SU SUPERVISIÓN Y LIQUIDACIÓN DE ACUERDO CON LOS PROCEDIMIENTOS ESTABLECIDOS EN LA NORMATIVIDAD VIGENTE.","Inversión","Bogotá Mejor para Todos",45,{"$f":"IF(ISERROR(VLOOKUP(K175,Eje_Pilar_Prop!$C$2:$E$104,2,FALSE)),\" \",VLOOKUP(K175,Eje_Pilar_Prop!$C$2:$E$104,2,FALSE))","v":"Gobernanza e influencia local, regional e internacional"},{"$f":"IF(ISERROR(VLOOKUP(K175,Eje_Pilar_Prop!$C$2:$E$104,3,FALSE)),\" \",VLOOKUP(K175,Eje_Pilar_Prop!$C$2:$E$104,3,FALSE))","v":"Eje Transversal 4 Gobierno Legitimo, Fortalecimiento Local y Eficiencia"},1395,1026283569,"ELVIS MIGUEL GARCIA OVALLE",12271680,null,null,0,null,12271680,5181376,"2020-09-23","2020-09-23","2020-12-22",90,null,null,null,null,null,null,null,null,"X",null,0.42222222222222222,{"$f":"IF(SUMPRODUCT((A$14:A175=A175)*(B$14:B175=B175)*(D$14:D175=D175))>1,0,1)","v":1},"Contratos de prestación de servicios profesionales y de apoyo a la gestión","Contratación directa",{"$f":"IF(ISBLANK(G175),1,IFERROR(VLOOKUP(G175,Tipo!$C$12:$C$27,1,FALSE),\"NO\"))","v":"Prestación de servicios profesionales y de apoyo a la gestión, o para la ejecución de trabajos artísticos que sólo puedan encomendarse a determinadas personas naturales;"},"Inversión",{"$f":"IF(ISBLANK(K175),1,IFERROR(VLOOKUP(K175,Eje_Pilar_Prop!C153:C254,1,FALSE),\"NO\"))","v":"NO"},"SECOP II",1,"Bogotá Mejor para Todos"]
[168,2020,"SECOP II","FDLC-CPS-168-2020","Contratos de prestación de servicios profesionales y de apoyo a la gestión","Contratación directa","Prestación de servicios profesionales y de apoyo a la gestión, o para la ejecución de trabajos artísticos que sólo puedan encomendarse a determinadas personas naturales;","PRESTAR SERVICIOS DE APOYO EN LAS ACTIVIDADES DE SEGURIDAD Y CONVIVENCIA CIUDADANA, DE ACUERDO A LAS NECESIDADES Y ESTRATEGIAS EMANADAS POR EL ÁREA DE SEGURIDAD Y CONVIVENCIA DE LA ALCALDÍA LOCAL DE LA CANDELARIA .CLÁUSULA SEGUNDA.- OBLIGACIONES DE EL CONTRATISTA: GENERALES","Inversión","Bogotá Mejor para Todos",19,{"$f":"IF(ISERROR(VLOOKUP(K176,Eje_Pilar_Prop!$C$2:$E$104,2,FALSE)),\" \",VLOOKUP(K176,Eje_Pilar_Prop!$C$2:$E$104,2,FALSE))","v":"Seguridad y convivencia para todos"},{"$f":"IF(ISERROR(VLOOKUP(K176,Eje_Pilar_Prop!$C$2:$E$104,3,FALSE)),\" \",VLOOKUP(K176,Eje_Pilar_Prop!$C$2:$E$104,3,FALSE))","v":"Pilar 3 Construcción de Comunidad y Cultura Ciudadana"},1392,11810899,"WALFRAN PRENS MARTINEZ",4500000,null,null,0,null,4500000,3400000,"2020-09-23","2020-09-25","2020-12-24",90,null,null,null,null,null,null,null,null,"X",null,0.75555555555555554,{"$f":"IF(SUMPRODUCT((A$14:A176=A176)*(B$14:B176=B176)*(D$14:D176=D176))>1,0,1)","v":1},"Contratos de prestación de servicios profesionales y de apoyo a la gestión","Contratación directa",{"$f":"IF(ISBLANK(G176),1,IFERROR(VLOOKUP(G176,Tipo!$C$12:$C$27,1,FALSE),\"NO\"))","v":"Prestación de servicios profesionales y de apoyo a la gestión, o para la ejecución de trabajos artísticos que sólo puedan encomendarse a determinadas personas naturales;"},"Inversión",{"$f":"IF(ISBLANK(K176),1,IFERROR(VLOOKUP(K176,Eje_Pilar_Prop!C154:C255,1,FALSE),\"NO\"))","v":"NO"},"SECOP II",1,"Bogotá Mejor para Todos"]
[169,2020,"SECOP II","FDLC-CPS-169-2020","Contratos de prestación de servicios profesionales y de apoyo a la gestión","Contratación directa","Prestación de servicios profesionales y de apoyo a la gestión, o para la ejecución de trabajos artísticos que sólo puedan encomendarse a determinadas personas naturales;","PRESTACION DE SERVICIOS PROFESIONALES COMO ABOGADO DE APOYO AL DESPACHO, EN LAS DIFERENTES ACTIVIDADES Y FUNCIONES QUE LE COMPETEN A ESTA DEPENDENCIA DEL FONDO DE DESARROLLO LOCAL LA CANDELARIA","Inversión","Bogotá Mejor para Todos",45,{"$f":"IF(ISERROR(VLOOKUP(K177,Eje_Pilar_Prop!$C$2:$E$104,2,FALSE)),\" \",VLOOKUP(K177,Eje_Pilar_Prop!$C$2:$E$104,2,FALSE))","v":"Gobernanza e influencia local, regional e internacional"},{"$f":"IF(ISERROR(VLOOKUP(K177,Eje_Pilar_Prop!$C$2:$E$104,3,FALSE)),\" \",VLOOKUP(K177,Eje_Pilar_Prop!$C$2:$E$104,3,FALSE))","v":"Eje Transversal 4 Gobierno Legitimo, Fortalecimiento Local y Eficiencia"},1395,52314352,"CONSTANZA DEL PILAR LEYTON RICO",14984100,null,null,null,6326620,21310720,16316020,"2020-09-23","2020-09-23","29/ 01/ 2021",90,1,38,null,null,null,null,null,null,"X",null,0.765625,{"$f":"IF(SUMPRODUCT((A$14:A177=A177)*(B$14:B177=B177)*(D$14:D177=D177))>1,0,1)","v":1}]
[170,2020,"SECOP II","FDLC-CPS-170-2020","Contratos de prestación de servicios profesionales y de apoyo a la gestión","Contratación directa","Prestación de servicios profesionales y de apoyo a la gestión, o para la ejecución de trabajos artísticos que sólo puedan encomendarse a determinadas personas naturales;","PRESTACIÓN DE SERVICIOS PROFESIONALES ESPECIALIZADOS AL FONDO DE DESARROLLO LOCAL LA CANDELARIA EN LO RELACIONADO CON LOS PROCESOS PRECONTRACTUALES, CONTRACTUALES Y POSCONTRALES DE MAYOR CUANTÍA Y DEMÁS PROCESOS QUE SE REQUIERA","Inversión","Bogotá Mejor para Todos",45,{"$f":"IF(ISERROR(VLOOKUP(K178,Eje_Pilar_Prop!$C$2:$E$104,2,FALSE)),\" \",VLOOKUP(K178,Eje_Pilar_Prop!$C$2:$E$104,2,FALSE))","v":"Gobernanza e influencia local, regional e internacional"},{"$f":"IF(ISERROR(VLOOKUP(K178,Eje_Pilar_Prop!$C$2:$E$104,3,FALSE)),\" \",VLOOKUP(K178,Eje_Pilar_Prop!$C$2:$E$104,3,FALSE))","v":"Eje Transversal 4 Gobierno Legitimo, Fortalecimiento Local y Eficiencia"},1395,1032470720,"YAISIR MARÍA VIDAL SANCHEZ",19757142,null,null,null,8341905,28099047,14927618,"2020-09-23","2020-09-23","29/ 01/ 2021",90,1,38,null,null,null,null,null,null,"X",null,0.53124997442084065,{"$f":"IF(SUMPRODUCT((A$14:A178=A178)*(B$14:B178=B178)*(D$14:D178=D178))>1,0,1)","v":1}]
[171,2020,"SECOP II","FDLC-CPS-171-2020","Contratos de prestación de servicios profesionales y de apoyo a la gestión","Contratación directa","Prestación de servicios profesionales y de apoyo a la gestión, o para la ejecución de trabajos artísticos que sólo puedan encomendarse a determinadas personas naturales;","APOYAR ADMINISTRATIVA Y ASISTENCIALMENTE A LAS INSPECCIONES DE POLICÍA DE LA LOCALIDAD","Inversión","Bogotá Mejor para Todos",45,{"$f":"IF(ISERROR(VLOOKUP(K179,Eje_Pilar_Prop!$C$2:$E$104,2,FALSE)),\" \",VLOOKUP(K179,Eje_Pilar_Prop!$C$2:$E$104,2,FALSE))","v":"Gobernanza e influencia local, regional e internacional"},{"$f":"IF(ISERROR(VLOOKUP(K179,Eje_Pilar_Prop!$C$2:$E$104,3,FALSE)),\" \",VLOOKUP(K179,Eje_Pilar_Prop!$C$2:$E$104,3,FALSE))","v":"Eje Transversal 4 Gobierno Legitimo, Fortalecimiento Local y Eficiencia"},1395,51838961,"MARIA ADELAIDA LUNA BUENAVENTURA",5661828,null,null,0,null,5661828,5661825,"2020-09-25","2020-09-25","2020-12-24",90,null,null,null,null,null,null,null,null,null,"X",0.9999994701357936,{"$f":"IF(SUMPRODUCT((A$14:A179=A179)*(B$14:B179=B179)*(D$14:D179=D179))>1,0,1)","v":1},"Contratos de prestación de servicios profesionales y de apoyo a la gestión","Contratación directa",{"$f":"IF(ISBLANK(G179),1,IFERROR(VLOOKUP(G179,Tipo!$C$12:$C$27,1,FALSE),\"NO\"))","v":"Prestación de servicios profesionales y de apoyo a la gestión, o para la ejecución de trabajos artísticos que sólo puedan encomendarse a determinadas personas naturales;"},"Inversión",{"$f":"IF(ISBLANK(K179),1,IFERROR(VLOOKUP(K179,Eje_Pilar_Prop!C155:C256,1,FALSE),\"NO\"))","v":"NO"},"SECOP II",1,"Bogotá Mejor para Todos"]
[172,2020,"SECOP II","FDLC-CPS-172-2020","Contratos de prestación de servicios profesionales y de apoyo a la gestión","Contratación directa","Prestación de servicios profesionales y de apoyo a la gestión, o para la ejecución de trabajos artísticos que sólo puedan encomendarse a determinadas personas naturales;","PRESTACIÓN DE SERVICIOS PROFESIONALES AL ÁREA DE GESTIÓN DE DESARROLLO LOCAL DE LA ALCALDÍA LOCAL DE LA CANDELARIA, PARA AFECTUAR APOYO EN LA COORDINACION TÉCNICA EN EL SEGUIMIENTO DE PLANES, POLÍTICAS, PROGRAMAS Y PROYECTOS DE INFRAESTRUCTURA EN EL MARCO DE LA CONSTRUCCIÓN DEL NUEVO PLAN DE DESARROLLO","Inversión","Bogotá Mejor para Todos",45,{"$f":"IF(ISERROR(VLOOKUP(K180,Eje_Pilar_Prop!$C$2:$E$104,2,FALSE)),\" \",VLOOKUP(K180,Eje_Pilar_Prop!$C$2:$E$104,2,FALSE))","v":"Gobernanza e influencia local, regional e internacional"},{"$f":"IF(ISERROR(VLOOKUP(K180,Eje_Pilar_Prop!$C$2:$E$104,3,FALSE)),\" \",VLOOKUP(K180,Eje_Pilar_Prop!$C$2:$E$104,3,FALSE))","v":"Eje Transversal 4 Gobierno Legitimo, Fortalecimiento Local y Eficiencia"},1395,80166444,"YERNEY ROLANDO RODRIGUEZ AVILA",17354857,null,null,1,7134657,24489514,12919676,"2020-09-24","2020-09-24","2021-01-29",90,null,37,null,null,null,null,null,null,"X",null,0.52755950975588983,{"$f":"IF(SUMPRODUCT((A$14:A180=A180)*(B$14:B180=B180)*(D$14:D180=D180))>1,0,1)","v":1},"Contratos de prestación de servicios profesionales y de apoyo a la gestión","Contratación directa",{"$f":"IF(ISBLANK(G180),1,IFERROR(VLOOKUP(G180,Tipo!$C$12:$C$27,1,FALSE),\"NO\"))","v":"Prestación de servicios profesionales y de apoyo a la gestión, o para la ejecución de trabajos artísticos que sólo puedan encomendarse a determinadas personas naturales;"},"Inversión",{"$f":"IF(ISBLANK(K180),1,IFERROR(VLOOKUP(K180,Eje_Pilar_Prop!C156:C257,1,FALSE),\"NO\"))","v":"NO"},"SECOP II",1,"Bogotá Mejor para Todos"]
[173,2020,"SECOP II","FDLC-CPS-173-2020","Contratos de prestación de servicios profesionales y de apoyo a la gestión","Contratación directa","Prestación de servicios profesionales y de apoyo a la gestión, o para la ejecución de trabajos artísticos que sólo puedan encomendarse a determinadas personas naturales;","PRESTAR SERVICIOS DE APOYO EN LAS ACTIVIDADES DE SEGURIDAD Y CONVIVENCIA CIUDADANA, DE ACUERDO A LAS NECESIDADES Y ESTRATEGIAS EMANADAS POR EL ÁREA DE SEGURIDAD Y CONVIVENCIA DE LA ALCALDIA LOCAL DE LA CANDELARIA","Inversión","Bogotá Mejor para Todos",19,{"$f":"IF(ISERROR(VLOOKUP(K181,Eje_Pilar_Prop!$C$2:$E$104,2,FALSE)),\" \",VLOOKUP(K181,Eje_Pilar_Prop!$C$2:$E$104,2,FALSE))","v":"Seguridad y convivencia para todos"},{"$f":"IF(ISERROR(VLOOKUP(K181,Eje_Pilar_Prop!$C$2:$E$104,3,FALSE)),\" \",VLOOKUP(K181,Eje_Pilar_Prop!$C$2:$E$104,3,FALSE))","v":"Pilar 3 Construcción de Comunidad y Cultura Ciudadana"},1392,"1.051.654.292/1040744991"," JESUS DAVID GONZALEZ SOTO ",4500000,null,null,1,1850000,6350000,4600000,"2020-09-25","2020-09-25","2021-01-29",90,null,36,1051654292,"TITO JOSÉ MUTIS VALEST","2020-09-30",4250000,null,null,"X",null,0.72440944881889768,{"$f":"IF(SUMPRODUCT((A$14:A181=A181)*(B$14:B181=B181)*(D$14:D181=D181))>1,0,1)","v":1},"Contratos de prestación de servicios profesionales y de apoyo a la gestión","Contratación directa",{"$f":"IF(ISBLANK(G181),1,IFERROR(VLOOKUP(G181,Tipo!$C$12:$C$27,1,FALSE),\"NO\"))","v":"Prestación de servicios profesionales y de apoyo a la gestión, o para la ejecución de trabajos artísticos que sólo puedan encomendarse a determinadas personas naturales;"},"Inversión",{"$f":"IF(ISBLANK(K181),1,IFERROR(VLOOKUP(K181,Eje_Pilar_Prop!C157:C258,1,FALSE),\"NO\"))","v":"NO"},"SECOP II",1,"Bogotá Mejor para Todos"]
[174,2020,"SECOP II","FDLC-CPS-174-2020","Contratos de prestación de servicios profesionales y de apoyo a la gestión","Contratación directa","Prestación de servicios profesionales y de apoyo a la gestión, o para la ejecución de trabajos artísticos que sólo puedan encomendarse a determinadas personas naturales;","RESTACION DE SERVICIOS PROFESIONALES PARA APOYAR LA FORMULACION, EVALUACION, PRESENTACION Y SEGUIMIENTO, ESPECIALMENTE DE LOS PROYECTOS AMBIENTALES Y DOTACIÓN INSTITUCIONES EDUCATIVAS DISTRITALES, LIDERADOS POR EL FONDO DE DESARROLLO LOCAL LA CANDELARI","Inversión","Bogotá Mejor para Todos",45,{"$f":"IF(ISERROR(VLOOKUP(K182,Eje_Pilar_Prop!$C$2:$E$104,2,FALSE)),\" \",VLOOKUP(K182,Eje_Pilar_Prop!$C$2:$E$104,2,FALSE))","v":"Gobernanza e influencia local, regional e internacional"},{"$f":"IF(ISERROR(VLOOKUP(K182,Eje_Pilar_Prop!$C$2:$E$104,3,FALSE)),\" \",VLOOKUP(K182,Eje_Pilar_Prop!$C$2:$E$104,3,FALSE))","v":"Eje Transversal 4 Gobierno Legitimo, Fortalecimiento Local y Eficiencia"},1395,1024509446,"LIZETH NATALY GONZALEZ GUAJE",11929343,null,null,0,null,{"$f":"+Q182+S182+U182","v":11929343},11929343,"2020-09-25","2020-09-25","2020-12-24",90,null,null,null,null,null,null,null,null,null,"X",1,{"$f":"IF(SUMPRODUCT((A$14:A182=A182)*(B$14:B182=B182)*(D$14:D182=D182))>1,0,1)","v":1},"Contratos de prestación de servicios profesionales y de apoyo a la gestión","Contratación directa",{"$f":"IF(ISBLANK(G182),1,IFERROR(VLOOKUP(G182,Tipo!$C$12:$C$27,1,FALSE),\"NO\"))","v":"Prestación de servicios profesionales y de apoyo a la gestión, o para la ejecución de trabajos artísticos que sólo puedan encomendarse a determinadas personas naturales;"},"Inversión",{"$f":"IF(ISBLANK(K182),1,IFERROR(VLOOKUP(K182,Eje_Pilar_Prop!C158:C259,1,FALSE),\"NO\"))","v":"NO"},"SECOP II",1,"Bogotá Mejor para Todos"]
[175,2020,"SECOP II","FDLC-CPS-175-2020","Contratos de prestación de servicios profesionales y de apoyo a la gestión","Contratación directa","Prestación de servicios profesionales y de apoyo a la gestión, o para la ejecución de trabajos artísticos que sólo puedan encomendarse a determinadas personas naturales;","PRESTAR SERVICIOS DE APOYO EN LAS ACTIVIDADES DE SEGURIDAD Y CONVIVENCIA CIUDADANA, DE ACUERDO A LAS NECESIDADES Y ESTRATEGIAS EMANADAS POR EL ÁREA DE SEGURIDAD Y CONVIVENCIA DE LA ALCALDIA LOCAL DE LA CANDELARIA.","Inversión","Bogotá Mejor para Todos",19,{"$f":"IF(ISERROR(VLOOKUP(K183,Eje_Pilar_Prop!$C$2:$E$104,2,FALSE)),\" \",VLOOKUP(K183,Eje_Pilar_Prop!$C$2:$E$104,2,FALSE))","v":"Seguridad y convivencia para todos"},{"$f":"IF(ISERROR(VLOOKUP(K183,Eje_Pilar_Prop!$C$2:$E$104,3,FALSE)),\" \",VLOOKUP(K183,Eje_Pilar_Prop!$C$2:$E$104,3,FALSE))","v":"Pilar 3 Construcción de Comunidad y Cultura Ciudadana"},1392,1010173294,"FERNEY BOTACHE CONTRERAS",4000000,null,null,1,1600000,5600000,4100000,"2020-10-09","2020-10-09","2021-01-30",80,1,32,null,null,null,null,null,null,"X",null,0.7321428571428571,{"$f":"IF(SUMPRODUCT((A$14:A183=A183)*(B$14:B183=B183)*(D$14:D183=D183))>1,0,1)","v":1},"Contratos de prestación de servicios profesionales y de apoyo a la gestión","Contratación directa",{"$f":"IF(ISBLANK(G183),1,IFERROR(VLOOKUP(G183,Tipo!$C$12:$C$27,1,FALSE),\"NO\"))","v":"Prestación de servicios profesionales y de apoyo a la gestión, o para la ejecución de trabajos artísticos que sólo puedan encomendarse a determinadas personas naturales;"},"Inversión",{"$f":"IF(ISBLANK(K183),1,IFERROR(VLOOKUP(K183,Eje_Pilar_Prop!C159:C260,1,FALSE),\"NO\"))","v":"NO"},"SECOP II",1,"Bogotá Mejor para Todos"]
[176,2020,"SECOP II","FDLC-CPS-176-2020","Contratos de prestación de servicios profesionales y de apoyo a la gestión","Contratación directa","Prestación de servicios profesionales y de apoyo a la gestión, o para la ejecución de trabajos artísticos que sólo puedan encomendarse a determinadas personas naturales;","PRESTAR SERVICIOS DE APOYO EN LAS ACTIVIDADES DE SEGURIDAD Y CONVIVENCIA CIUDADANA, DE ACUERDO A LAS NECESIDADES Y ESTRATEGIAS EMANADAS POR EL ÁREA DE SEGURIDAD Y CONVIVENCIA DE LA ALCALDIA LOCAL DE LA CANDELARIA.","Inversión","Bogotá Mejor para Todos",19,{"$f":"IF(ISERROR(VLOOKUP(K184,Eje_Pilar_Prop!$C$2:$E$104,2,FALSE)),\" \",VLOOKUP(K184,Eje_Pilar_Prop!$C$2:$E$104,2,FALSE))","v":"Seguridad y convivencia para todos"},{"$f":"IF(ISERROR(VLOOKUP(K184,Eje_Pilar_Prop!$C$2:$E$104,3,FALSE)),\" \",VLOOKUP(K184,Eje_Pilar_Prop!$C$2:$E$104,3,FALSE))","v":"Pilar 3 Construcción de Comunidad y Cultura Ciudadana"},1392,10101195092,"MAYRA LIZETH DELGADO ACERO",4000000,null,null,1,1600000,5600000,4150000,"2020-10-09","2020-10-09","2021-01-29",80,1,32,null,null,null,null,null,null,"X",null,0.7410714285714286,{"$f":"IF(SUMPRODUCT((A$14:A184=A184)*(B$14:B184=B184)*(D$14:D184=D184))>1,0,1)","v":1},"Contratos de prestación de servicios profesionales y de apoyo a la gestión","Contratación directa",{"$f":"IF(ISBLANK(G184),1,IFERROR(VLOOKUP(G184,Tipo!$C$12:$C$27,1,FALSE),\"NO\"))","v":"Prestación de servicios profesionales y de apoyo a la gestión, o para la ejecución de trabajos artísticos que sólo puedan encomendarse a determinadas personas naturales;"},"Inversión",{"$f":"IF(ISBLANK(K184),1,IFERROR(VLOOKUP(K184,Eje_Pilar_Prop!C160:C261,1,FALSE),\"NO\"))","v":"NO"},"SECOP II",1,"Bogotá Mejor para Todos"]
[177,2020,"SECOP II","FDLC-CPS-177-2020","Contratos de prestación de servicios profesionales y de apoyo a la gestión","Contratación directa","Prestación de servicios profesionales y de apoyo a la gestión, o para la ejecución de trabajos artísticos que sólo puedan encomendarse a determinadas personas naturales;","PRESTAR SERVICIOS DE APOYO EN LAS ACTIVIDADES DE SEGURIDAD Y CONVIVENCIA CIUDADANA, DE ACUERDO A LAS NECESIDADES Y ESTRATEGIAS EMANADAS POR EL ÁREA DE SEGURIDAD Y CONVIVENCIA DE LA ALCALDIA LOCAL DE LA CANDELARIA.","Inversión","Bogotá Mejor para Todos",19,{"$f":"IF(ISERROR(VLOOKUP(K185,Eje_Pilar_Prop!$C$2:$E$104,2,FALSE)),\" \",VLOOKUP(K185,Eje_Pilar_Prop!$C$2:$E$104,2,FALSE))","v":"Seguridad y convivencia para todos"},{"$f":"IF(ISERROR(VLOOKUP(K185,Eje_Pilar_Prop!$C$2:$E$104,3,FALSE)),\" \",VLOOKUP(K185,Eje_Pilar_Prop!$C$2:$E$104,3,FALSE))","v":"Pilar 3 Construcción de Comunidad y Cultura Ciudadana"},1392,43904066,"NARIA NATHALIE INFANTE GOMEZ",4000000,null,null,1,1600000,5600000,4100000,"2020-10-09","2020-10-09","2021-01-30",80,1,32,null,null,null,null,null,null,"X",null,0.7321428571428571,{"$f":"IF(SUMPRODUCT((A$14:A185=A185)*(B$14:B185=B185)*(D$14:D185=D185))>1,0,1)","v":1},"Contratos de prestación de servicios profesionales y de apoyo a la gestión","Contratación directa",{"$f":"IF(ISBLANK(G185),1,IFERROR(VLOOKUP(G185,Tipo!$C$12:$C$27,1,FALSE),\"NO\"))","v":"Prestación de servicios profesionales y de apoyo a la gestión, o para la ejecución de trabajos artísticos que sólo puedan encomendarse a determinadas personas naturales;"},"Inversión",{"$f":"IF(ISBLANK(K185),1,IFERROR(VLOOKUP(K185,Eje_Pilar_Prop!C161:C262,1,FALSE),\"NO\"))","v":"NO"},"SECOP II",1,"Bogotá Mejor para Todos"]
[178,2020,"SECOP II","FDLC-CPS-178-2020","Contratos de prestación de servicios profesionales y de apoyo a la gestión","Contratación directa","Prestación de servicios profesionales y de apoyo a la gestión, o para la ejecución de trabajos artísticos que sólo puedan encomendarse a determinadas personas naturales;","PRESTAR SU SERVICIO PROFESIONAL PARA APOYAR LA GESTION DE LOS ASUNTOS RELACIONADOS CON SEGURIDAD CIUDADANA, CONVIVENCIA, ASÍ COMO ORGANIZAR Y LIDERAR EL EQUIPO DE GESTORES DE CONVIVENCIA, DE ACUERDO A LAS NECESIDADES Y ESTRATEGIAS EMANADAS POR EL ÁREA DE SEGURIDAD Y CONVIVENCIA DEL FDLC","Inversión","Bogotá Mejor para Todos",19,{"$f":"IF(ISERROR(VLOOKUP(K186,Eje_Pilar_Prop!$C$2:$E$104,2,FALSE)),\" \",VLOOKUP(K186,Eje_Pilar_Prop!$C$2:$E$104,2,FALSE))","v":"Seguridad y convivencia para todos"},{"$f":"IF(ISERROR(VLOOKUP(K186,Eje_Pilar_Prop!$C$2:$E$104,3,FALSE)),\" \",VLOOKUP(K186,Eje_Pilar_Prop!$C$2:$E$104,3,FALSE))","v":"Pilar 3 Construcción de Comunidad y Cultura Ciudadana"},1392,52716195,"ADRIANA MARIA TOLEDO PEÑA",4133334,null,null,null,null,4133334,0,"2020-10-09","2020-10-09","2021-01-29",80,1,31,null,null,null,null,null,null,"X",null,0,{"$f":"IF(SUMPRODUCT((A$14:A186=A186)*(B$14:B186=B186)*(D$14:D186=D186))>1,0,1)","v":1},"Contratos de prestación de servicios profesionales y de apoyo a la gestión","Contratación directa",{"$f":"IF(ISBLANK(G186),1,IFERROR(VLOOKUP(G186,Tipo!$C$12:$C$27,1,FALSE),\"NO\"))","v":"Prestación de servicios profesionales y de apoyo a la gestión, o para la ejecución de trabajos artísticos que sólo puedan encomendarse a determinadas personas naturales;"},"Inversión",{"$f":"IF(ISBLANK(K186),1,IFERROR(VLOOKUP(K186,Eje_Pilar_Prop!C162:C263,1,FALSE),\"NO\"))","v":"NO"},"SECOP II",1,"Bogotá Mejor para Todos"]
[179,2020,"SECOP II","FDLC-CPS-179-2020","Contratos de prestación de servicios profesionales y de apoyo a la gestión","Contratación directa","Prestación de servicios profesionales y de apoyo a la gestión, o para la ejecución de trabajos artísticos que sólo puedan encomendarse a determinadas personas naturales;","PRESTAR SERVICIOS DE APOYO EN LAS ACTIVIDADES DE SEGURIDAD Y CONVIVENCIA CIUDADANA, DE ACUERDO A LAS NECESIDADES Y ESTRATEGIAS EMANADAS POR EL ÁREA DE SEGURIDAD Y CONVIVENCIA DE LA ALCALDIA LOCAL DE LA CANDELARIA.","Inversión","Bogotá Mejor para Todos",19,{"$f":"IF(ISERROR(VLOOKUP(K187,Eje_Pilar_Prop!$C$2:$E$104,2,FALSE)),\" \",VLOOKUP(K187,Eje_Pilar_Prop!$C$2:$E$104,2,FALSE))","v":"Seguridad y convivencia para todos"},{"$f":"IF(ISERROR(VLOOKUP(K187,Eje_Pilar_Prop!$C$2:$E$104,3,FALSE)),\" \",VLOOKUP(K187,Eje_Pilar_Prop!$C$2:$E$104,3,FALSE))","v":"Pilar 3 Construcción de Comunidad y Cultura Ciudadana"},1392,24344028,"JULY ANDREA MONTAÑO NIETO",4000000,null,null,1,1600000,5600000,4150000,"2020-10-09","2020-10-09","2021-01-29",80,1,32,null,null,null,null,null,null,"X",null,0.7410714285714286,{"$f":"IF(SUMPRODUCT((A$14:A187=A187)*(B$14:B187=B187)*(D$14:D187=D187))>1,0,1)","v":1},"Contratos de prestación de servicios profesionales y de apoyo a la gestión","Contratación directa",{"$f":"IF(ISBLANK(G187),1,IFERROR(VLOOKUP(G187,Tipo!$C$12:$C$27,1,FALSE),\"NO\"))","v":"Prestación de servicios profesionales y de apoyo a la gestión, o para la ejecución de trabajos artísticos que sólo puedan encomendarse a determinadas personas naturales;"},"Inversión",{"$f":"IF(ISBLANK(K187),1,IFERROR(VLOOKUP(K187,Eje_Pilar_Prop!C163:C264,1,FALSE),\"NO\"))","v":"NO"},"SECOP II",1,"Bogotá Mejor para Todos"]
[180,2020,"SECOP II","FDLC-CPS-180-2020","Contratos de prestación de servicios profesionales y de apoyo a la gestión","Contratación directa","Prestación de servicios profesionales y de apoyo a la gestión, o para la ejecución de trabajos artísticos que sólo puedan encomendarse a determinadas personas naturales;","PRESTAR SERVICIOS DE APOYO EN LAS ACTIVIDADES DE SEGURIDAD Y CONVIVENCIA CIUDADANA, DE ACUERDO A LAS NECESIDADES Y ESTRATEGIAS EMANADAS POR EL ÁREA DE SEGURIDAD Y CONVIVENCIA DE LA ALCALDIA LOCAL DE LA CANDELARIA.","Inversión","Bogotá Mejor para Todos",19,{"$f":"IF(ISERROR(VLOOKUP(K188,Eje_Pilar_Prop!$C$2:$E$104,2,FALSE)),\" \",VLOOKUP(K188,Eje_Pilar_Prop!$C$2:$E$104,2,FALSE))","v":"Seguridad y convivencia para todos"},{"$f":"IF(ISERROR(VLOOKUP(K188,Eje_Pilar_Prop!$C$2:$E$104,3,FALSE)),\" \",VLOOKUP(K188,Eje_Pilar_Prop!$C$2:$E$104,3,FALSE))","v":"Pilar 3 Construcción de Comunidad y Cultura Ciudadana"},1392,80206510,"Mauricio Arturo Calderon Duran",4000000,null,null,null,null,4000000,2600000,"2020-10-09","2020-10-09","2020-12-28",80,null,null,null,null,null,null,null,null,"X",null,0.65,{"$f":"IF(SUMPRODUCT((A$14:A188=A188)*(B$14:B188=B188)*(D$14:D188=D188))>1,0,1)","v":1},"Contratos de prestación de servicios profesionales y de apoyo a la gestión","Contratación directa",{"$f":"IF(ISBLANK(G188),1,IFERROR(VLOOKUP(G188,Tipo!$C$12:$C$27,1,FALSE),\"NO\"))","v":"Prestación de servicios profesionales y de apoyo a la gestión, o para la ejecución de trabajos artísticos que sólo puedan encomendarse a determinadas personas naturales;"},"Inversión",{"$f":"IF(ISBLANK(K188),1,IFERROR(VLOOKUP(K188,Eje_Pilar_Prop!C164:C265,1,FALSE),\"NO\"))","v":"NO"},"SECOP II",1,"Bogotá Mejor para Todos"]
[181,2020,"SECOP II","FDLC-CPS-181-2020","Contratos de prestación de servicios profesionales y de apoyo a la gestión","Contratación directa","Prestación de servicios profesionales y de apoyo a la gestión, o para la ejecución de trabajos artísticos que sólo puedan encomendarse a determinadas personas naturales;","PRESTAR LOS SERVICIOS TÉCNICOS PARA LA OPERACIÓN, SEGUIMIENTO Y CUMPLIMIENTO DE LOS PROCESOS Y PROCEDIMIENTOS DEL SERVICIO APOYOS PARA LA SEGURIDAD ECONÓMICA TIPO C, REQUERIDOS PARA EL OPORTUNO Y ADECUADO REGISTRO, CRUCE Y REPORTE DE LOS DATOS EN EL SISTEMA MISIONAL¿SIRBE, QUE CONTRIBUYAN A LA GARANTÍA DE LOS DERECHOS DE LA POBLACIÓN MAYOR EN EL MARCO DE LA POLÍTICA PÚBLICA SOCIAL PARA EL ENVEJECIMIENTO Y LA VEJEZ5 EN EL DISTRITO CAPITAL A CARGO DE LA ALCALDÍA LOCAL","Inversión","Bogotá Mejor para Todos",3,{"$f":"IF(ISERROR(VLOOKUP(K189,Eje_Pilar_Prop!$C$2:$E$104,2,FALSE)),\" \",VLOOKUP(K189,Eje_Pilar_Prop!$C$2:$E$104,2,FALSE))","v":"Igualdad y autonomía para una Bogotá incluyente"},{"$f":"IF(ISERROR(VLOOKUP(K189,Eje_Pilar_Prop!$C$2:$E$104,3,FALSE)),\" \",VLOOKUP(K189,Eje_Pilar_Prop!$C$2:$E$104,3,FALSE))","v":"Pilar 1 Igualdad de Calidad de Vida"},1386,1081911958,"DULCE MARIA BARRIOS CAMACHO",6386015,null,null,1,3150436,9536451,6556309,"2020-10-14","2020-10-14","2021-02-04",75,1,37,null,null,null,null,null,null,"X",null,0.6874998885853868,{"$f":"IF(SUMPRODUCT((A$14:A189=A189)*(B$14:B189=B189)*(D$14:D189=D189))>1,0,1)","v":1},"Contratos de prestación de servicios profesionales y de apoyo a la gestión","Contratación directa",{"$f":"IF(ISBLANK(G189),1,IFERROR(VLOOKUP(G189,Tipo!$C$12:$C$27,1,FALSE),\"NO\"))","v":"Prestación de servicios profesionales y de apoyo a la gestión, o para la ejecución de trabajos artísticos que sólo puedan encomendarse a determinadas personas naturales;"},"Inversión",{"$f":"IF(ISBLANK(K189),1,IFERROR(VLOOKUP(K189,Eje_Pilar_Prop!C165:C266,1,FALSE),\"NO\"))","v":"NO"},"SECOP II",1,"Bogotá Mejor para Todos"]
[182,2020,"SECOP II","FDLC-CPS-182-2020","Contratos de prestación de servicios profesionales y de apoyo a la gestión","Contratación directa","Prestación de servicios profesionales y de apoyo a la gestión, o para la ejecución de trabajos artísticos que sólo puedan encomendarse a determinadas personas naturales;","PRESTACIÓN DE SERVICIOS PROFESIONALES EN LA IMPLEMENTACIÓN DE ACCIONES Y ESTRATEGIAS CULTURALES, MUSICALES Y ARTÍSTICAS ENFOCADAS A LAS INSTANCIAS DE PARTICIPACIÓN DE LA LOCALIDAD LA CANDELARIA DE ACUERDO CON EL PROGRAMA \"GOBERNANZA E INFLUENCIA LOCAL, REGIONAL E INTERNACIONAL \"1389 CANDELARIA CULTURAL Y DEPORTIVA MEJOR PARA TODOS\"","Inversión","Bogotá Mejor para Todos",45,{"$f":"IF(ISERROR(VLOOKUP(K190,Eje_Pilar_Prop!$C$2:$E$104,2,FALSE)),\" \",VLOOKUP(K190,Eje_Pilar_Prop!$C$2:$E$104,2,FALSE))","v":"Gobernanza e influencia local, regional e internacional"},{"$f":"IF(ISERROR(VLOOKUP(K190,Eje_Pilar_Prop!$C$2:$E$104,3,FALSE)),\" \",VLOOKUP(K190,Eje_Pilar_Prop!$C$2:$E$104,3,FALSE))","v":"Eje Transversal 4 Gobierno Legitimo, Fortalecimiento Local y Eficiencia"},1395,53037540,"YURBY LISETT GAMBOA HERNANDEZ",9750000,null,null,0,null,9750000,9750000,"2020-10-13","2020-10-13","2020-12-27",75,null,null,null,null,null,null,null,null,null,"X",1,{"$f":"IF(SUMPRODUCT((A$14:A190=A190)*(B$14:B190=B190)*(D$14:D190=D190))>1,0,1)","v":1},"Contratos de prestación de servicios profesionales y de apoyo a la gestión","Contratación directa",{"$f":"IF(ISBLANK(G190),1,IFERROR(VLOOKUP(G190,Tipo!$C$12:$C$27,1,FALSE),\"NO\"))","v":"Prestación de servicios profesionales y de apoyo a la gestión, o para la ejecución de trabajos artísticos que sólo puedan encomendarse a determinadas personas naturales;"},"Inversión",{"$f":"IF(ISBLANK(K190),1,IFERROR(VLOOKUP(K190,Eje_Pilar_Prop!C166:C267,1,FALSE),\"NO\"))","v":"NO"},"SECOP II",1,"Bogotá Mejor para Todos"]
[183,2020,"SECOP II","FDLC-CPS-183-2020","Contratos de prestación de servicios profesionales y de apoyo a la gestión","Contratación directa","Prestación de servicios profesionales y de apoyo a la gestión, o para la ejecución de trabajos artísticos que sólo puedan encomendarse a determinadas personas naturales;","PRESTAR SERVICIOS PROFESIONALES AL FONDO DE DESARROLLO LOCAL LA CANDELARIA, PARA FORTALECER Y PROMOVER ESTRATEGIAS DE IMPLEMENTACION, APLICACION Y CAPACITACION A LA COMUNIDAD Y DIFERENTES SECTORES, EN MATERIA DE NORMATIVIDAD REFERENTE AL ESTATUTO DEL CONSUMIDOR LEY 1480 DE 2011","Inversión","Bogotá Mejor para Todos",45,{"$f":"IF(ISERROR(VLOOKUP(K191,Eje_Pilar_Prop!$C$2:$E$104,2,FALSE)),\" \",VLOOKUP(K191,Eje_Pilar_Prop!$C$2:$E$104,2,FALSE))","v":"Gobernanza e influencia local, regional e internacional"},{"$f":"IF(ISERROR(VLOOKUP(K191,Eje_Pilar_Prop!$C$2:$E$104,3,FALSE)),\" \",VLOOKUP(K191,Eje_Pilar_Prop!$C$2:$E$104,3,FALSE))","v":"Eje Transversal 4 Gobierno Legitimo, Fortalecimiento Local y Eficiencia"},1395,809729376,"MAURICIO ANTONIO BOHADA CARDENAS",10226405,null,null,0,null,10226405,10226405,"2020-10-13","2020-10-13","2020-12-27",75,null,null,null,null,null,null,null,null,null,"X",1,{"$f":"IF(SUMPRODUCT((A$14:A191=A191)*(B$14:B191=B191)*(D$14:D191=D191))>1,0,1)","v":1},"Contratos de prestación de servicios profesionales y de apoyo a la gestión","Contratación directa",{"$f":"IF(ISBLANK(G191),1,IFERROR(VLOOKUP(G191,Tipo!$C$12:$C$27,1,FALSE),\"NO\"))","v":"Prestación de servicios profesionales y de apoyo a la gestión, o para la ejecución de trabajos artísticos que sólo puedan encomendarse a determinadas personas naturales;"},"Inversión",{"$f":"IF(ISBLANK(K191),1,IFERROR(VLOOKUP(K191,Eje_Pilar_Prop!C167:C268,1,FALSE),\"NO\"))","v":"NO"},"SECOP II",1,"Bogotá Mejor para Todos"]
[184,2020,"SECOP II","FDLC-CPS-184-2020","Contratos de prestación de servicios profesionales y de apoyo a la gestión","Contratación directa","Prestación de servicios profesionales y de apoyo a la gestión, o para la ejecución de trabajos artísticos que sólo puedan encomendarse a determinadas personas naturales;","PRESTAR SERVICIOS PROFESIONALES ESPECIALIZADOS PARA BRINDAR LINEAMIENTOS JURIDICOS, EVALUAR Y ORIENTAR TEMAS PRIORITARIOS DEL DESPACHO DE LA AL CALDIA LOCAL DE LA CANDELARIA.","Inversión","Bogotá Mejor para Todos",45,{"$f":"IF(ISERROR(VLOOKUP(K192,Eje_Pilar_Prop!$C$2:$E$104,2,FALSE)),\" \",VLOOKUP(K192,Eje_Pilar_Prop!$C$2:$E$104,2,FALSE))","v":"Gobernanza e influencia local, regional e internacional"},{"$f":"IF(ISERROR(VLOOKUP(K192,Eje_Pilar_Prop!$C$2:$E$104,3,FALSE)),\" \",VLOOKUP(K192,Eje_Pilar_Prop!$C$2:$E$104,3,FALSE))","v":"Eje Transversal 4 Gobierno Legitimo, Fortalecimiento Local y Eficiencia"},1395,52518431,"DIANA CRISTINA PALACIOS NOVOA",19000000,null,null,1,9500000,28500000,19950000,"2020-10-28","2020-10-28","2021-01-26",60,1,30,null,null,null,null,null,null,"X",null,0.7,{"$f":"IF(SUMPRODUCT((A$14:A192=A192)*(B$14:B192=B192)*(D$14:D192=D192))>1,0,1)","v":1},"Contratos de prestación de servicios profesionales y de apoyo a la gestión","Contratación directa",{"$f":"IF(ISBLANK(G192),1,IFERROR(VLOOKUP(G192,Tipo!$C$12:$C$27,1,FALSE),\"NO\"))","v":"Prestación de servicios profesionales y de apoyo a la gestión, o para la ejecución de trabajos artísticos que sólo puedan encomendarse a determinadas personas naturales;"},"Inversión",{"$f":"IF(ISBLANK(K192),1,IFERROR(VLOOKUP(K192,Eje_Pilar_Prop!C168:C269,1,FALSE),\"NO\"))","v":"NO"},"SECOP II",1,"Bogotá Mejor para Todos"]
[185,2020,"SECOP II","FDLC-CPS-185-2020","Contratos de prestación de servicios profesionales y de apoyo a la gestión","Contratación directa","Prestación de servicios profesionales y de apoyo a la gestión, o para la ejecución de trabajos artísticos que sólo puedan encomendarse a determinadas personas naturales;","PRESTACIÓN DE SERVICIOS PROFESIONALES COMO ADMINISTRADOR DE RED LOCAL, ENLACE CON LA SECRETARIA DISTRITAL DE GOBIERNO, BRINDANDO SOPORTE EN MATERIA DE\nSISTEMAS (SOFTWARE Y HARDWARE) A LOS USUARIOS INTERNOS Y EXTERNOS DE\nLAS DIFERENTES ÁREAS DE LA ALCALDÍA LOCAL LA CANDELARIA.”","Inversión","Bogotá Mejor para Todos",45,{"$f":"IF(ISERROR(VLOOKUP(K193,Eje_Pilar_Prop!$C$2:$E$104,2,FALSE)),\" \",VLOOKUP(K193,Eje_Pilar_Prop!$C$2:$E$104,2,FALSE))","v":"Gobernanza e influencia local, regional e internacional"},{"$f":"IF(ISERROR(VLOOKUP(K193,Eje_Pilar_Prop!$C$2:$E$104,3,FALSE)),\" \",VLOOKUP(K193,Eje_Pilar_Prop!$C$2:$E$104,3,FALSE))","v":"Eje Transversal 4 Gobierno Legitimo, Fortalecimiento Local y Eficiencia"},1395,79814029,"AGUSTIN LARA BELTRAN",9200000,null,null,1,4600000,13800000,9813333,"2020-10-28","2020-10-28","2021-01-26",60,1,30,null,null,null,null,null,null,"X",null,0.7111110869565217,{"$f":"IF(SUMPRODUCT((A$14:A193=A193)*(B$14:B193=B193)*(D$14:D193=D193))>1,0,1)","v":1},"Contratos de prestación de servicios profesionales y de apoyo a la gestión","Contratación directa",{"$f":"IF(ISBLANK(G193),1,IFERROR(VLOOKUP(G193,Tipo!$C$12:$C$27,1,FALSE),\"NO\"))","v":"Prestación de servicios profesionales y de apoyo a la gestión, o para la ejecución de trabajos artísticos que sólo puedan encomendarse a determinadas personas naturales;"},"Inversión",{"$f":"IF(ISBLANK(K193),1,IFERROR(VLOOKUP(K193,Eje_Pilar_Prop!C169:C270,1,FALSE),\"NO\"))","v":"NO"},"SECOP II",1,"Bogotá Mejor para Todos"]
[186,2020,"SECOP II","FDLC-CPS-186-2020","Contratos de prestación de servicios profesionales y de apoyo a la gestión","Contratación directa","Prestación de servicios profesionales y de apoyo a la gestión, o para la ejecución de trabajos artísticos que sólo puedan encomendarse a determinadas personas naturales;","“PRESTACIÓN DE SERVICIOS PROFESIONALES PARA APOYAR JURÍDICAMENTE LA EJECUCIÓN DE LAS ACCIONES REQUERIDAS PARA EL TRÁMITE E IMPULSO PROCESAL DE LAS ACTUACIONES CONTRAVENCIONALES Y/O QUERELLAS QUE CURSEN EN LAS INSPECCIÓN DE POLICÍA DE LA LOCALIDAD DE LA CANDELARIA","Inversión","Bogotá Mejor para Todos",45,{"$f":"IF(ISERROR(VLOOKUP(K194,Eje_Pilar_Prop!$C$2:$E$104,2,FALSE)),\" \",VLOOKUP(K194,Eje_Pilar_Prop!$C$2:$E$104,2,FALSE))","v":"Gobernanza e influencia local, regional e internacional"},{"$f":"IF(ISERROR(VLOOKUP(K194,Eje_Pilar_Prop!$C$2:$E$104,3,FALSE)),\" \",VLOOKUP(K194,Eje_Pilar_Prop!$C$2:$E$104,3,FALSE))","v":"Eje Transversal 4 Gobierno Legitimo, Fortalecimiento Local y Eficiencia"},1395,1018443671,"JOSE RICARDO PULGARIN ALVAREZ",8184000,null,null,1,4092000,12276000,8643200,"2020-10-28","2020-10-28","2021-01-27",60,1,30,null,null,null,null,null,null,"X",null,0.70407298794395567,{"$f":"IF(SUMPRODUCT((A$14:A194=A194)*(B$14:B194=B194)*(D$14:D194=D194))>1,0,1)","v":1},"Contratos de prestación de servicios profesionales y de apoyo a la gestión","Contratación directa",{"$f":"IF(ISBLANK(G194),1,IFERROR(VLOOKUP(G194,Tipo!$C$12:$C$27,1,FALSE),\"NO\"))","v":"Prestación de servicios profesionales y de apoyo a la gestión, o para la ejecución de trabajos artísticos que sólo puedan encomendarse a determinadas personas naturales;"},"Inversión",{"$f":"IF(ISBLANK(K194),1,IFERROR(VLOOKUP(K194,Eje_Pilar_Prop!C170:C271,1,FALSE),\"NO\"))","v":"NO"},"SECOP II",1,"Bogotá Mejor para Todos"]
[187,2020,"SECOP II","FDLC-CPS-187-2020","Contratos de prestación de servicios profesionales y de apoyo a la gestión","Contratación directa","Prestación de servicios profesionales y de apoyo a la gestión, o para la ejecución de trabajos artísticos que sólo puedan encomendarse a determinadas personas naturales;","El contrato que se pretende celebrar, tendrá por objeto la “PRESTACIÓN DE SERVICIOS DE APOYO Y ASISTENCIA ADMINISTRATIVA A LA GESTION DE LA JUNTA ADMINISTRADORA LOCAL DE LA CANDELARIA”","Inversión","Bogotá Mejor para Todos",45,{"$f":"IF(ISERROR(VLOOKUP(K195,Eje_Pilar_Prop!$C$2:$E$104,2,FALSE)),\" \",VLOOKUP(K195,Eje_Pilar_Prop!$C$2:$E$104,2,FALSE))","v":"Gobernanza e influencia local, regional e internacional"},{"$f":"IF(ISERROR(VLOOKUP(K195,Eje_Pilar_Prop!$C$2:$E$104,3,FALSE)),\" \",VLOOKUP(K195,Eje_Pilar_Prop!$C$2:$E$104,3,FALSE))","v":"Eje Transversal 4 Gobierno Legitimo, Fortalecimiento Local y Eficiencia"},1395,51879946,"ISABEL CRISTINA BULLA RODRIGUEZ",4960000,null,null,1,2480000,7440000,5208000,"2020-10-28","2020-10-28","2021-01-26",60,1,30,null,null,null,null,null,null,"X",null,0.7,{"$f":"IF(SUMPRODUCT((A$14:A195=A195)*(B$14:B195=B195)*(D$14:D195=D195))>1,0,1)","v":1},"Contratos de prestación de servicios profesionales y de apoyo a la gestión","Contratación directa",{"$f":"IF(ISBLANK(G195),1,IFERROR(VLOOKUP(G195,Tipo!$C$12:$C$27,1,FALSE),\"NO\"))","v":"Prestación de servicios profesionales y de apoyo a la gestión, o para la ejecución de trabajos artísticos que sólo puedan encomendarse a determinadas personas naturales;"},"Inversión",{"$f":"IF(ISBLANK(K195),1,IFERROR(VLOOKUP(K195,Eje_Pilar_Prop!C171:C272,1,FALSE),\"NO\"))","v":"NO"},"SECOP II",1,"Bogotá Mejor para Todos"]
[188,2020,"SECOP II","FDLC-CPS-188-2020","Contratos de prestación de servicios profesionales y de apoyo a la gestión","Contratación directa","Prestación de servicios profesionales y de apoyo a la gestión, o para la ejecución de trabajos artísticos que sólo puedan encomendarse a determinadas personas naturales;","“PRESTACIÓN DE SERVICIOS PROFESIONALES AL ÁREA DE GESTIÓN DE DESARROLLO LOCAL DE LA ALCALDÍA LOCAL DE LA CANDELARIA PARA LA FORMULACIÓN Y APOYO TÉCNICO EN EL SEGUIMIENTO DE PLANES, POLÍTICAS, PROGRAMAS Y PROYECTOS EN EL MARCO DE LA DISCUSIÓN SOBRE DEL NUEVO PLAN DE DESARROLLO Y SU IMPLEMENTACIÓN","Inversión","Bogotá Mejor para Todos",45,{"$f":"IF(ISERROR(VLOOKUP(K196,Eje_Pilar_Prop!$C$2:$E$104,2,FALSE)),\" \",VLOOKUP(K196,Eje_Pilar_Prop!$C$2:$E$104,2,FALSE))","v":"Gobernanza e influencia local, regional e internacional"},{"$f":"IF(ISERROR(VLOOKUP(K196,Eje_Pilar_Prop!$C$2:$E$104,3,FALSE)),\" \",VLOOKUP(K196,Eje_Pilar_Prop!$C$2:$E$104,3,FALSE))","v":"Eje Transversal 4 Gobierno Legitimo, Fortalecimiento Local y Eficiencia"},1395,55242358,"DIGNA LIANETT ARIAS CALDERIN",10780000,null,null,0,null,10780000,10780000,"2020-10-28","2020-10-28","2020-12-27",60,null,null,null,null,null,null,null,null,null,"X",1,{"$f":"IF(SUMPRODUCT((A$14:A196=A196)*(B$14:B196=B196)*(D$14:D196=D196))>1,0,1)","v":1},"Contratos de prestación de servicios profesionales y de apoyo a la gestión","Contratación directa",{"$f":"IF(ISBLANK(G196),1,IFERROR(VLOOKUP(G196,Tipo!$C$12:$C$27,1,FALSE),\"NO\"))","v":"Prestación de servicios profesionales y de apoyo a la gestión, o para la ejecución de trabajos artísticos que sólo puedan encomendarse a determinadas personas naturales;"},"Inversión",{"$f":"IF(ISBLANK(K196),1,IFERROR(VLOOKUP(K196,Eje_Pilar_Prop!C172:C273,1,FALSE),\"NO\"))","v":"NO"},"SECOP II",1,"Bogotá Mejor para Todos"]
[189,2020,"SECOP II","FDLC-CPS-189-2020","Contratos de prestación de servicios profesionales y de apoyo a la gestión","Contratación directa","Prestación de servicios profesionales y de apoyo a la gestión, o para la ejecución de trabajos artísticos que sólo puedan encomendarse a determinadas personas naturales;","“PRESTACIÓN DE SERVICIOS PROFESIONALES AL ÁREA DE GESTIÓN DE DESARROLLO LOCAL DE LA ALCALDÍA LOCAL DE LA CANDELARIA PARA LA FORMULACIÓN Y APOYO TÉCNICO EN EL SEGUIMIENTO DE PLANES, POLÍTICAS, PROGRAMAS Y PROYECTOS EN EL MARCO DE LA DISCUSIÓN SOBRE DEL NUEVO PLAN DE DESARROLLO Y SU IMPLEMENTACIÓN","Inversión","Bogotá Mejor para Todos",45,{"$f":"IF(ISERROR(VLOOKUP(K197,Eje_Pilar_Prop!$C$2:$E$104,2,FALSE)),\" \",VLOOKUP(K197,Eje_Pilar_Prop!$C$2:$E$104,2,FALSE))","v":"Gobernanza e influencia local, regional e internacional"},{"$f":"IF(ISERROR(VLOOKUP(K197,Eje_Pilar_Prop!$C$2:$E$104,3,FALSE)),\" \",VLOOKUP(K197,Eje_Pilar_Prop!$C$2:$E$104,3,FALSE))","v":"Eje Transversal 4 Gobierno Legitimo, Fortalecimiento Local y Eficiencia"},1395,79712875,"NELSON JAVIER GARAVITO CASTILLO",10780000,null,null,1,5390000,16170000,5929000,"2020-10-28","2020-10-28","2021-01-26",60,null,30,null,null,null,null,null,null,"X",null,0.36666666666666664,{"$f":"IF(SUMPRODUCT((A$14:A197=A197)*(B$14:B197=B197)*(D$14:D197=D197))>1,0,1)","v":1},"Contratos de prestación de servicios profesionales y de apoyo a la gestión","Contratación directa",{"$f":"IF(ISBLANK(G197),1,IFERROR(VLOOKUP(G197,Tipo!$C$12:$C$27,1,FALSE),\"NO\"))","v":"Prestación de servicios profesionales y de apoyo a la gestión, o para la ejecución de trabajos artísticos que sólo puedan encomendarse a determinadas personas naturales;"},"Inversión",{"$f":"IF(ISBLANK(K197),1,IFERROR(VLOOKUP(K197,Eje_Pilar_Prop!C173:C274,1,FALSE),\"NO\"))","v":"NO"},"SECOP II",1,"Bogotá Mejor para Todos"]
[190,2020,"SECOP II","FDLC-CPS-190-2020","Contratos de prestación de servicios profesionales y de apoyo a la gestión","Contratación directa","Prestación de servicios profesionales y de apoyo a la gestión, o para la ejecución de trabajos artísticos que sólo puedan encomendarse a determinadas personas naturales;","PRESTAR SERVICIOS PROFESIONALES AL ÁREA DE GESTION POLICIVA DEL FONDO DE DESARROLLO LOCAL LA CANDELARIA, PARA FORTALECER Y PROMOVER ESTRATEGIAS DE IMPLEMENTACION, APLICACION Y CAPACITACION A LA COMUNIDAD Y DIFERENTES SECTORES, EN MATERIA DE NORMATIVIDAD REFERENTE AL CODIGO DE POLICIA Y FRENTES LOCALES DE SEGURIDAD","Inversión","Bogotá Mejor para Todos",45,{"$f":"IF(ISERROR(VLOOKUP(K198,Eje_Pilar_Prop!$C$2:$E$104,2,FALSE)),\" \",VLOOKUP(K198,Eje_Pilar_Prop!$C$2:$E$104,2,FALSE))","v":"Gobernanza e influencia local, regional e internacional"},{"$f":"IF(ISERROR(VLOOKUP(K198,Eje_Pilar_Prop!$C$2:$E$104,3,FALSE)),\" \",VLOOKUP(K198,Eje_Pilar_Prop!$C$2:$E$104,3,FALSE))","v":"Eje Transversal 4 Gobierno Legitimo, Fortalecimiento Local y Eficiencia"},1395,1077967370,"EMERSON LINARES GORDILLO",7960000,null,null,0,null,7960000,4112666,"2020-10-30","2020-10-30","2020-12-29",60,null,null,null,null,null,null,null,null,"X",null,0.5166665829145729,{"$f":"IF(SUMPRODUCT((A$14:A198=A198)*(B$14:B198=B198)*(D$14:D198=D198))>1,0,1)","v":1},"Contratos de prestación de servicios profesionales y de apoyo a la gestión","Contratación directa",{"$f":"IF(ISBLANK(G198),1,IFERROR(VLOOKUP(G198,Tipo!$C$12:$C$27,1,FALSE),\"NO\"))","v":"Prestación de servicios profesionales y de apoyo a la gestión, o para la ejecución de trabajos artísticos que sólo puedan encomendarse a determinadas personas naturales;"},"Inversión",{"$f":"IF(ISBLANK(K198),1,IFERROR(VLOOKUP(K198,Eje_Pilar_Prop!C174:C275,1,FALSE),\"NO\"))","v":"NO"},"SECOP II",1,"Bogotá Mejor para Todos"]
[191,2020,"SECOP II","FDLC-CPS-191-2020","Contratos de prestación de servicios profesionales y de apoyo a la gestión","Contratación directa","Prestación de servicios profesionales y de apoyo a la gestión, o para la ejecución de trabajos artísticos que sólo puedan encomendarse a determinadas personas naturales;","APOYAR JURÍDICAMENTE LA EJECUCIÓN DE LAS ACCIONES REQUERIDAS PARA LA DEPURACIÓN DE LAS ACTUACIONES ADMINISTRATIVAS QUE CURSAN EN LA ALCALDÍA LOCAL","Inversión","Bogotá Mejor para Todos",45,{"$f":"IF(ISERROR(VLOOKUP(K199,Eje_Pilar_Prop!$C$2:$E$104,2,FALSE)),\" \",VLOOKUP(K199,Eje_Pilar_Prop!$C$2:$E$104,2,FALSE))","v":"Gobernanza e influencia local, regional e internacional"},{"$f":"IF(ISERROR(VLOOKUP(K199,Eje_Pilar_Prop!$C$2:$E$104,3,FALSE)),\" \",VLOOKUP(K199,Eje_Pilar_Prop!$C$2:$E$104,3,FALSE))","v":"Eje Transversal 4 Gobierno Legitimo, Fortalecimiento Local y Eficiencia"},1395,1022973767,"CAROLINA ROJAS CARVAJAL",8954000,null,null,1,4477000,13431000,9103233,"2020-10-30","2020-10-30","2021-01-29",60,null,30,null,null,null,null,null,null,"X",null,0.6777777529595711,{"$f":"IF(SUMPRODUCT((A$14:A199=A199)*(B$14:B199=B199)*(D$14:D199=D199))>1,0,1)","v":1},"Contratos de prestación de servicios profesionales y de apoyo a la gestión","Contratación directa",{"$f":"IF(ISBLANK(G199),1,IFERROR(VLOOKUP(G199,Tipo!$C$12:$C$27,1,FALSE),\"NO\"))","v":"Prestación de servicios profesionales y de apoyo a la gestión, o para la ejecución de trabajos artísticos que sólo puedan encomendarse a determinadas personas naturales;"},"Inversión",{"$f":"IF(ISBLANK(K199),1,IFERROR(VLOOKUP(K199,Eje_Pilar_Prop!C175:C276,1,FALSE),\"NO\"))","v":"NO"},"SECOP II",1,"Bogotá Mejor para Todos"]
[192,2020,"SECOP II","FDLC-CPS-192-2020","Contratos de prestación de servicios profesionales y de apoyo a la gestión","Contratación directa","Prestación de servicios profesionales y de apoyo a la gestión, o para la ejecución de trabajos artísticos que sólo puedan encomendarse a determinadas personas naturales;","PRESTACIÓN DE SERVICIOS TECNICOS DE APOYO A LA OFICINA DEL ALMACEN DEL FONDO DE DESARROLLO LOCAL LA CANDELARIA.","Inversión","Bogotá Mejor para Todos",45,{"$f":"IF(ISERROR(VLOOKUP(K200,Eje_Pilar_Prop!$C$2:$E$104,2,FALSE)),\" \",VLOOKUP(K200,Eje_Pilar_Prop!$C$2:$E$104,2,FALSE))","v":"Gobernanza e influencia local, regional e internacional"},{"$f":"IF(ISERROR(VLOOKUP(K200,Eje_Pilar_Prop!$C$2:$E$104,3,FALSE)),\" \",VLOOKUP(K200,Eje_Pilar_Prop!$C$2:$E$104,3,FALSE))","v":"Eje Transversal 4 Gobierno Legitimo, Fortalecimiento Local y Eficiencia"},1395,12139994,"JUAN CARLOS PUENTES NARVAEZ",6496000,null,null,1,3248000,9744000,6604257,"2020-10-30","2020-10-30","2021-01-29",60,null,30,null,null,null,null,null,null,"X",null,0.67777678571428568,{"$f":"IF(SUMPRODUCT((A$14:A200=A200)*(B$14:B200=B200)*(D$14:D200=D200))>1,0,1)","v":1},"Contratos de prestación de servicios profesionales y de apoyo a la gestión","Contratación directa",{"$f":"IF(ISBLANK(G200),1,IFERROR(VLOOKUP(G200,Tipo!$C$12:$C$27,1,FALSE),\"NO\"))","v":"Prestación de servicios profesionales y de apoyo a la gestión, o para la ejecución de trabajos artísticos que sólo puedan encomendarse a determinadas personas naturales;"},"Inversión",{"$f":"IF(ISBLANK(K200),1,IFERROR(VLOOKUP(K200,Eje_Pilar_Prop!C176:C277,1,FALSE),\"NO\"))","v":"NO"},"SECOP II",1,"Bogotá Mejor para Todos"]
[193,2020,"SECOP II","FDLC-CPS-193-2020","Contratos de prestación de servicios profesionales y de apoyo a la gestión","Contratación directa","Prestación de servicios profesionales y de apoyo a la gestión, o para la ejecución de trabajos artísticos que sólo puedan encomendarse a determinadas personas naturales;","COORDINAR LA ARTICULACIÓN, ASISTENCIA Y ACOMPAÑAMIENTO DE LOS PROCESOS DE PLANEACIÓN LOCAL, PARA LA PROMOCIÓN DE LA PARTICIPACIÓN DE LAS MUJERES Y DE LA EQUIDAD DE GÉNERO, PARA MATERIALIZAR EN LA LOCALIDAD LAS ESTRATEGIAS DE TERRITORIALIZACIÓN Y TRANSVERSALIZACIÓN DE LA POLÍTICA PUBLICA DE MUJERES Y EQUIDAD DE GÉNERO, PPMYEG","Inversión","Bogotá Mejor para Todos",45,{"$f":"IF(ISERROR(VLOOKUP(K201,Eje_Pilar_Prop!$C$2:$E$104,2,FALSE)),\" \",VLOOKUP(K201,Eje_Pilar_Prop!$C$2:$E$104,2,FALSE))","v":"Gobernanza e influencia local, regional e internacional"},{"$f":"IF(ISERROR(VLOOKUP(K201,Eje_Pilar_Prop!$C$2:$E$104,3,FALSE)),\" \",VLOOKUP(K201,Eje_Pilar_Prop!$C$2:$E$104,3,FALSE))","v":"Eje Transversal 4 Gobierno Legitimo, Fortalecimiento Local y Eficiencia"},1395,1106786140,"MONICA ANDREA LEAL DIAZ",8400000,null,null,1,4200000,12600000,4340000,"2020-10-30","2020-10-30","2021-01-28",60,null,30,null,null,null,null,null,null,"X",null,0.34444444444444444,{"$f":"IF(SUMPRODUCT((A$14:A201=A201)*(B$14:B201=B201)*(D$14:D201=D201))>1,0,1)","v":1},"Contratos de prestación de servicios profesionales y de apoyo a la gestión","Contratación directa",{"$f":"IF(ISBLANK(G201),1,IFERROR(VLOOKUP(G201,Tipo!$C$12:$C$27,1,FALSE),\"NO\"))","v":"Prestación de servicios profesionales y de apoyo a la gestión, o para la ejecución de trabajos artísticos que sólo puedan encomendarse a determinadas personas naturales;"},"Inversión",{"$f":"IF(ISBLANK(K201),1,IFERROR(VLOOKUP(K201,Eje_Pilar_Prop!C177:C278,1,FALSE),\"NO\"))","v":"NO"},"SECOP II",1,"Bogotá Mejor para Todos"]
[194,2020,"SECOP II","FDLC-CPS-194-2020","Contratos de prestación de servicios profesionales y de apoyo a la gestión","Contratación directa","Prestación de servicios profesionales y de apoyo a la gestión, o para la ejecución de trabajos artísticos que sólo puedan encomendarse a determinadas personas naturales;","“PRESTACION DE SERVICIOS PROFESIONALES AL ÁREA DE GESTIÓN DE DESARROLLO LOCAL DE LA ALCALDÍA LOCAL DE LA CANDELARIA PARA EL SEGUIMIENTO JURIDICO DE LOS PROYECTOS DE INFRAESTRUCTURA, ASÍ COMO LOS DEMÁS ASUNTOS CONTRACTUALES QUE SE REQUIERAN”","Inversión","Bogotá Mejor para Todos",18,{"$f":"IF(ISERROR(VLOOKUP(K202,Eje_Pilar_Prop!$C$2:$E$104,2,FALSE)),\" \",VLOOKUP(K202,Eje_Pilar_Prop!$C$2:$E$104,2,FALSE))","v":"Mejor movilidad para todos"},{"$f":"IF(ISERROR(VLOOKUP(K202,Eje_Pilar_Prop!$C$2:$E$104,3,FALSE)),\" \",VLOOKUP(K202,Eje_Pilar_Prop!$C$2:$E$104,3,FALSE))","v":"Pilar 2 Democracía Urbana"},1391,1016016829,"JUAN DAVID CARDENAS CABEZA",10780000,null,null,0,null,10780000,10780000,"2020-10-30","2020-10-30","2020-12-29",60,null,null,null,null,null,null,null,null,null,"X",1,{"$f":"IF(SUMPRODUCT((A$14:A202=A202)*(B$14:B202=B202)*(D$14:D202=D202))>1,0,1)","v":1},"Contratos de prestación de servicios profesionales y de apoyo a la gestión","Contratación directa",{"$f":"IF(ISBLANK(G202),1,IFERROR(VLOOKUP(G202,Tipo!$C$12:$C$27,1,FALSE),\"NO\"))","v":"Prestación de servicios profesionales y de apoyo a la gestión, o para la ejecución de trabajos artísticos que sólo puedan encomendarse a determinadas personas naturales;"},"Inversión",{"$f":"IF(ISBLANK(K202),1,IFERROR(VLOOKUP(K202,Eje_Pilar_Prop!C178:C279,1,FALSE),\"NO\"))","v":"NO"},"SECOP II",1,"Bogotá Mejor para Todos"]
[195,2020,"SECOP II","FDLC-CPS-195-2020","Contratos de prestación de servicios profesionales y de apoyo a la gestión","Contratación directa","Prestación de servicios profesionales y de apoyo a la gestión, o para la ejecución de trabajos artísticos que sólo puedan encomendarse a determinadas personas naturales;","PRESTACIÓN DE SERVICIOS PROFESIONALES AL AREA DE GESTION DE DESARROLLO LOCAL EN LA FORMULACIÓN, PRESENTACIÓN, EVALUACIÓN, SEGUIMIENTO Y APOYO EN LOS REQUERIMIENTOS DE LOS PROYECTOS DE INFRAESTRUCTURA Y OBRAS CIVILES QUE DESARROLLE LA ALCALDÍA LOCAL DE LA CANDELARIA A TRAVES DEL AREA DE PLANEACIÓN","Inversión","Bogotá Mejor para Todos",18,{"$f":"IF(ISERROR(VLOOKUP(K203,Eje_Pilar_Prop!$C$2:$E$104,2,FALSE)),\" \",VLOOKUP(K203,Eje_Pilar_Prop!$C$2:$E$104,2,FALSE))","v":"Mejor movilidad para todos"},{"$f":"IF(ISERROR(VLOOKUP(K203,Eje_Pilar_Prop!$C$2:$E$104,3,FALSE)),\" \",VLOOKUP(K203,Eje_Pilar_Prop!$C$2:$E$104,3,FALSE))","v":"Pilar 2 Democracía Urbana"},1391,67016544,"PAOLA ANDREA MAHECHA QUINTERO",8182000,null,null,0,null,8182000,8182000,"2020-10-30","2020-10-30","2020-12-29",60,null,null,null,null,null,null,null,null,null,"X",1,{"$f":"IF(SUMPRODUCT((A$14:A203=A203)*(B$14:B203=B203)*(D$14:D203=D203))>1,0,1)","v":1},"Contratos de prestación de servicios profesionales y de apoyo a la gestión","Contratación directa",{"$f":"IF(ISBLANK(G203),1,IFERROR(VLOOKUP(G203,Tipo!$C$12:$C$27,1,FALSE),\"NO\"))","v":"Prestación de servicios profesionales y de apoyo a la gestión, o para la ejecución de trabajos artísticos que sólo puedan encomendarse a determinadas personas naturales;"},"Inversión",{"$f":"IF(ISBLANK(K203),1,IFERROR(VLOOKUP(K203,Eje_Pilar_Prop!C179:C280,1,FALSE),\"NO\"))","v":"NO"},"SECOP II",1,"Bogotá Mejor para Todos"]
[196,2020,"SECOP II","FDLC-CPS-196-2020","Contratos de prestación de servicios profesionales y de apoyo a la gestión","Contratación directa","Prestación de servicios profesionales y de apoyo a la gestión, o para la ejecución de trabajos artísticos que sólo puedan encomendarse a determinadas personas naturales;","PRESTACIÓN DE SERVICIOS PROFESIONALES AL ÁREA DE GESTIÓN DE DESARROLLO LOCAL DE LA ALCALDÍA LOCAL DE LA CANDELARIA EN TEMAS RELACIONADOS CON LAS DISTINTAS ACTUACIONES QUE ADELANTEN LOS ÓRGANOS DE CONTROL Y VIGILANCIA EN EL MARCO DE LAS AUDITORÍAS, ACTUACIONES ESPECIALES DE FISCALIZACIÓN Y DEMÁS ACTIVIDADES EN LAS QUE SE EVALÚE Y VIGILE LA GESTIÓN DE LA ENTIDAD","Inversión","Bogotá Mejor para Todos",45,{"$f":"IF(ISERROR(VLOOKUP(K204,Eje_Pilar_Prop!$C$2:$E$104,2,FALSE)),\" \",VLOOKUP(K204,Eje_Pilar_Prop!$C$2:$E$104,2,FALSE))","v":"Gobernanza e influencia local, regional e internacional"},{"$f":"IF(ISERROR(VLOOKUP(K204,Eje_Pilar_Prop!$C$2:$E$104,3,FALSE)),\" \",VLOOKUP(K204,Eje_Pilar_Prop!$C$2:$E$104,3,FALSE))","v":"Eje Transversal 4 Gobierno Legitimo, Fortalecimiento Local y Eficiencia"},1395,1049613872,"AMELIA PAOLA TONCON ESPINDOLA",9656420,null,null,1,4828210,14484630,9489930,"2020-11-04","2020-11-04","2021-01-29",58,null,29,null,null,null,null,null,null,"X",null,0.65517241379310343,{"$f":"IF(SUMPRODUCT((A$14:A204=A204)*(B$14:B204=B204)*(D$14:D204=D204))>1,0,1)","v":1},"Contratos de prestación de servicios profesionales y de apoyo a la gestión","Contratación directa",{"$f":"IF(ISBLANK(G204),1,IFERROR(VLOOKUP(G204,Tipo!$C$12:$C$27,1,FALSE),\"NO\"))","v":"Prestación de servicios profesionales y de apoyo a la gestión, o para la ejecución de trabajos artísticos que sólo puedan encomendarse a determinadas personas naturales;"},"Inversión",{"$f":"IF(ISBLANK(K204),1,IFERROR(VLOOKUP(K204,Eje_Pilar_Prop!C180:C281,1,FALSE),\"NO\"))","v":"NO"},"SECOP II",1,"Bogotá Mejor para Todos"]
[197,2020,"SECOP II","FDLC-CPS-197-2020","Contratos de prestación de servicios profesionales y de apoyo a la gestión","Contratación directa","Prestación de servicios profesionales y de apoyo a la gestión, o para la ejecución de trabajos artísticos que sólo puedan encomendarse a determinadas personas naturales;","“PRESTAR SERVICIOS DE APOYO TECNICO EN LA EMISORA A CARGO DEL FONDO DE DESARROLLO LOCAL LA CANDELARIA","Inversión","Bogotá Mejor para Todos",45,{"$f":"IF(ISERROR(VLOOKUP(K205,Eje_Pilar_Prop!$C$2:$E$104,2,FALSE)),\" \",VLOOKUP(K205,Eje_Pilar_Prop!$C$2:$E$104,2,FALSE))","v":"Gobernanza e influencia local, regional e internacional"},{"$f":"IF(ISERROR(VLOOKUP(K205,Eje_Pilar_Prop!$C$2:$E$104,3,FALSE)),\" \",VLOOKUP(K205,Eje_Pilar_Prop!$C$2:$E$104,3,FALSE))","v":"Eje Transversal 4 Gobierno Legitimo, Fortalecimiento Local y Eficiencia"},1395,52516241,"ZULAY ANDREA SALINAS TRONCOSO",5216133,null,null,0,null,5216133,2338266,"2020-11-05","2020-11-05","2020-12-31",57,null,null,null,null,null,null,null,null,"X",null,0.44827576290711912,{"$f":"IF(SUMPRODUCT((A$14:A205=A205)*(B$14:B205=B205)*(D$14:D205=D205))>1,0,1)","v":1},"Contratos de prestación de servicios profesionales y de apoyo a la gestión","Contratación directa",{"$f":"IF(ISBLANK(G205),1,IFERROR(VLOOKUP(G205,Tipo!$C$12:$C$27,1,FALSE),\"NO\"))","v":"Prestación de servicios profesionales y de apoyo a la gestión, o para la ejecución de trabajos artísticos que sólo puedan encomendarse a determinadas personas naturales;"},"Inversión",{"$f":"IF(ISBLANK(K205),1,IFERROR(VLOOKUP(K205,Eje_Pilar_Prop!C181:C282,1,FALSE),\"NO\"))","v":"NO"},"SECOP II",1,"Bogotá Mejor para Todos"]
[198,2020,"SECOP II","FDLC-CPS-198-2020","Contratos de prestación de servicios profesionales y de apoyo a la gestión","Contratación directa","Prestación de servicios profesionales y de apoyo a la gestión, o para la ejecución de trabajos artísticos que sólo puedan encomendarse a determinadas personas naturales;","“PRESTACIÓN DE SERVICIOS PROFESIONALES ESPECIALIZADOS AL ÁREA DE GESTIÓN DE DESARROLLO LOCAL DE LA ALCALDÍA LOCAL DE LA CANDELARIA PARA APOYAR EL SEGUMIENTO Y EJECUCIÓN DE LOS CONTRATOS Y/O CONVENIOS CELEBRADOS EN EL MARCO DE LA REACTIVACION ECONOMICA”","Inversión","Bogotá Mejor para Todos",45,{"$f":"IF(ISERROR(VLOOKUP(K206,Eje_Pilar_Prop!$C$2:$E$104,2,FALSE)),\" \",VLOOKUP(K206,Eje_Pilar_Prop!$C$2:$E$104,2,FALSE))","v":"Gobernanza e influencia local, regional e internacional"},{"$f":"IF(ISERROR(VLOOKUP(K206,Eje_Pilar_Prop!$C$2:$E$104,3,FALSE)),\" \",VLOOKUP(K206,Eje_Pilar_Prop!$C$2:$E$104,3,FALSE))","v":"Eje Transversal 4 Gobierno Legitimo, Fortalecimiento Local y Eficiencia"},1395,1118545389,"DIEGO FERNANDO ARDILA PLAZAS",11183753,null,null,1,5591877,16775630,5206230,"2020-11-04","2020-11-04","2021-01-29",58,null,29,null,null,null,null,null,null,"X",null,0.31034482758620691,{"$f":"IF(SUMPRODUCT((A$14:A206=A206)*(B$14:B206=B206)*(D$14:D206=D206))>1,0,1)","v":1},"Contratos de prestación de servicios profesionales y de apoyo a la gestión","Contratación directa",{"$f":"IF(ISBLANK(G206),1,IFERROR(VLOOKUP(G206,Tipo!$C$12:$C$27,1,FALSE),\"NO\"))","v":"Prestación de servicios profesionales y de apoyo a la gestión, o para la ejecución de trabajos artísticos que sólo puedan encomendarse a determinadas personas naturales;"},"Inversión",{"$f":"IF(ISBLANK(K206),1,IFERROR(VLOOKUP(K206,Eje_Pilar_Prop!C182:C283,1,FALSE),\"NO\"))","v":"NO"},"SECOP II",1,"Bogotá Mejor para Todos"]
[199,2020,"SECOP II","FDLC-CPS-199-2020","Contratos de prestación de servicios profesionales y de apoyo a la gestión","Contratación directa","Prestación de servicios profesionales y de apoyo a la gestión, o para la ejecución de trabajos artísticos que sólo puedan encomendarse a determinadas personas naturales;","El contrato que se pretende celebrar tendrá por objeto: PRESTACIÓN DE SERVICIOS PROFESIONALES PARA APOYAR Y FORTALECER LA OFICINA DE PRESUPUESTO DEL FONDO DE DESARROLLO LOCAL EN LAS GESTIONES ADMINISTRATIVAS Y\nFINANCIERAS DE LA ENTIDAD","Inversión","Bogotá Mejor para Todos",45,{"$f":"IF(ISERROR(VLOOKUP(K207,Eje_Pilar_Prop!$C$2:$E$104,2,FALSE)),\" \",VLOOKUP(K207,Eje_Pilar_Prop!$C$2:$E$104,2,FALSE))","v":"Gobernanza e influencia local, regional e internacional"},{"$f":"IF(ISERROR(VLOOKUP(K207,Eje_Pilar_Prop!$C$2:$E$104,3,FALSE)),\" \",VLOOKUP(K207,Eje_Pilar_Prop!$C$2:$E$104,3,FALSE))","v":"Eje Transversal 4 Gobierno Legitimo, Fortalecimiento Local y Eficiencia"},1395,41648295,"ISABEL SANCHEZ RODRIGUEZ",7949333,null,null,0,null,7949333,7949333,"2020-11-06","2020-11-06","2020-12-31",55,null,null,null,null,null,null,null,null,null,"X",1,{"$f":"IF(SUMPRODUCT((A$14:A207=A207)*(B$14:B207=B207)*(D$14:D207=D207))>1,0,1)","v":1},"Contratos de prestación de servicios profesionales y de apoyo a la gestión","Contratación directa",{"$f":"IF(ISBLANK(G207),1,IFERROR(VLOOKUP(G207,Tipo!$C$12:$C$27,1,FALSE),\"NO\"))","v":"Prestación de servicios profesionales y de apoyo a la gestión, o para la ejecución de trabajos artísticos que sólo puedan encomendarse a determinadas personas naturales;"},"Inversión",{"$f":"IF(ISBLANK(K207),1,IFERROR(VLOOKUP(K207,Eje_Pilar_Prop!C183:C284,1,FALSE),\"NO\"))","v":"NO"},"SECOP II",1,"Bogotá Mejor para Todos"]
[200,2020,"SECOP II","FDLC-CPS-200-2020","Contratos de prestación de servicios profesionales y de apoyo a la gestión","Contratación directa","Prestación de servicios profesionales y de apoyo a la gestión, o para la ejecución de trabajos artísticos que sólo puedan encomendarse a determinadas personas naturales;","“PRESTAR SERVICIOS DE APOYO COMO CONDUCTOR DE LOS VEHICULOS QUE SE ENCUENTRAN A CARGO DEL FONDO DE DESARROLLO LOCAL LA CANDELARIA","Inversión","Bogotá Mejor para Todos",45,{"$f":"IF(ISERROR(VLOOKUP(K208,Eje_Pilar_Prop!$C$2:$E$104,2,FALSE)),\" \",VLOOKUP(K208,Eje_Pilar_Prop!$C$2:$E$104,2,FALSE))","v":"Gobernanza e influencia local, regional e internacional"},{"$f":"IF(ISERROR(VLOOKUP(K208,Eje_Pilar_Prop!$C$2:$E$104,3,FALSE)),\" \",VLOOKUP(K208,Eje_Pilar_Prop!$C$2:$E$104,3,FALSE))","v":"Eje Transversal 4 Gobierno Legitimo, Fortalecimiento Local y Eficiencia"},1395,1010187694,"CHRISTIAM CAMILO ROMERO WALTEROS",4546666,null,null,0,null,4546666,4546666,"2020-11-06","2020-11-06","2020-12-31",55,null,null,null,null,null,null,null,null,null,"X",1,{"$f":"IF(SUMPRODUCT((A$14:A208=A208)*(B$14:B208=B208)*(D$14:D208=D208))>1,0,1)","v":1},"Contratos de prestación de servicios profesionales y de apoyo a la gestión","Contratación directa",{"$f":"IF(ISBLANK(G208),1,IFERROR(VLOOKUP(G208,Tipo!$C$12:$C$27,1,FALSE),\"NO\"))","v":"Prestación de servicios profesionales y de apoyo a la gestión, o para la ejecución de trabajos artísticos que sólo puedan encomendarse a determinadas personas naturales;"},"Inversión",{"$f":"IF(ISBLANK(K208),1,IFERROR(VLOOKUP(K208,Eje_Pilar_Prop!C184:C285,1,FALSE),\"NO\"))","v":"NO"},"SECOP II",1,"Bogotá Mejor para Todos"]
[201,2020,"SECOP II","FDLC-CPS-201-2020","Contratos de prestación de servicios profesionales y de apoyo a la gestión","Contratación directa","Prestación de servicios profesionales y de apoyo a la gestión, o para la ejecución de trabajos artísticos que sólo puedan encomendarse a determinadas personas naturales;","“PRESTAR SERVICIOS DE APOYO COMO CONDUCTOR DE LOS VEHICULOS QUE SE ENCUENTRAN A CARGO DEL FONDO DE DESARROLLO LOCAL LA CANDELARIA","Inversión","Bogotá Mejor para Todos",45,{"$f":"IF(ISERROR(VLOOKUP(K209,Eje_Pilar_Prop!$C$2:$E$104,2,FALSE)),\" \",VLOOKUP(K209,Eje_Pilar_Prop!$C$2:$E$104,2,FALSE))","v":"Gobernanza e influencia local, regional e internacional"},{"$f":"IF(ISERROR(VLOOKUP(K209,Eje_Pilar_Prop!$C$2:$E$104,3,FALSE)),\" \",VLOOKUP(K209,Eje_Pilar_Prop!$C$2:$E$104,3,FALSE))","v":"Eje Transversal 4 Gobierno Legitimo, Fortalecimiento Local y Eficiencia"},1395,79594412,"FABIO ALBERTO MOLINA GUTIERREZ",4546666,null,null,0,null,4546666,4546666,"2020-11-06","2020-11-06","2020-12-31",55,null,null,null,null,null,null,null,null,null,"X",1,{"$f":"IF(SUMPRODUCT((A$14:A209=A209)*(B$14:B209=B209)*(D$14:D209=D209))>1,0,1)","v":1},"Contratos de prestación de servicios profesionales y de apoyo a la gestión","Contratación directa",{"$f":"IF(ISBLANK(G209),1,IFERROR(VLOOKUP(G209,Tipo!$C$12:$C$27,1,FALSE),\"NO\"))","v":"Prestación de servicios profesionales y de apoyo a la gestión, o para la ejecución de trabajos artísticos que sólo puedan encomendarse a determinadas personas naturales;"},"Inversión",{"$f":"IF(ISBLANK(K209),1,IFERROR(VLOOKUP(K209,Eje_Pilar_Prop!C185:C286,1,FALSE),\"NO\"))","v":"NO"},"SECOP II",1,"Bogotá Mejor para Todos"]
[202,2020,"SECOP II","FDLC-CPS-202-2020","Contratos de prestación de servicios profesionales y de apoyo a la gestión","Contratación directa","Prestación de servicios profesionales y de apoyo a la gestión, o para la ejecución de trabajos artísticos que sólo puedan encomendarse a determinadas personas naturales;","APOYAR LA FORMULACIÓN, EJECUCIÓN, SEGUIMIENTO Y MEJORA CONTINUA DE LAS HERRAMIENTAS QUE CONFORMAN LA GESTIÓN AMBIENTAL INSTITUCIONAL DE LA ALCALDÍA LOCAL.”","Inversión","Bogotá Mejor para Todos",45,{"$f":"IF(ISERROR(VLOOKUP(K210,Eje_Pilar_Prop!$C$2:$E$104,2,FALSE)),\" \",VLOOKUP(K210,Eje_Pilar_Prop!$C$2:$E$104,2,FALSE))","v":"Gobernanza e influencia local, regional e internacional"},{"$f":"IF(ISERROR(VLOOKUP(K210,Eje_Pilar_Prop!$C$2:$E$104,3,FALSE)),\" \",VLOOKUP(K210,Eje_Pilar_Prop!$C$2:$E$104,3,FALSE))","v":"Eje Transversal 4 Gobierno Legitimo, Fortalecimiento Local y Eficiencia"},1395,1057573297,"JULIAN CAMILO BARRERA QUIJANO",6820000,null,null,0,null,6820000,3410000,"2020-11-06","2020-11-06","2020-12-26",50,null,null,null,null,null,null,null,null,"X",null,0.5,{"$f":"IF(SUMPRODUCT((A$14:A210=A210)*(B$14:B210=B210)*(D$14:D210=D210))>1,0,1)","v":1},"Contratos de prestación de servicios profesionales y de apoyo a la gestión","Contratación directa",{"$f":"IF(ISBLANK(G210),1,IFERROR(VLOOKUP(G210,Tipo!$C$12:$C$27,1,FALSE),\"NO\"))","v":"Prestación de servicios profesionales y de apoyo a la gestión, o para la ejecución de trabajos artísticos que sólo puedan encomendarse a determinadas personas naturales;"},"Inversión",{"$f":"IF(ISBLANK(K210),1,IFERROR(VLOOKUP(K210,Eje_Pilar_Prop!C186:C287,1,FALSE),\"NO\"))","v":"NO"},"SECOP II",1,"Bogotá Mejor para Todos"]
[203,2020,"SECOP II","FDLC-CMA-014-2020","Consultoría","Concurso de méritos","No aplica","“PRESTAR EL SERVICIO DE INTERMEDIACIÓN DE SEGUROS, ASESORÍA PARA EL MANEJO DEL PROGRAMA DE SEGUROS Y ADQUISICIÓN DE PÓLIZAS PARA LA COBERTURA DEL RIESGO DE LOS BIENES E INTERESES PATRIMONIALES DEL FONDO DE DESARROLLO LOCAL DE LA CANDELARIA, ASÍ COMO DE AQUELLOS POR LOS CUALES SEA O FUERE LEGALMENTE RESPONSABLE Y LA GESTION INTEGRAL DE ADMINISTRACION DE SINIESTROS Y RECLAMACIONES","Funcionamiento","Bogotá Mejor para Todos","No aplica","No Aplica","No Aplica","No Aplica","800.018.165-8","JARGU S.A. CORREDORES DE SEGUROS",0,null,null,0,null,0,0,"2020-11-11","2020-11-11","2021-11-10",365,null,null,null,null,null,null,null,null,"X",null,1,{"$f":"IF(SUMPRODUCT((A$14:A211=A211)*(B$14:B211=B211)*(D$14:D211=D211))>1,0,1)","v":1},"Consultoría","Concurso de méritos",{"$f":"IF(ISBLANK(G211),1,IFERROR(VLOOKUP(G211,Tipo!$C$12:$C$27,1,FALSE),\"NO\"))","v":"NO"},"Funcionamiento",{"$f":"IF(ISBLANK(K211),1,IFERROR(VLOOKUP(K211,Eje_Pilar_Prop!C187:C288,1,FALSE),\"NO\"))","v":"NO"},"SECOP II",1,"Bogotá Mejor para Todos"]
[204,2020,"SECOP II","FDLC-CPS-204-2020","Contratos de prestación de servicios profesionales y de apoyo a la gestión","Contratación directa","Prestación de servicios profesionales y de apoyo a la gestión, o para la ejecución de trabajos artísticos que sólo puedan encomendarse a determinadas personas naturales;","APOYAR LA GESTION DOCUMENTAL DE LA ALCALDIA LOCAL, ACOMPAÑANDO EL EQUIPO JURIDICO DE DEPURACIÓN EN LAS LABORES OPERATIVAS QUE GENERA EL PROCESO DE IMPULSO DE LAS ACTUACIONES ADMINISTRATIVAS EXISTENTES EN LA ALCALDIA LOCAL DE LA CANDELARIA","Inversión","Bogotá Mejor para Todos",45,{"$f":"IF(ISERROR(VLOOKUP(K212,Eje_Pilar_Prop!$C$2:$E$104,2,FALSE)),\" \",VLOOKUP(K212,Eje_Pilar_Prop!$C$2:$E$104,2,FALSE))","v":"Gobernanza e influencia local, regional e internacional"},{"$f":"IF(ISERROR(VLOOKUP(K212,Eje_Pilar_Prop!$C$2:$E$104,3,FALSE)),\" \",VLOOKUP(K212,Eje_Pilar_Prop!$C$2:$E$104,3,FALSE))","v":"Eje Transversal 4 Gobierno Legitimo, Fortalecimiento Local y Eficiencia"},1395,49729700,"NEREIDA HERNANDEZ FLOREZ",4096667,null,null,1,2048334,6145001,4096667,"2020-11-11","2020-11-11","2021-01-24",50,1,25,null,null,null,null,null,null,"X",null,0.66666661242203218,{"$f":"IF(SUMPRODUCT((A$14:A212=A212)*(B$14:B212=B212)*(D$14:D212=D212))>1,0,1)","v":1},"Contratos de prestación de servicios profesionales y de apoyo a la gestión","Contratación directa",{"$f":"IF(ISBLANK(G212),1,IFERROR(VLOOKUP(G212,Tipo!$C$12:$C$27,1,FALSE),\"NO\"))","v":"Prestación de servicios profesionales y de apoyo a la gestión, o para la ejecución de trabajos artísticos que sólo puedan encomendarse a determinadas personas naturales;"},"Inversión",{"$f":"IF(ISBLANK(K212),1,IFERROR(VLOOKUP(K212,Eje_Pilar_Prop!C188:C289,1,FALSE),\"NO\"))","v":"NO"},"SECOP II",1,{"$f":"IF(ISBLANK(J212),1,IFERROR(VLOOKUP(J212,pdd,1,FALSE),\"NO\"))","v":"Bogotá Mejor para Todos"}]
[205,2020,"SECOP II","FDLC-CPS-205-2020","Contratos de prestación de servicios profesionales y de apoyo a la gestión","Contratación directa","Prestación de servicios profesionales y de apoyo a la gestión, o para la ejecución de trabajos artísticos que sólo puedan encomendarse a determinadas personas naturales;","PRESTACIÓN DE SERVICIOS PROFESIONALES AL FONDO DE DESARROLLO LOCAL DE LA CANDELARIA, EN LOS TRÁMITES RELACIONADOS CON LOS PROCESOS PRECONTRACTUALES, CONTRACTUALES Y POS CONTRACTUALES QUE SE ADELANTEN A TRAVÉS DE SECOP I Y II, ASÍ COMO LA ADQUISICIÓN DE BIENES Y SERVICIOS A TRAVÉS DE LA TIENDA VIRTUAL DEL ESTADO COLOMBIANO","Inversión","Bogotá Mejor para Todos",45,{"$f":"IF(ISERROR(VLOOKUP(K213,Eje_Pilar_Prop!$C$2:$E$104,2,FALSE)),\" \",VLOOKUP(K213,Eje_Pilar_Prop!$C$2:$E$104,2,FALSE))","v":"Gobernanza e influencia local, regional e internacional"},{"$f":"IF(ISERROR(VLOOKUP(K213,Eje_Pilar_Prop!$C$2:$E$104,3,FALSE)),\" \",VLOOKUP(K213,Eje_Pilar_Prop!$C$2:$E$104,3,FALSE))","v":"Eje Transversal 4 Gobierno Legitimo, Fortalecimiento Local y Eficiencia"},1395,52501495,"LILIANA CECILIA ROJAS LEON",6300000,null,null,1,5880000,12180000,6580000,"2020-11-11","2020-11-11","2021-01-15",45,1,21,null,null,null,null,null,null,"X",null,0.54022988505747127,{"$f":"IF(SUMPRODUCT((A$14:A213=A213)*(B$14:B213=B213)*(D$14:D213=D213))>1,0,1)","v":1},"Contratos de prestación de servicios profesionales y de apoyo a la gestión","Contratación directa",{"$f":"IF(ISBLANK(G213),1,IFERROR(VLOOKUP(G213,Tipo!$C$12:$C$27,1,FALSE),\"NO\"))","v":"Prestación de servicios profesionales y de apoyo a la gestión, o para la ejecución de trabajos artísticos que sólo puedan encomendarse a determinadas personas naturales;"},"Inversión",{"$f":"IF(ISBLANK(K213),1,IFERROR(VLOOKUP(K213,Eje_Pilar_Prop!C189:C290,1,FALSE),\"NO\"))","v":"NO"},"SECOP II",1,"Bogotá Mejor para Todos"]
[206,2020,"SECOP II","FDLC-CPS-206-2020","Contratos de prestación de servicios profesionales y de apoyo a la gestión","Contratación directa","Prestación de servicios profesionales y de apoyo a la gestión, o para la ejecución de trabajos artísticos que sólo puedan encomendarse a determinadas personas naturales;","APOYO A LA ALCALDÍA LOCAL DE LA CANDELARIA EN EL MANEJO Y ACTUALIZACION DE LA INFORMACION EN LA PLATAFORMA SECOP I Y SECOP II","Inversión","Bogotá Mejor para Todos",45,{"$f":"IF(ISERROR(VLOOKUP(K214,Eje_Pilar_Prop!$C$2:$E$104,2,FALSE)),\" \",VLOOKUP(K214,Eje_Pilar_Prop!$C$2:$E$104,2,FALSE))","v":"Gobernanza e influencia local, regional e internacional"},{"$f":"IF(ISERROR(VLOOKUP(K214,Eje_Pilar_Prop!$C$2:$E$104,3,FALSE)),\" \",VLOOKUP(K214,Eje_Pilar_Prop!$C$2:$E$104,3,FALSE))","v":"Eje Transversal 4 Gobierno Legitimo, Fortalecimiento Local y Eficiencia"},1395,79891521,"WILSON ARTURO BORDA MORA",3750000,null,null,0,null,3750000,1666666,"2020-11-11","2020-11-11","2020-12-25",45,null,null,null,null,null,null,null,null,"X",null,0.44444426666666664,{"$f":"IF(SUMPRODUCT((A$14:A214=A214)*(B$14:B214=B214)*(D$14:D214=D214))>1,0,1)","v":1},"Contratos de prestación de servicios profesionales y de apoyo a la gestión","Contratación directa",{"$f":"IF(ISBLANK(G214),1,IFERROR(VLOOKUP(G214,Tipo!$C$12:$C$27,1,FALSE),\"NO\"))","v":"Prestación de servicios profesionales y de apoyo a la gestión, o para la ejecución de trabajos artísticos que sólo puedan encomendarse a determinadas personas naturales;"},"Inversión",{"$f":"IF(ISBLANK(K214),1,IFERROR(VLOOKUP(K214,Eje_Pilar_Prop!C190:C291,1,FALSE),\"NO\"))","v":"NO"},"SECOP II",1,"Bogotá Mejor para Todos"]
[207,2020,"SECOP II","FDLC-CPS-207-2020","Contratos de prestación de servicios profesionales y de apoyo a la gestión","Contratación directa","Prestación de servicios profesionales y de apoyo a la gestión, o para la ejecución de trabajos artísticos que sólo puedan encomendarse a determinadas personas naturales;","PRESTAR SERVICIOS PROFESIONALES PARA APOYAR LA EJECUCIÓN, SEGUIMIENTO Y EVALUACIÓN DEL CONJUNTO DE ACTIVIDADES PARA EL DESARROLLO DE LOS EJERCICIOS DE PARTICIPACIÓN CIUDADANA ASÍ COMO EL APOYO EN EL DESARROLLO DE LOS PRESUPUESTOS PARTICIPATIVOS DE LA LOCALIDAD DE LA CANDELARIA","Inversión","Bogotá Mejor para Todos",45,{"$f":"IF(ISERROR(VLOOKUP(K215,Eje_Pilar_Prop!$C$2:$E$104,2,FALSE)),\" \",VLOOKUP(K215,Eje_Pilar_Prop!$C$2:$E$104,2,FALSE))","v":"Gobernanza e influencia local, regional e internacional"},{"$f":"IF(ISERROR(VLOOKUP(K215,Eje_Pilar_Prop!$C$2:$E$104,3,FALSE)),\" \",VLOOKUP(K215,Eje_Pilar_Prop!$C$2:$E$104,3,FALSE))","v":"Eje Transversal 4 Gobierno Legitimo, Fortalecimiento Local y Eficiencia"},1395,". 52784300","LUZ VIVIANA ALFONSO GUTIERREZ",6300000,null,null,0,null,6300000,6300000,"2020-11-11","2020-11-11","2020-12-25",45,null,null,null,null,null,null,null,null,null,"X",1,{"$f":"IF(SUMPRODUCT((A$14:A215=A215)*(B$14:B215=B215)*(D$14:D215=D215))>1,0,1)","v":1},"Contratos de prestación de servicios profesionales y de apoyo a la gestión","Contratación directa",{"$f":"IF(ISBLANK(G215),1,IFERROR(VLOOKUP(G215,Tipo!$C$12:$C$27,1,FALSE),\"NO\"))","v":"Prestación de servicios profesionales y de apoyo a la gestión, o para la ejecución de trabajos artísticos que sólo puedan encomendarse a determinadas personas naturales;"},"Inversión",{"$f":"IF(ISBLANK(K215),1,IFERROR(VLOOKUP(K215,Eje_Pilar_Prop!C191:C292,1,FALSE),\"NO\"))","v":"NO"},"SECOP II",1,"Bogotá Mejor para Todos"]
[208,2020,"SECOP II","FDLC-CPS-208-2020","Contratos de prestación de servicios profesionales y de apoyo a la gestión","Contratación directa","Prestación de servicios profesionales y de apoyo a la gestión, o para la ejecución de trabajos artísticos que sólo puedan encomendarse a determinadas personas naturales;","PRESTACIÓN DE SERVICIOS PORFESIONALES AL FONDO DE DESARROLLO LOCAL DE LA CANDELARIA EN LA ATENCIÓN, SEGUIMIENTO Y CONTROL DE LAS RESPUESTAS A LAS PETICIONES, REQUERIMIENTOS Y SOLICITUDES DE INFORMACIÓN QUE SEAN COMPETENCIA DE LA ENTIDAD, Y DEMÁS TRÁMITES REQUERIDOS","Inversión","Bogotá Mejor para Todos",45,{"$f":"IF(ISERROR(VLOOKUP(K216,Eje_Pilar_Prop!$C$2:$E$104,2,FALSE)),\" \",VLOOKUP(K216,Eje_Pilar_Prop!$C$2:$E$104,2,FALSE))","v":"Gobernanza e influencia local, regional e internacional"},{"$f":"IF(ISERROR(VLOOKUP(K216,Eje_Pilar_Prop!$C$2:$E$104,3,FALSE)),\" \",VLOOKUP(K216,Eje_Pilar_Prop!$C$2:$E$104,3,FALSE))","v":"Eje Transversal 4 Gobierno Legitimo, Fortalecimiento Local y Eficiencia"},1395,28312684,"YELIXSA XIOMARA SANCHEZ DIAZ",9333333,null,null,0,null,9333333,5999999,"2020-11-11","2020-11-11","2020-12-25",45,null,null,null,null,null,null,null,null,null,"X",0.64285705867346643,{"$f":"IF(SUMPRODUCT((A$14:A216=A216)*(B$14:B216=B216)*(D$14:D216=D216))>1,0,1)","v":1},"Contratos de prestación de servicios profesionales y de apoyo a la gestión","Contratación directa",{"$f":"IF(ISBLANK(G216),1,IFERROR(VLOOKUP(G216,Tipo!$C$12:$C$27,1,FALSE),\"NO\"))","v":"Prestación de servicios profesionales y de apoyo a la gestión, o para la ejecución de trabajos artísticos que sólo puedan encomendarse a determinadas personas naturales;"},"Inversión",{"$f":"IF(ISBLANK(K216),1,IFERROR(VLOOKUP(K216,Eje_Pilar_Prop!C192:C293,1,FALSE),\"NO\"))","v":"NO"},"SECOP II",1,"Bogotá Mejor para Todos"]
[209,2020,"SECOP II","FDLC-CPS-209-2020","Contratos de prestación de servicios profesionales y de apoyo a la gestión","Contratación directa","Prestación de servicios profesionales y de apoyo a la gestión, o para la ejecución de trabajos artísticos que sólo puedan encomendarse a determinadas personas naturales;","PRESTACIÓN DE SERVICIOS ASISTENCIALES DE APOYO A LA GESTION DEL FONDO DE DESARROLLO LOCAL DE LA CANDELARIA - CDI PARA EL MANEJO Y DISTRIBUCION DE CORRESPONDENCIA EN GENERAL","Inversión","Bogotá Mejor para Todos",45,{"$f":"IF(ISERROR(VLOOKUP(K217,Eje_Pilar_Prop!$C$2:$E$104,2,FALSE)),\" \",VLOOKUP(K217,Eje_Pilar_Prop!$C$2:$E$104,2,FALSE))","v":"Gobernanza e influencia local, regional e internacional"},{"$f":"IF(ISERROR(VLOOKUP(K217,Eje_Pilar_Prop!$C$2:$E$104,3,FALSE)),\" \",VLOOKUP(K217,Eje_Pilar_Prop!$C$2:$E$104,3,FALSE))","v":"Eje Transversal 4 Gobierno Legitimo, Fortalecimiento Local y Eficiencia"},1395,1010227910,"CARLOS ARMANDO GONZÁLEZ RASGO",3687000,null,null,1,1802534,5489534,4178600,"2020-11-11","2020-11-11","2021-01-16",45,1,22,null,null,null,null,null,null,"X",null,0.76119393740889485,{"$f":"IF(SUMPRODUCT((A$14:A217=A217)*(B$14:B217=B217)*(D$14:D217=D217))>1,0,1)","v":1},"Contratos de prestación de servicios profesionales y de apoyo a la gestión","Contratación directa",{"$f":"IF(ISBLANK(G217),1,IFERROR(VLOOKUP(G217,Tipo!$C$12:$C$27,1,FALSE),\"NO\"))","v":"Prestación de servicios profesionales y de apoyo a la gestión, o para la ejecución de trabajos artísticos que sólo puedan encomendarse a determinadas personas naturales;"},"Inversión",{"$f":"IF(ISBLANK(K217),1,IFERROR(VLOOKUP(K217,Eje_Pilar_Prop!C193:C294,1,FALSE),\"NO\"))","v":"NO"},"SECOP II",1,"Bogotá Mejor para Todos"]
[210,2020,"SECOP II","FDLC-CPS-210-2020","Contratos de prestación de servicios profesionales y de apoyo a la gestión","Contratación directa","Prestación de servicios profesionales y de apoyo a la gestión, o para la ejecución de trabajos artísticos que sólo puedan encomendarse a determinadas personas naturales;","PRESTACIÓN DE SERVICIOS DE APOYO TÉCNICO EN LA ADMINISTRACIÓN DE LAS CASAS COMUNITARIAS DE LA LOCALIDAD DE LA CANDELARIA DE CONFORMIDAD CON EL ACUERDO LOCAL 006 DE 2013","Inversión","Bogotá Mejor para Todos",45,{"$f":"IF(ISERROR(VLOOKUP(K218,Eje_Pilar_Prop!$C$2:$E$104,2,FALSE)),\" \",VLOOKUP(K218,Eje_Pilar_Prop!$C$2:$E$104,2,FALSE))","v":"Gobernanza e influencia local, regional e internacional"},{"$f":"IF(ISERROR(VLOOKUP(K218,Eje_Pilar_Prop!$C$2:$E$104,3,FALSE)),\" \",VLOOKUP(K218,Eje_Pilar_Prop!$C$2:$E$104,3,FALSE))","v":"Eje Transversal 4 Gobierno Legitimo, Fortalecimiento Local y Eficiencia"},1395,41621560,"NELLY PARRA TOCORA",4828333,null,null,0,null,4828333,4731767,"2020-11-12","2020-11-12","2020-12-30",50,null,null,null,null,null,null,null,null,null,"X",0.98000013669314023,{"$f":"IF(SUMPRODUCT((A$14:A218=A218)*(B$14:B218=B218)*(D$14:D218=D218))>1,0,1)","v":1},"Contratos de prestación de servicios profesionales y de apoyo a la gestión","Contratación directa",{"$f":"IF(ISBLANK(G218),1,IFERROR(VLOOKUP(G218,Tipo!$C$12:$C$27,1,FALSE),\"NO\"))","v":"Prestación de servicios profesionales y de apoyo a la gestión, o para la ejecución de trabajos artísticos que sólo puedan encomendarse a determinadas personas naturales;"},"Inversión",{"$f":"IF(ISBLANK(K218),1,IFERROR(VLOOKUP(K218,Eje_Pilar_Prop!C194:C295,1,FALSE),\"NO\"))","v":"NO"},"SECOP II",1,"Bogotá Mejor para Todos"]
[211,2020,"SECOP II","FDLC-CPS-211-2020","Contratos de prestación de servicios profesionales y de apoyo a la gestión","Contratación directa","Prestación de servicios profesionales y de apoyo a la gestión, o para la ejecución de trabajos artísticos que sólo puedan encomendarse a determinadas personas naturales;","PRESTAR LOS SERVICIOS PROFESIONALES ESPECIALIZADOS EN LA ESTRUCTURACIÓN DE LOS PROCESOS ADMINISTRATIVOS DE FORMULACIÓN, SEGUIMIENTO Y EVALUACIÓN DE LOS PROYECTOS DE INVERSIÓN Y FUNCIONAMIENTO DE LA ENTIDAD A CARGO DE PLANEACIÓN DEPENDENCIA DEL ÁREA GESTIÓN DE DESARROLLO LOCAL DE LA ALCALDÍA LOCAL DE LA CANDELARIA","Inversión","Bogotá Mejor para Todos",45,{"$f":"IF(ISERROR(VLOOKUP(K219,Eje_Pilar_Prop!$C$2:$E$104,2,FALSE)),\" \",VLOOKUP(K219,Eje_Pilar_Prop!$C$2:$E$104,2,FALSE))","v":"Gobernanza e influencia local, regional e internacional"},{"$f":"IF(ISERROR(VLOOKUP(K219,Eje_Pilar_Prop!$C$2:$E$104,3,FALSE)),\" \",VLOOKUP(K219,Eje_Pilar_Prop!$C$2:$E$104,3,FALSE))","v":"Eje Transversal 4 Gobierno Legitimo, Fortalecimiento Local y Eficiencia"},1395,15903186,"CARLOS ALBERTO CASTRO VALENCIA",10500000,null,null,1,5133334,15633334,11433333,"2020-11-12","2020-11-12","2021-01-17",45,1,22,null,null,null,null,null,null,"X",null,0.73134323107278332,{"$f":"IF(SUMPRODUCT((A$14:A219=A219)*(B$14:B219=B219)*(D$14:D219=D219))>1,0,1)","v":1},"Contratos de prestación de servicios profesionales y de apoyo a la gestión","Contratación directa",{"$f":"IF(ISBLANK(G219),1,IFERROR(VLOOKUP(G219,Tipo!$C$12:$C$27,1,FALSE),\"NO\"))","v":"Prestación de servicios profesionales y de apoyo a la gestión, o para la ejecución de trabajos artísticos que sólo puedan encomendarse a determinadas personas naturales;"},"Inversión",{"$f":"IF(ISBLANK(K219),1,IFERROR(VLOOKUP(K219,Eje_Pilar_Prop!C195:C296,1,FALSE),\"NO\"))","v":"NO"},{"$f":"IF(ISBLANK(C219),1,IFERROR(VLOOKUP(C219,SECOP,1,FALSE),\"NO\"))","v":"SECOP II"},1,"Bogotá Mejor para Todos"]
[212,2020,"SECOP II","FDLC-CPS-212-2020","Contratos de prestación de servicios profesionales y de apoyo a la gestión","Contratación directa","Prestación de servicios profesionales y de apoyo a la gestión, o para la ejecución de trabajos artísticos que sólo puedan encomendarse a determinadas personas naturales;","APOYAR TÉCNICAMENTE LAS DISTINTAS ETAPAS DE LOS PROCESOS DE COMPETENCIA DE LA ALCALDÍA LOCAL PARA LA DEPURACIÓN DE ACTUACIONES ADMINISTRATIVAS","Inversión","Bogotá Mejor para Todos",45,{"$f":"IF(ISERROR(VLOOKUP(K220,Eje_Pilar_Prop!$C$2:$E$104,2,FALSE)),\" \",VLOOKUP(K220,Eje_Pilar_Prop!$C$2:$E$104,2,FALSE))","v":"Gobernanza e influencia local, regional e internacional"},{"$f":"IF(ISERROR(VLOOKUP(K220,Eje_Pilar_Prop!$C$2:$E$104,3,FALSE)),\" \",VLOOKUP(K220,Eje_Pilar_Prop!$C$2:$E$104,3,FALSE))","v":"Eje Transversal 4 Gobierno Legitimo, Fortalecimiento Local y Eficiencia"},1395,79507928,"FRANCISCO JAVIER HIGUERA NOVA",6715500,null,null,0,null,6715500,6715500,"2020-11-12","2020-11-12","2020-12-26",45,null,null,null,null,null,null,null,null,null,"X",1,{"$f":"IF(SUMPRODUCT((A$14:A220=A220)*(B$14:B220=B220)*(D$14:D220=D220))>1,0,1)","v":1},"Contratos de prestación de servicios profesionales y de apoyo a la gestión","Contratación directa",{"$f":"IF(ISBLANK(G220),1,IFERROR(VLOOKUP(G220,Tipo!$C$12:$C$27,1,FALSE),\"NO\"))","v":"Prestación de servicios profesionales y de apoyo a la gestión, o para la ejecución de trabajos artísticos que sólo puedan encomendarse a determinadas personas naturales;"},"Inversión",{"$f":"IF(ISBLANK(K220),1,IFERROR(VLOOKUP(K220,Eje_Pilar_Prop!C196:C297,1,FALSE),\"NO\"))","v":"NO"},"SECOP II",1,"Bogotá Mejor para Todos"]
[213,2020,"SECOP II","FDLC-CPS-213-2020","Contratos de prestación de servicios profesionales y de apoyo a la gestión","Contratación directa","Prestación de servicios profesionales y de apoyo a la gestión, o para la ejecución de trabajos artísticos que sólo puedan encomendarse a determinadas personas naturales;","“APOYAR TÉCNICAMENTE LAS DISTINTAS ETAPAS DE LOS PROCESOS DE COMPETENCIA DE LA ALCALDÍA LOCAL PARA LA DEPURACIÓN DE ACTUACIONES ADMINISTRATIVAS","Inversión","Bogotá Mejor para Todos",45,{"$f":"IF(ISERROR(VLOOKUP(K221,Eje_Pilar_Prop!$C$2:$E$104,2,FALSE)),\" \",VLOOKUP(K221,Eje_Pilar_Prop!$C$2:$E$104,2,FALSE))","v":"Gobernanza e influencia local, regional e internacional"},{"$f":"IF(ISERROR(VLOOKUP(K221,Eje_Pilar_Prop!$C$2:$E$104,3,FALSE)),\" \",VLOOKUP(K221,Eje_Pilar_Prop!$C$2:$E$104,3,FALSE))","v":"Eje Transversal 4 Gobierno Legitimo, Fortalecimiento Local y Eficiencia"},1395,3023764906,"PAOLA ANDREA RANGEL MARTINEZ",6715500,null,null,1,3283134,9998634,2835433,"2020-11-12","2020-11-12","2021-01-17",45,1,22,null,null,null,null,null,null,"X",null,0.28358203730629605,{"$f":"IF(SUMPRODUCT((A$14:A221=A221)*(B$14:B221=B221)*(D$14:D221=D221))>1,0,1)","v":1},"Contratos de prestación de servicios profesionales y de apoyo a la gestión","Contratación directa",{"$f":"IF(ISBLANK(G221),1,IFERROR(VLOOKUP(G221,Tipo!$C$12:$C$27,1,FALSE),\"NO\"))","v":"Prestación de servicios profesionales y de apoyo a la gestión, o para la ejecución de trabajos artísticos que sólo puedan encomendarse a determinadas personas naturales;"},"Inversión",{"$f":"IF(ISBLANK(K221),1,IFERROR(VLOOKUP(K221,Eje_Pilar_Prop!C197:C298,1,FALSE),\"NO\"))","v":"NO"},"SECOP II",1,"Bogotá Mejor para Todos"]
[214,2020,"SECOP II","FDLC-CPS-214-2020","Contratos de prestación de servicios profesionales y de apoyo a la gestión","Contratación directa","Prestación de servicios profesionales y de apoyo a la gestión, o para la ejecución de trabajos artísticos que sólo puedan encomendarse a determinadas personas naturales;","PRESTACIÓN DE SERVICIOS PORFESIONALES AL FONDO DE DESARROLLO L OCAL DE LA CANDELARIA EN LA ATENCIÓN, SEGUIMIENTO Y CONTROL DE LAS RESPUESTAS A LAS PETICIONES, REQUERIMIENTOS Y SOLICITUDES DE INFORMACIÓN QUE SEAN COMPETENCIA DE LA ENTIDAD, Y DEMÁS TRÁMITES REQUERIDOS","Inversión","Bogotá Mejor para Todos",45,{"$f":"IF(ISERROR(VLOOKUP(K222,Eje_Pilar_Prop!$C$2:$E$104,2,FALSE)),\" \",VLOOKUP(K222,Eje_Pilar_Prop!$C$2:$E$104,2,FALSE))","v":"Gobernanza e influencia local, regional e internacional"},{"$f":"IF(ISERROR(VLOOKUP(K222,Eje_Pilar_Prop!$C$2:$E$104,3,FALSE)),\" \",VLOOKUP(K222,Eje_Pilar_Prop!$C$2:$E$104,3,FALSE))","v":"Eje Transversal 4 Gobierno Legitimo, Fortalecimiento Local y Eficiencia"},1395,31170085,"LILIANA CECILIA OJEDA TIRADO",6000000,null,null,0,null,6000000,6000000,"2020-11-12","2020-11-12","2020-12-26",45,null,null,null,null,null,null,null,null,null,"X",1,{"$f":"IF(SUMPRODUCT((A$14:A222=A222)*(B$14:B222=B222)*(D$14:D222=D222))>1,0,1)","v":1},{"$f":"IF(ISBLANK(E222),1,IFERROR(VLOOKUP(E222,tipo,1,FALSE),\"NO\"))","v":"Contratos de prestación de servicios profesionales y de apoyo a la gestión"},{"$f":"IF(ISBLANK(F222),1,IFERROR(VLOOKUP(F222,modal,1,FALSE),\"NO\"))","v":"Contratación directa"},{"$f":"IF(ISBLANK(G222),1,IFERROR(VLOOKUP(G222,Tipo!$C$12:$C$27,1,FALSE),\"NO\"))","v":"Prestación de servicios profesionales y de apoyo a la gestión, o para la ejecución de trabajos artísticos que sólo puedan encomendarse a determinadas personas naturales;"},{"$f":"IF(ISBLANK(I222),1,IFERROR(VLOOKUP(I222,afectacion,1,FALSE),\"NO\"))","v":"Inversión"},{"$f":"IF(ISBLANK(K222),1,IFERROR(VLOOKUP(K222,Eje_Pilar_Prop!C198:C299,1,FALSE),\"NO\"))","v":"NO"},"SECOP II",1,"Bogotá Mejor para Todos"]
[215,2020,"SECOP II","FDLC-IMC-016-2020","Compraventa de bienes muebles","Contratación mínima cuantia","No aplica","ADQUIRIR CHAQUETAS INSTITUCIONALES DE LA ALCALDÍA LOCAL DE LA CANDELARIA DE ACUERDO CON ANEXO TÉCNICO Y EL MANUAL USO DE MARCA ALCALDIA DE BOGOTÁ.","Funcionamiento","Bogotá Mejor para Todos","No aplica","No Aplica","No Aplica","No Aplica","900.990.752-1","PROYECTOS INSTITUCIONALES DE COLOMBIA S.A.S.",6936748,null,null,0,null,6936748,6936748,"2020-11-12","2020-11-12","2020-12-31",45,null,null,null,null,null,null,null,null,null,"X",1,{"$f":"IF(SUMPRODUCT((A$14:A223=A223)*(B$14:B223=B223)*(D$14:D223=D223))>1,0,1)","v":1},"Compraventa de bienes muebles","Contratación mínima cuantia",{"$f":"IF(ISBLANK(G223),1,IFERROR(VLOOKUP(G223,Tipo!$C$12:$C$27,1,FALSE),\"NO\"))","v":"NO"},"Funcionamiento",{"$f":"IF(ISBLANK(K223),1,IFERROR(VLOOKUP(K223,Eje_Pilar_Prop!C199:C300,1,FALSE),\"NO\"))","v":"NO"},"SECOP II",1,"Bogotá Mejor para Todos"]
[216,2020,"SECOP II","FDLC-IMC-017-2020","Seguros","Contratación mínima cuantia","No aplica","Contratar los seguros que amparen los intereses patrimoniales actuales y futuros, así como los\nbienes de propiedad del fondo de desarrollo local de la candelaria, que estén bajo su responsabilidad\ny custodia y aquellos que sean adquiridos para desarrollar las funciones inherentes a su actividad y\ncualquier otra póliza de seguros que requiera la entidad en el desarrollo de su actividad.","Funcionamiento","Bogotá Mejor para Todos","No aplica","No Aplica","No Aplica","No Aplica","860002400-2","LA PREVISORA S.A COMPAÑÍA DE SEGUROS",8375107,null,null,0,null,8375107,8180567,"2020-11-13","2020-11-13","2020-12-31",78,null,null,null,null,null,null,null,null,null,"X",0.97677164005188233,{"$f":"IF(SUMPRODUCT((A$14:A224=A224)*(B$14:B224=B224)*(D$14:D224=D224))>1,0,1)","v":1},"Seguros","Contratación mínima cuantia",{"$f":"IF(ISBLANK(G224),1,IFERROR(VLOOKUP(G224,Tipo!$C$12:$C$27,1,FALSE),\"NO\"))","v":"NO"},"Funcionamiento",{"$f":"IF(ISBLANK(K224),1,IFERROR(VLOOKUP(K224,Eje_Pilar_Prop!C200:C301,1,FALSE),\"NO\"))","v":"NO"},"SECOP II",1,"Bogotá Mejor para Todos"]
[217,2020,"SECOP II","FDLC-CPS-217-2020","Contratos de prestación de servicios profesionales y de apoyo a la gestión","Contratación directa","Prestación de servicios profesionales y de apoyo a la gestión, o para la ejecución de trabajos artísticos que sólo puedan encomendarse a determinadas personas naturales;","PRESTACIÓN DE SERVICIOS PROFESIONALES AL FONDO DE DESARROLLO LOCAL DE LA CANDELARIA, EN LOS TRÁMITES RELACIONADOS CON LOS PROCESOS PRECONTRACTUALES, CONTRACTUALES Y POS CONTRACTUALES QUE SE ADELANTEN A TRAVÉS DE SECOP I Y II, ASÍ COMO LA ADQUISICIÓN DE BIENES Y SERVICIOS A TRAVÉS DE LA TIENDA VIRTUAL DEL ESTADO COLOMBIANO","Inversión","Bogotá Mejor para Todos",45,{"$f":"IF(ISERROR(VLOOKUP(K225,Eje_Pilar_Prop!$C$2:$E$104,2,FALSE)),\" \",VLOOKUP(K225,Eje_Pilar_Prop!$C$2:$E$104,2,FALSE))","v":"Gobernanza e influencia local, regional e internacional"},{"$f":"IF(ISERROR(VLOOKUP(K225,Eje_Pilar_Prop!$C$2:$E$104,3,FALSE)),\" \",VLOOKUP(K225,Eje_Pilar_Prop!$C$2:$E$104,3,FALSE))","v":"Eje Transversal 4 Gobierno Legitimo, Fortalecimiento Local y Eficiencia"},1395,1032363826,"PAOLA ANDREA PADILLA AYARZA ",6300000,null,null,1,2940000,9240000,6860000,"2020-11-13","2020-11-13","2021-01-17",45,1,21,null,null,null,null,null,null,"X",null,0.74242424242424243,{"$f":"IF(SUMPRODUCT((A$14:A225=A225)*(B$14:B225=B225)*(D$14:D225=D225))>1,0,1)","v":1},"Contratos de prestación de servicios profesionales y de apoyo a la gestión","Contratación directa",{"$f":"IF(ISBLANK(G225),1,IFERROR(VLOOKUP(G225,Tipo!$C$12:$C$27,1,FALSE),\"NO\"))","v":"Prestación de servicios profesionales y de apoyo a la gestión, o para la ejecución de trabajos artísticos que sólo puedan encomendarse a determinadas personas naturales;"},"Inversión",{"$f":"IF(ISBLANK(K225),1,IFERROR(VLOOKUP(K225,Eje_Pilar_Prop!C201:C302,1,FALSE),\"NO\"))","v":"NO"},"SECOP II",1,"Bogotá Mejor para Todos"]
[218,2020,"SECOP II","FDLC-CPS-218-2020","Contratos de prestación de servicios profesionales y de apoyo a la gestión","Contratación directa","Prestación de servicios profesionales y de apoyo a la gestión, o para la ejecución de trabajos artísticos que sólo puedan encomendarse a determinadas personas naturales;","PRESTAR LOS SERVICIOS DE APOYO LOGÍSTICO EN TODOS LOS EVENTOS Y ACTIVIDADES DE LA ADMINISTRACIÓN LOCAL DE LA LOCALIDAD LA CANDELARIA","Inversión","Bogotá Mejor para Todos",45,{"$f":"IF(ISERROR(VLOOKUP(K226,Eje_Pilar_Prop!$C$2:$E$104,2,FALSE)),\" \",VLOOKUP(K226,Eje_Pilar_Prop!$C$2:$E$104,2,FALSE))","v":"Gobernanza e influencia local, regional e internacional"},{"$f":"IF(ISERROR(VLOOKUP(K226,Eje_Pilar_Prop!$C$2:$E$104,3,FALSE)),\" \",VLOOKUP(K226,Eje_Pilar_Prop!$C$2:$E$104,3,FALSE))","v":"Eje Transversal 4 Gobierno Legitimo, Fortalecimiento Local y Eficiencia"},1395,80765647,"JAIRO ANDRES RODRIGUEZ MARTINEZ",3230400,null,null,0,null,3230400,874900,"2020-11-18","2020-11-18","2020-12-31",43,null,null,null,null,null,null,null,null,"X",null,0.27083333333333331,{"$f":"IF(SUMPRODUCT((A$14:A226=A226)*(B$14:B226=B226)*(D$14:D226=D226))>1,0,1)","v":1},"Contratos de prestación de servicios profesionales y de apoyo a la gestión","Contratación directa",{"$f":"IF(ISBLANK(G226),1,IFERROR(VLOOKUP(G226,Tipo!$C$12:$C$27,1,FALSE),\"NO\"))","v":"Prestación de servicios profesionales y de apoyo a la gestión, o para la ejecución de trabajos artísticos que sólo puedan encomendarse a determinadas personas naturales;"},"Inversión",{"$f":"IF(ISBLANK(K226),1,IFERROR(VLOOKUP(K226,Eje_Pilar_Prop!C202:C303,1,FALSE),\"NO\"))","v":"NO"},"SECOP II",{"$f":"IF(OR(YEAR(X226)=2020,ISBLANK(X226)),1,\"NO\")","v":1},"Bogotá Mejor para Todos"]
[219,2020,"SECOP II","FDLC-CPS-219-2020","Contratos de prestación de servicios profesionales y de apoyo a la gestión","Contratación directa","Prestación de servicios profesionales y de apoyo a la gestión, o para la ejecución de trabajos artísticos que sólo puedan encomendarse a determinadas personas naturales;","PRESTACIÓN DE SERVICIOS PROFESIONALES PARA APOYAR Y FORTALECER LA OFICINA DE PRESUPUESTO DEL FONDO DE DESARROLLO LOCAL EN LAS GESTIONES ADMINISTRATIVAS Y FINANCIERAS DE LA ENTIDAD","Inversión","Bogotá Mejor para Todos",45,{"$f":"IF(ISERROR(VLOOKUP(K227,Eje_Pilar_Prop!$C$2:$E$104,2,FALSE)),\" \",VLOOKUP(K227,Eje_Pilar_Prop!$C$2:$E$104,2,FALSE))","v":"Gobernanza e influencia local, regional e internacional"},{"$f":"IF(ISERROR(VLOOKUP(K227,Eje_Pilar_Prop!$C$2:$E$104,3,FALSE)),\" \",VLOOKUP(K227,Eje_Pilar_Prop!$C$2:$E$104,3,FALSE))","v":"Eje Transversal 4 Gobierno Legitimo, Fortalecimiento Local y Eficiencia"},1395,50875779,"ISABELA RAQUEL FERNANDEZ PEREZ",6504000,null,null,0,null,6504000,6504000,"2020-11-13","2020-11-13","2020-12-27",45,null,null,null,null,null,null,null,null,null,"X",1,{"$f":"IF(SUMPRODUCT((A$14:A227=A227)*(B$14:B227=B227)*(D$14:D227=D227))>1,0,1)","v":1},"Contratos de prestación de servicios profesionales y de apoyo a la gestión","Contratación directa",{"$f":"IF(ISBLANK(G227),1,IFERROR(VLOOKUP(G227,Tipo!$C$12:$C$27,1,FALSE),\"NO\"))","v":"Prestación de servicios profesionales y de apoyo a la gestión, o para la ejecución de trabajos artísticos que sólo puedan encomendarse a determinadas personas naturales;"},"Inversión",{"$f":"IF(ISBLANK(K227),1,IFERROR(VLOOKUP(K227,Eje_Pilar_Prop!C203:C304,1,FALSE),\"NO\"))","v":"NO"},"SECOP II",1,"Bogotá Mejor para Todos"]
[220,2020,"SECOP II","FDLC-CPS-220-2020","Contratos de prestación de servicios profesionales y de apoyo a la gestión","Contratación directa","Prestación de servicios profesionales y de apoyo a la gestión, o para la ejecución de trabajos artísticos que sólo puedan encomendarse a determinadas personas naturales;","“PRESTACIÓN DE SERVICIOS PROFESIONALES PARA BRINDAR ACOMPAÑAMIENTO Y APOYO PSICOSOCIAL A LAS PERSONAS QUE ASI LO REQUIERAN DENTRO DE LA LOCALIDAD LA CANDELARIA, EN RESPUESTA A LA CRISIS OCASIONADA POR LA PANDEMIA DEL COVID-19","Inversión","Bogotá Mejor para Todos",45,{"$f":"IF(ISERROR(VLOOKUP(K228,Eje_Pilar_Prop!$C$2:$E$104,2,FALSE)),\" \",VLOOKUP(K228,Eje_Pilar_Prop!$C$2:$E$104,2,FALSE))","v":"Gobernanza e influencia local, regional e internacional"},{"$f":"IF(ISERROR(VLOOKUP(K228,Eje_Pilar_Prop!$C$2:$E$104,3,FALSE)),\" \",VLOOKUP(K228,Eje_Pilar_Prop!$C$2:$E$104,3,FALSE))","v":"Eje Transversal 4 Gobierno Legitimo, Fortalecimiento Local y Eficiencia"},1395,1010238208,"SEBASTIAN ARTURO REMOLINA RINCON",5794500,null,null,0,null,5794500,2317800,"2020-11-13","2020-11-13","2020-12-27",45,null,null,null,null,null,null,null,null,"X",null,{"$f":"IF(ISERROR(W228/V228),\"-\",(W228/V228))","v":0.4},{"$f":"IF(SUMPRODUCT((A$14:A228=A228)*(B$14:B228=B228)*(D$14:D228=D228))>1,0,1)","v":1},"Contratos de prestación de servicios profesionales y de apoyo a la gestión","Contratación directa",{"$f":"IF(ISBLANK(G228),1,IFERROR(VLOOKUP(G228,Tipo!$C$12:$C$27,1,FALSE),\"NO\"))","v":"Prestación de servicios profesionales y de apoyo a la gestión, o para la ejecución de trabajos artísticos que sólo puedan encomendarse a determinadas personas naturales;"},"Inversión",{"$f":"IF(ISBLANK(K228),1,IFERROR(VLOOKUP(K228,Eje_Pilar_Prop!C204:C305,1,FALSE),\"NO\"))","v":"NO"},"SECOP II",1,"Bogotá Mejor para Todos"]
[221,2020,"SECOP II","FDLC-CPS-221-2020","Contratos de prestación de servicios profesionales y de apoyo a la gestión","Contratación directa","Prestación de servicios profesionales y de apoyo a la gestión, o para la ejecución de trabajos artísticos que sólo puedan encomendarse a determinadas personas naturales;","APOYAR JURÍDICAMENTE LA EJECUCIÓN DE LAS ACCIONES REQUERIDAS PARA LA DEPURACIÓN DE LAS ACTUACIONES ADMINISTRATIVAS QUE CURSAN EN LA ALCALDÍA LOCAL","Inversión","Bogotá Mejor para Todos",45,{"$f":"IF(ISERROR(VLOOKUP(K229,Eje_Pilar_Prop!$C$2:$E$104,2,FALSE)),\" \",VLOOKUP(K229,Eje_Pilar_Prop!$C$2:$E$104,2,FALSE))","v":"Gobernanza e influencia local, regional e internacional"},{"$f":"IF(ISERROR(VLOOKUP(K229,Eje_Pilar_Prop!$C$2:$E$104,3,FALSE)),\" \",VLOOKUP(K229,Eje_Pilar_Prop!$C$2:$E$104,3,FALSE))","v":"Eje Transversal 4 Gobierno Legitimo, Fortalecimiento Local y Eficiencia"},1395,51875915,"LUZ SOFIA AMAYA CASTAÑEDA",6267800,null,null,0,null,{"$f":"+Q229+S229+U229","v":6267800},6118566,"2020-11-20","2020-11-20","2020-12-31",42,null,null,null,null,null,null,null,null,null,"X",0.97619036982673346,{"$f":"IF(SUMPRODUCT((A$14:A229=A229)*(B$14:B229=B229)*(D$14:D229=D229))>1,0,1)","v":1},"Contratos de prestación de servicios profesionales y de apoyo a la gestión","Contratación directa",{"$f":"IF(ISBLANK(G229),1,IFERROR(VLOOKUP(G229,Tipo!$C$12:$C$27,1,FALSE),\"NO\"))","v":"Prestación de servicios profesionales y de apoyo a la gestión, o para la ejecución de trabajos artísticos que sólo puedan encomendarse a determinadas personas naturales;"},"Inversión",{"$f":"IF(ISBLANK(K229),1,IFERROR(VLOOKUP(K229,Eje_Pilar_Prop!C205:C306,1,FALSE),\"NO\"))","v":"NO"},"SECOP II",1,"Bogotá Mejor para Todos"]
[222,2020,"SECOP II","FDLC-CPS-222-2020","Contratos de prestación de servicios profesionales y de apoyo a la gestión","Contratación directa","Prestación de servicios profesionales y de apoyo a la gestión, o para la ejecución de trabajos artísticos que sólo puedan encomendarse a determinadas personas naturales;","PRESTACION DE SERVICIOS PROFESIONALES DE APOYO EN LA ADMINISTRACION DEL PUNTO VIVE DIGITAL DE LA LOCALIDAD LA CANDELARIA PARA FOMENTAR EN LA COMUNIDAD LAS TICS","Inversión","Bogotá Mejor para Todos",45,{"$f":"IF(ISERROR(VLOOKUP(K230,Eje_Pilar_Prop!$C$2:$E$104,2,FALSE)),\" \",VLOOKUP(K230,Eje_Pilar_Prop!$C$2:$E$104,2,FALSE))","v":"Gobernanza e influencia local, regional e internacional"},{"$f":"IF(ISERROR(VLOOKUP(K230,Eje_Pilar_Prop!$C$2:$E$104,3,FALSE)),\" \",VLOOKUP(K230,Eje_Pilar_Prop!$C$2:$E$104,3,FALSE))","v":"Eje Transversal 4 Gobierno Legitimo, Fortalecimiento Local y Eficiencia"},1395,79322403,"EDGAR YESID SILVA BUSTOS",5600000,null,null,0,null,5600000,5466667,"2020-11-20","2020-11-20","2020-12-31",42,null,null,null,null,null,null,null,null,null,"X",0.97619053571428571,{"$f":"IF(SUMPRODUCT((A$14:A230=A230)*(B$14:B230=B230)*(D$14:D230=D230))>1,0,1)","v":1},"Contratos de prestación de servicios profesionales y de apoyo a la gestión","Contratación directa",{"$f":"IF(ISBLANK(G230),1,IFERROR(VLOOKUP(G230,Tipo!$C$12:$C$27,1,FALSE),\"NO\"))","v":"Prestación de servicios profesionales y de apoyo a la gestión, o para la ejecución de trabajos artísticos que sólo puedan encomendarse a determinadas personas naturales;"},"Inversión",{"$f":"IF(ISBLANK(K230),1,IFERROR(VLOOKUP(K230,Eje_Pilar_Prop!C206:C307,1,FALSE),\"NO\"))","v":"NO"},"SECOP II",1,"Bogotá Mejor para Todos"]
[223,2020,"SECOP II","FDLC-CPS-223-2020","Contratos de prestación de servicios profesionales y de apoyo a la gestión","Contratación directa","Prestación de servicios profesionales y de apoyo a la gestión, o para la ejecución de trabajos artísticos que sólo puedan encomendarse a determinadas personas naturales;","APOYAR LA FORMULACIÓN, GESTIÓN Y SEGUIMIENTO DE ACTIVIDADES ENFOCADAS A LA GESTIÓN AMBIENTAL EXTERNA, ENCAMINADAS A LA MITIGACIÓN DE LOS DIFERENTES IMPACTOS AMBIENTALES Y LA CONSERVACIÓN DE LOS RECURSOS NATURALES DE LA LOCALIDAD","Inversión","Bogotá Mejor para Todos",45,{"$f":"IF(ISERROR(VLOOKUP(K231,Eje_Pilar_Prop!$C$2:$E$104,2,FALSE)),\" \",VLOOKUP(K231,Eje_Pilar_Prop!$C$2:$E$104,2,FALSE))","v":"Gobernanza e influencia local, regional e internacional"},{"$f":"IF(ISERROR(VLOOKUP(K231,Eje_Pilar_Prop!$C$2:$E$104,3,FALSE)),\" \",VLOOKUP(K231,Eje_Pilar_Prop!$C$2:$E$104,3,FALSE))","v":"Eje Transversal 4 Gobierno Legitimo, Fortalecimiento Local y Eficiencia"},1395,80194800,"PEDRO ANDRES BARRERA ALVARADO",5880000,null,null,0,null,5880000,0,"2020-11-20","2020-11-20","2020-12-31",42,null,null,null,null,null,null,null,null,"X",null,0,{"$f":"IF(SUMPRODUCT((A$14:A231=A231)*(B$14:B231=B231)*(D$14:D231=D231))>1,0,1)","v":1},"Contratos de prestación de servicios profesionales y de apoyo a la gestión","Contratación directa",{"$f":"IF(ISBLANK(G231),1,IFERROR(VLOOKUP(G231,Tipo!$C$12:$C$27,1,FALSE),\"NO\"))","v":"Prestación de servicios profesionales y de apoyo a la gestión, o para la ejecución de trabajos artísticos que sólo puedan encomendarse a determinadas personas naturales;"},"Inversión",{"$f":"IF(ISBLANK(K231),1,IFERROR(VLOOKUP(K231,Eje_Pilar_Prop!C207:C308,1,FALSE),\"NO\"))","v":"NO"},"SECOP II",1,"Bogotá Mejor para Todos"]
[224,2020,"SECOP II","FDLC-CPS-224-2020","Contratos de prestación de servicios profesionales y de apoyo a la gestión","Contratación directa","Prestación de servicios profesionales y de apoyo a la gestión, o para la ejecución de trabajos artísticos que sólo puedan encomendarse a determinadas personas naturales;","APOYAR JURÍDICAMENTE LA EJECUCIÓN DE LAS ACCIONES REQUERIDAS PARA LA DEPURACIÓN DE LAS ACTUACIONES ADMINISTRATIVAS QUE CURSAN EN LA ALCALDÍA LOCAL","Inversión","Bogotá Mejor para Todos",45,{"$f":"IF(ISERROR(VLOOKUP(K232,Eje_Pilar_Prop!$C$2:$E$104,2,FALSE)),\" \",VLOOKUP(K232,Eje_Pilar_Prop!$C$2:$E$104,2,FALSE))","v":"Gobernanza e influencia local, regional e internacional"},{"$f":"IF(ISERROR(VLOOKUP(K232,Eje_Pilar_Prop!$C$2:$E$104,3,FALSE)),\" \",VLOOKUP(K232,Eje_Pilar_Prop!$C$2:$E$104,3,FALSE))","v":"Eje Transversal 4 Gobierno Legitimo, Fortalecimiento Local y Eficiencia"},1395,41794885,"TERESA HERREÑO SOLANO",5670866,null,null,0,null,5670866,5521633,"2020-11-24","2020-11-24","2020-12-31",38,null,null,null,null,null,null,null,null,null,"X",0.97368426621260318,{"$f":"IF(SUMPRODUCT((A$14:A232=A232)*(B$14:B232=B232)*(D$14:D232=D232))>1,0,1)","v":1},"Contratos de prestación de servicios profesionales y de apoyo a la gestión","Contratación directa",{"$f":"IF(ISBLANK(G232),1,IFERROR(VLOOKUP(G232,Tipo!$C$12:$C$27,1,FALSE),\"NO\"))","v":"Prestación de servicios profesionales y de apoyo a la gestión, o para la ejecución de trabajos artísticos que sólo puedan encomendarse a determinadas personas naturales;"},"Inversión",{"$f":"IF(ISBLANK(K232),1,IFERROR(VLOOKUP(K232,Eje_Pilar_Prop!C208:C309,1,FALSE),\"NO\"))","v":"NO"},"SECOP II",1,"Bogotá Mejor para Todos"]
[225,2020,"SECOP II","FDLC-CPS-225-2020","Contratos de prestación de servicios profesionales y de apoyo a la gestión","Contratación directa","Prestación de servicios profesionales y de apoyo a la gestión, o para la ejecución de trabajos artísticos que sólo puedan encomendarse a determinadas personas naturales;","APOYAR JURÍDICAMENTE LA EJECUCIÓN DE LAS ACCIONES REQUERIDAS PARA LA DEPURACIÓN DE LAS ACTUACIONES ADMINISTRATIVAS QUE CURSAN EN LA ALCALDÍA LOCAL","Inversión","Bogotá Mejor para Todos",45,{"$f":"IF(ISERROR(VLOOKUP(K233,Eje_Pilar_Prop!$C$2:$E$104,2,FALSE)),\" \",VLOOKUP(K233,Eje_Pilar_Prop!$C$2:$E$104,2,FALSE))","v":"Gobernanza e influencia local, regional e internacional"},{"$f":"IF(ISERROR(VLOOKUP(K233,Eje_Pilar_Prop!$C$2:$E$104,3,FALSE)),\" \",VLOOKUP(K233,Eje_Pilar_Prop!$C$2:$E$104,3,FALSE))","v":"Eje Transversal 4 Gobierno Legitimo, Fortalecimiento Local y Eficiencia"},1395,79691880,"JORGE ELIECER DURAN CONSUEGRA",5820100,null,null,0,null,5820100,5670865,"2020-11-23","2020-11-23","2020-12-31",39,null,null,null,null,null,null,null,null,null,"X",0.97435868799505165,{"$f":"IF(SUMPRODUCT((A$14:A233=A233)*(B$14:B233=B233)*(D$14:D233=D233))>1,0,1)","v":1},"Contratos de prestación de servicios profesionales y de apoyo a la gestión","Contratación directa",{"$f":"IF(ISBLANK(G233),1,IFERROR(VLOOKUP(G233,Tipo!$C$12:$C$27,1,FALSE),\"NO\"))","v":"Prestación de servicios profesionales y de apoyo a la gestión, o para la ejecución de trabajos artísticos que sólo puedan encomendarse a determinadas personas naturales;"},"Inversión",{"$f":"IF(ISBLANK(K233),1,IFERROR(VLOOKUP(K233,Eje_Pilar_Prop!C209:C310,1,FALSE),\"NO\"))","v":"NO"},"SECOP II",1,"Bogotá Mejor para Todos"]
[226,2020,"SECOP II","FDLC-CPS-226-2020","Contratos de prestación de servicios profesionales y de apoyo a la gestión","Contratación directa","Prestación de servicios profesionales y de apoyo a la gestión, o para la ejecución de trabajos artísticos que sólo puedan encomendarse a determinadas personas naturales;","APOYAR JURÍDICAMENTE LA EJECUCIÓN DE LAS ACCIONES\nREQUERIDAS PARA LA DEPURACIÓN DE LAS ACTUACIONES\nADMINISTRATIVAS QUE CURSAN EN LA ALCALDÍA LOCAL","Inversión","Bogotá Mejor para Todos",45,{"$f":"IF(ISERROR(VLOOKUP(K234,Eje_Pilar_Prop!$C$2:$E$104,2,FALSE)),\" \",VLOOKUP(K234,Eje_Pilar_Prop!$C$2:$E$104,2,FALSE))","v":"Gobernanza e influencia local, regional e internacional"},{"$f":"IF(ISERROR(VLOOKUP(K234,Eje_Pilar_Prop!$C$2:$E$104,3,FALSE)),\" \",VLOOKUP(K234,Eje_Pilar_Prop!$C$2:$E$104,3,FALSE))","v":"Eje Transversal 4 Gobierno Legitimo, Fortalecimiento Local y Eficiencia"},1395,22463659,"DIGNORA LOPEZ MONCADA",5521633,null,null,0,null,5521633,5372399,"2020-11-25","2020-11-25","2020-12-31",37,null,null,null,null,null,null,null,null,null,"X",0.97297285060416006,{"$f":"IF(SUMPRODUCT((A$14:A234=A234)*(B$14:B234=B234)*(D$14:D234=D234))>1,0,1)","v":1},"Contratos de prestación de servicios profesionales y de apoyo a la gestión","Contratación directa",{"$f":"IF(ISBLANK(G234),1,IFERROR(VLOOKUP(G234,Tipo!$C$12:$C$27,1,FALSE),\"NO\"))","v":"Prestación de servicios profesionales y de apoyo a la gestión, o para la ejecución de trabajos artísticos que sólo puedan encomendarse a determinadas personas naturales;"},"Inversión",{"$f":"IF(ISBLANK(K234),1,IFERROR(VLOOKUP(K234,Eje_Pilar_Prop!C210:C311,1,FALSE),\"NO\"))","v":"NO"},"SECOP II",1,"Bogotá Mejor para Todos"]
[227,2020,"SECOP II","FDLC-CPS-227-2020","Contratos de prestación de servicios profesionales y de apoyo a la gestión","Contratación directa","Prestación de servicios profesionales y de apoyo a la gestión, o para la ejecución de trabajos artísticos que sólo puedan encomendarse a determinadas personas naturales;","PRESTACIÓN DE SERVICIOS PROFESIONALES PARA APOYAR Y FORTALECER LA OFICINA DE PRESUPUESTO DEL FONDO DE DESARROLLO LOCAL EN LAS GESTIONES ADMINISTRATIVAS Y FINANCIERAS DE LA ENTIDAD","Inversión","Bogotá Mejor para Todos",45,{"$f":"IF(ISERROR(VLOOKUP(K235,Eje_Pilar_Prop!$C$2:$E$104,2,FALSE)),\" \",VLOOKUP(K235,Eje_Pilar_Prop!$C$2:$E$104,2,FALSE))","v":"Gobernanza e influencia local, regional e internacional"},{"$f":"IF(ISERROR(VLOOKUP(K235,Eje_Pilar_Prop!$C$2:$E$104,3,FALSE)),\" \",VLOOKUP(K235,Eje_Pilar_Prop!$C$2:$E$104,3,FALSE))","v":"Eje Transversal 4 Gobierno Legitimo, Fortalecimiento Local y Eficiencia"},1395,1032390107,"CRISTIAN CAMILO MOLINA CAMARGO",6504000,null,null,1,3179734,9683734,0,"2020-11-30","2020-11-30","2021-02-04",45,1,22,null,null,null,null,null,null,"X",null,0,{"$f":"IF(SUMPRODUCT((A$14:A235=A235)*(B$14:B235=B235)*(D$14:D235=D235))>1,0,1)","v":1},"Contratos de prestación de servicios profesionales y de apoyo a la gestión","Contratación directa",{"$f":"IF(ISBLANK(G235),1,IFERROR(VLOOKUP(G235,Tipo!$C$12:$C$27,1,FALSE),\"NO\"))","v":"Prestación de servicios profesionales y de apoyo a la gestión, o para la ejecución de trabajos artísticos que sólo puedan encomendarse a determinadas personas naturales;"},"Inversión",{"$f":"IF(ISBLANK(K235),1,IFERROR(VLOOKUP(K235,Eje_Pilar_Prop!C211:C312,1,FALSE),\"NO\"))","v":"NO"},"SECOP II",1,"Bogotá Mejor para Todos"]
[228,2020,"SECOP II","FDLC-CPS-228-2020","Contratos de prestación de servicios profesionales y de apoyo a la gestión","Contratación directa","Prestación de servicios profesionales y de apoyo a la gestión, o para la ejecución de trabajos artísticos que sólo puedan encomendarse a determinadas personas naturales;","APOYAR AL ALCALDE(SA) LOCAL EN LA PROMOCIÓN, ACOMPAÑAMIENTO, COORDINACIÓN Y ATENCIÓN DE LAS INSTANCIAS DE COORDINACIÓN INTERINSTITUCIONALES Y LAS INSTANCIAS DEPARTICIPACIÓN LOCALES, ASÍ COMO LOS PROCESOS COMUNITARIOS EN LA LOCALIDAD","Inversión","Bogotá Mejor para Todos",45,{"$f":"IF(ISERROR(VLOOKUP(K236,Eje_Pilar_Prop!$C$2:$E$104,2,FALSE)),\" \",VLOOKUP(K236,Eje_Pilar_Prop!$C$2:$E$104,2,FALSE))","v":"Gobernanza e influencia local, regional e internacional"},{"$f":"IF(ISERROR(VLOOKUP(K236,Eje_Pilar_Prop!$C$2:$E$104,3,FALSE)),\" \",VLOOKUP(K236,Eje_Pilar_Prop!$C$2:$E$104,3,FALSE))","v":"Eje Transversal 4 Gobierno Legitimo, Fortalecimiento Local y Eficiencia"},1395,1020761595,"IRENE SALOMÉ BURBANO DELGADILLO",6306000,null,null,0,null,6306000,4484267,"2020-11-30","2020-11-30","2021-01-13",45,null,null,null,null,null,null,null,null,"X",null,0.71111116397082141,{"$f":"IF(SUMPRODUCT((A$14:A236=A236)*(B$14:B236=B236)*(D$14:D236=D236))>1,0,1)","v":1},"Contratos de prestación de servicios profesionales y de apoyo a la gestión","Contratación directa",{"$f":"IF(ISBLANK(G236),1,IFERROR(VLOOKUP(G236,Tipo!$C$12:$C$27,1,FALSE),\"NO\"))","v":"Prestación de servicios profesionales y de apoyo a la gestión, o para la ejecución de trabajos artísticos que sólo puedan encomendarse a determinadas personas naturales;"},"Inversión",{"$f":"IF(ISBLANK(K236),1,IFERROR(VLOOKUP(K236,Eje_Pilar_Prop!C212:C313,1,FALSE),\"NO\"))","v":"NO"},"SECOP II",1,"Bogotá Mejor para Todos"]
[229,2020,"SECOP II","FDLC-CPS-229-2020","Contratos de prestación de servicios profesionales y de apoyo a la gestión","Contratación directa","Prestación de servicios profesionales y de apoyo a la gestión, o para la ejecución de trabajos artísticos que sólo puedan encomendarse a determinadas personas naturales;","PRESTAR LOS SERVICIOS PROFESIONALES A LA ALCALDÍA LOCAL DE LA CANDELARIA, EN EL DESARROLLO DE ACTIVIDADES EN EL MARCO DE LA REACTIVACIÓN ECONOMICA Y LA ESTRAEGIA BOGOTA A CIELO ABIERTO","Inversión","Bogotá Mejor para Todos",45,{"$f":"IF(ISERROR(VLOOKUP(K237,Eje_Pilar_Prop!$C$2:$E$104,2,FALSE)),\" \",VLOOKUP(K237,Eje_Pilar_Prop!$C$2:$E$104,2,FALSE))","v":"Gobernanza e influencia local, regional e internacional"},{"$f":"IF(ISERROR(VLOOKUP(K237,Eje_Pilar_Prop!$C$2:$E$104,3,FALSE)),\" \",VLOOKUP(K237,Eje_Pilar_Prop!$C$2:$E$104,3,FALSE))","v":"Eje Transversal 4 Gobierno Legitimo, Fortalecimiento Local y Eficiencia"},1395,11000720,"OSLER MONTES DE OCA MORA",8184000,null,null,0,null,8184000,0,"2020-11-30","2020-11-30","2021-01-13",45,null,null,null,null,null,null,null,null,"X",null,0,{"$f":"IF(SUMPRODUCT((A$14:A237=A237)*(B$14:B237=B237)*(D$14:D237=D237))>1,0,1)","v":1},"Contratos de prestación de servicios profesionales y de apoyo a la gestión","Contratación directa",{"$f":"IF(ISBLANK(G237),1,IFERROR(VLOOKUP(G237,Tipo!$C$12:$C$27,1,FALSE),\"NO\"))","v":"Prestación de servicios profesionales y de apoyo a la gestión, o para la ejecución de trabajos artísticos que sólo puedan encomendarse a determinadas personas naturales;"},"Inversión",{"$f":"IF(ISBLANK(K237),1,IFERROR(VLOOKUP(K237,Eje_Pilar_Prop!C213:C314,1,FALSE),\"NO\"))","v":"NO"},"SECOP II",1,"Bogotá Mejor para Todos"]
[230,2020,"SECOP II","FDLC-CPS-230-2020","Contratos de prestación de servicios profesionales y de apoyo a la gestión","Contratación directa","Prestación de servicios profesionales y de apoyo a la gestión, o para la ejecución de trabajos artísticos que sólo puedan encomendarse a determinadas personas naturales;","“PRESTACIÓN DE SERVICIOS DE APOYO PROFESIONAL AL AREA DE GESTIÓN DEL DESARROLLO EN TEMAS RELACIONADOS CON PLANEACIÓN, PARA LA PRESENTACIÓN Y SEGUIMIENTO DE PROYECTOS RELACIONADOS CON LAS ACTIVIDADES DEL TURISMO LOCAL, EN EL MARCO DE LA REACTIVACIÓN ECONÓMICA, ACOMPAÑANDO AL AREA EN PROCESOS DE REVISION Y PARTICIPACION EN COMITÉS SOBRE LA MATERIA.”","Inversión","Bogotá Mejor para Todos",45,{"$f":"IF(ISERROR(VLOOKUP(K238,Eje_Pilar_Prop!$C$2:$E$104,2,FALSE)),\" \",VLOOKUP(K238,Eje_Pilar_Prop!$C$2:$E$104,2,FALSE))","v":"Gobernanza e influencia local, regional e internacional"},{"$f":"IF(ISERROR(VLOOKUP(K238,Eje_Pilar_Prop!$C$2:$E$104,3,FALSE)),\" \",VLOOKUP(K238,Eje_Pilar_Prop!$C$2:$E$104,3,FALSE))","v":"Eje Transversal 4 Gobierno Legitimo, Fortalecimiento Local y Eficiencia"},1395,53083734,"MARIA CRISTINA BARRERA GOMEZ",4092000,null,null,0,null,4092000,0,"2020-12-02","2020-12-02","2021-01-01",30,null,null,null,null,null,null,null,null,"X",null,0,{"$f":"IF(SUMPRODUCT((A$14:A238=A238)*(B$14:B238=B238)*(D$14:D238=D238))>1,0,1)","v":1},"Contratos de prestación de servicios profesionales y de apoyo a la gestión","Contratación directa",{"$f":"IF(ISBLANK(G238),1,IFERROR(VLOOKUP(G238,Tipo!$C$12:$C$27,1,FALSE),\"NO\"))","v":"Prestación de servicios profesionales y de apoyo a la gestión, o para la ejecución de trabajos artísticos que sólo puedan encomendarse a determinadas personas naturales;"},"Inversión",{"$f":"IF(ISBLANK(K238),1,IFERROR(VLOOKUP(K238,Eje_Pilar_Prop!C214:C315,1,FALSE),\"NO\"))","v":"NO"},"SECOP II",1,"Bogotá Mejor para Todos"]
[231,2020,"SECOP II","FDLC-CPS-231-2020","Contratos de prestación de servicios profesionales y de apoyo a la gestión","Contratación directa","Prestación de servicios profesionales y de apoyo a la gestión, o para la ejecución de trabajos artísticos que sólo puedan encomendarse a determinadas personas naturales;","PRESTACION DE SERVICIOS PROFESIONALES AL ÁREA DE GESTIÓN DE DESARROLLO LOCAL DE LA ALCALDÍA LOCAL DE LA CANDELARIA PARA EL SEGUIMIENTO JURIDICO DE LOS PROYECTOS DE INFRAESTRUCTURA, ASÍ COMO LOS DEMÁS ASUNTOS CONTRACTUALES QUE SE REQUIERAN","Inversión","Bogotá Mejor para Todos",45,{"$f":"IF(ISERROR(VLOOKUP(K239,Eje_Pilar_Prop!$C$2:$E$104,2,FALSE)),\" \",VLOOKUP(K239,Eje_Pilar_Prop!$C$2:$E$104,2,FALSE))","v":"Gobernanza e influencia local, regional e internacional"},{"$f":"IF(ISERROR(VLOOKUP(K239,Eje_Pilar_Prop!$C$2:$E$104,3,FALSE)),\" \",VLOOKUP(K239,Eje_Pilar_Prop!$C$2:$E$104,3,FALSE))","v":"Eje Transversal 4 Gobierno Legitimo, Fortalecimiento Local y Eficiencia"},1395,53032699,"KAREN ANDREA SARMIENTO CAMARGO ",5390000,null,null,0,null,5390000,0,"2020-12-01","2020-12-01","2020-12-31",30,null,null,null,null,null,null,null,null,"X",null,0,{"$f":"IF(SUMPRODUCT((A$14:A239=A239)*(B$14:B239=B239)*(D$14:D239=D239))>1,0,1)","v":1},"Contratos de prestación de servicios profesionales y de apoyo a la gestión","Contratación directa",{"$f":"IF(ISBLANK(G239),1,IFERROR(VLOOKUP(G239,Tipo!$C$12:$C$27,1,FALSE),\"NO\"))","v":"Prestación de servicios profesionales y de apoyo a la gestión, o para la ejecución de trabajos artísticos que sólo puedan encomendarse a determinadas personas naturales;"},"Inversión",{"$f":"IF(ISBLANK(K239),1,IFERROR(VLOOKUP(K239,Eje_Pilar_Prop!C215:C316,1,FALSE),\"NO\"))","v":"NO"},"SECOP II",1,"Bogotá Mejor para Todos"]
[232,2020,"SECOP II","FDLC-CPS-232-2020","Contratos de prestación de servicios profesionales y de apoyo a la gestión","Contratación directa","Prestación de servicios profesionales y de apoyo a la gestión, o para la ejecución de trabajos artísticos que sólo puedan encomendarse a determinadas personas naturales;","APOYAR ADMINISTRATIVA Y ASISTENCIALMENTE A LAS INSPECCIONES DE POLICÍA DE LA LOCALIDAD","Inversión","Bogotá Mejor para Todos",45,{"$f":"IF(ISERROR(VLOOKUP(K240,Eje_Pilar_Prop!$C$2:$E$104,2,FALSE)),\" \",VLOOKUP(K240,Eje_Pilar_Prop!$C$2:$E$104,2,FALSE))","v":"Gobernanza e influencia local, regional e internacional"},{"$f":"IF(ISERROR(VLOOKUP(K240,Eje_Pilar_Prop!$C$2:$E$104,3,FALSE)),\" \",VLOOKUP(K240,Eje_Pilar_Prop!$C$2:$E$104,3,FALSE))","v":"Eje Transversal 4 Gobierno Legitimo, Fortalecimiento Local y Eficiencia"},1395,1022956077,"JARRY EMERSON RIAÑO DELGADO",1887276,null,null,1,943638,2830914,1887276,"2020-12-01","2020-12-01","2021-01-15",30,1,15,null,null,null,null,null,null,"X",null,0.66666666666666663,{"$f":"IF(SUMPRODUCT((A$14:A240=A240)*(B$14:B240=B240)*(D$14:D240=D240))>1,0,1)","v":1},"Contratos de prestación de servicios profesionales y de apoyo a la gestión","Contratación directa",{"$f":"IF(ISBLANK(G240),1,IFERROR(VLOOKUP(G240,Tipo!$C$12:$C$27,1,FALSE),\"NO\"))","v":"Prestación de servicios profesionales y de apoyo a la gestión, o para la ejecución de trabajos artísticos que sólo puedan encomendarse a determinadas personas naturales;"},"Inversión",{"$f":"IF(ISBLANK(K240),1,IFERROR(VLOOKUP(K240,Eje_Pilar_Prop!C216:C317,1,FALSE),\"NO\"))","v":"NO"},"SECOP II",1,"Bogotá Mejor para Todos"]
[233,2020,"SECOP II","FDLC-CPS-233-2020","Contratos de prestación de servicios profesionales y de apoyo a la gestión","Contratación directa","Prestación de servicios profesionales y de apoyo a la gestión, o para la ejecución de trabajos artísticos que sólo puedan encomendarse a determinadas personas naturales;","APOYAR ADMINISTRATIVA Y ASISTENCIALMENTE A LAS INSPECCIONES DE POLICÍA DE LA LOCALIDAD","Inversión","Bogotá Mejor para Todos",45,{"$f":"IF(ISERROR(VLOOKUP(K241,Eje_Pilar_Prop!$C$2:$E$104,2,FALSE)),\" \",VLOOKUP(K241,Eje_Pilar_Prop!$C$2:$E$104,2,FALSE))","v":"Gobernanza e influencia local, regional e internacional"},{"$f":"IF(ISERROR(VLOOKUP(K241,Eje_Pilar_Prop!$C$2:$E$104,3,FALSE)),\" \",VLOOKUP(K241,Eje_Pilar_Prop!$C$2:$E$104,3,FALSE))","v":"Eje Transversal 4 Gobierno Legitimo, Fortalecimiento Local y Eficiencia"},1395,80263860,"PEDRO SIERRA GARCIA",1887276,null,null,0,null,1887276,0,"2020-12-02","2020-12-02","2021-01-01",30,null,null,null,null,null,null,null,null,"X",null,0,{"$f":"IF(SUMPRODUCT((A$14:A241=A241)*(B$14:B241=B241)*(D$14:D241=D241))>1,0,1)","v":1},"Contratos de prestación de servicios profesionales y de apoyo a la gestión","Contratación directa",{"$f":"IF(ISBLANK(G241),1,IFERROR(VLOOKUP(G241,Tipo!$C$12:$C$27,1,FALSE),\"NO\"))","v":"Prestación de servicios profesionales y de apoyo a la gestión, o para la ejecución de trabajos artísticos que sólo puedan encomendarse a determinadas personas naturales;"},"Inversión",{"$f":"IF(ISBLANK(K241),1,IFERROR(VLOOKUP(K241,Eje_Pilar_Prop!C217:C318,1,FALSE),\"NO\"))","v":"NO"},"SECOP II",1,"Bogotá Mejor para Todos"]
[234,2020,"SECOP II","FDLC-CPS-234-2020","Contratos de prestación de servicios profesionales y de apoyo a la gestión","Contratación directa","Prestación de servicios profesionales y de apoyo a la gestión, o para la ejecución de trabajos artísticos que sólo puedan encomendarse a determinadas personas naturales;","PRESTAR LOS SERVICIOS DE APOYO LOGÍSTICO EN TODOS LOS EVENTOS Y ACTIVIDADES DE LA ADMINISTRACIÓN LOCAL DE LA LOCALIDAD LA CANDELARIA","Inversión","Bogotá Mejor para Todos",45,{"$f":"IF(ISERROR(VLOOKUP(K242,Eje_Pilar_Prop!$C$2:$E$104,2,FALSE)),\" \",VLOOKUP(K242,Eje_Pilar_Prop!$C$2:$E$104,2,FALSE))","v":"Gobernanza e influencia local, regional e internacional"},{"$f":"IF(ISERROR(VLOOKUP(K242,Eje_Pilar_Prop!$C$2:$E$104,3,FALSE)),\" \",VLOOKUP(K242,Eje_Pilar_Prop!$C$2:$E$104,3,FALSE))","v":"Eje Transversal 4 Gobierno Legitimo, Fortalecimiento Local y Eficiencia"},1395,65788328,"Emperatriz Gonzalez Palencia",4038000,null,null,0,null,4038000,1951700,"2020-12-02","2020-12-02","2021-02-01",60,null,null,null,null,null,null,null,null,"X",null,0.48333333333333334,{"$f":"IF(SUMPRODUCT((A$14:A242=A242)*(B$14:B242=B242)*(D$14:D242=D242))>1,0,1)","v":1},"Contratos de prestación de servicios profesionales y de apoyo a la gestión","Contratación directa",{"$f":"IF(ISBLANK(G242),1,IFERROR(VLOOKUP(G242,Tipo!$C$12:$C$27,1,FALSE),\"NO\"))","v":"Prestación de servicios profesionales y de apoyo a la gestión, o para la ejecución de trabajos artísticos que sólo puedan encomendarse a determinadas personas naturales;"},"Inversión",{"$f":"IF(ISBLANK(K242),1,IFERROR(VLOOKUP(K242,Eje_Pilar_Prop!C218:C319,1,FALSE),\"NO\"))","v":"NO"},"SECOP II",1,"Bogotá Mejor para Todos"]
[235,2020,"SECOP II","FDLC-CPS-235-2020","Contratos de prestación de servicios profesionales y de apoyo a la gestión","Contratación directa","Prestación de servicios profesionales y de apoyo a la gestión, o para la ejecución de trabajos artísticos que sólo puedan encomendarse a determinadas personas naturales;","PRESTACIÓN DE SERVICIOS PROFESIONALES AL ÁREA DE GESTIÓN DE DESARROLLO LOCAL DE LA ALCALDÍA LOCAL DE LA CANDELARIA, PARA APOYAR EL SEGUMIENTO DE LA GESTION REALIZADA Y LA EJECUCION DE PROGRAMAS SOCIALES EN LAS CASAS COMUNITARIAS DE LA LOCALIDAD","Inversión","Bogotá Mejor para Todos",45,{"$f":"IF(ISERROR(VLOOKUP(K243,Eje_Pilar_Prop!$C$2:$E$104,2,FALSE)),\" \",VLOOKUP(K243,Eje_Pilar_Prop!$C$2:$E$104,2,FALSE))","v":"Gobernanza e influencia local, regional e internacional"},{"$f":"IF(ISERROR(VLOOKUP(K243,Eje_Pilar_Prop!$C$2:$E$104,3,FALSE)),\" \",VLOOKUP(K243,Eje_Pilar_Prop!$C$2:$E$104,3,FALSE))","v":"Eje Transversal 4 Gobierno Legitimo, Fortalecimiento Local y Eficiencia"},1395,36313634,"LINA MARIA COLLAZOS BOTACHE",3863000,null,null,0,null,3863000,0,"2020-12-02","2020-12-02","2021-01-01",30,null,null,null,null,null,null,null,null,"X",null,0,{"$f":"IF(SUMPRODUCT((A$14:A243=A243)*(B$14:B243=B243)*(D$14:D243=D243))>1,0,1)","v":1},"Contratos de prestación de servicios profesionales y de apoyo a la gestión","Contratación directa",{"$f":"IF(ISBLANK(G243),1,IFERROR(VLOOKUP(G243,Tipo!$C$12:$C$27,1,FALSE),\"NO\"))","v":"Prestación de servicios profesionales y de apoyo a la gestión, o para la ejecución de trabajos artísticos que sólo puedan encomendarse a determinadas personas naturales;"},"Inversión",{"$f":"IF(ISBLANK(K243),1,IFERROR(VLOOKUP(K243,Eje_Pilar_Prop!C219:C320,1,FALSE),\"NO\"))","v":"NO"},"SECOP II",1,"Bogotá Mejor para Todos"]
[236,2020,"SECOP II","FDLC-CC-236-2020","Suministro","Contratación mínima cuantia","No aplica","SUMINISTRO DE CAJAS Y CARPETAS PARA LA ORGANIZACIÓN DEL ARCHIVO Y GESTIÓN DOCUMENTAL DEL FONDO DE DESARROLLO LOCAL DE LA CANDELARIA","Funcionamiento","Bogotá Mejor para Todos","No aplica","No Aplica","No Aplica","No Aplica",900336588,"FORMARCHIVOS Y SUMINISTROS S.A.S.",3439100,null,null,0,null,{"$f":"+Q244+S244+U244","v":3439100},null,"2020-12-02","2020-12-10","2020-12-31",30,null,null,null,null,null,null,null,null,"X",null,0,{"$f":"IF(SUMPRODUCT((A$14:A244=A244)*(B$14:B244=B244)*(D$14:D244=D244))>1,0,1)","v":1},"Suministro","Contratación mínima cuantia",{"$f":"IF(ISBLANK(G244),1,IFERROR(VLOOKUP(G244,Tipo!$C$12:$C$27,1,FALSE),\"NO\"))","v":"NO"},"Funcionamiento",{"$f":"IF(ISBLANK(K244),1,IFERROR(VLOOKUP(K244,Eje_Pilar_Prop!C220:C321,1,FALSE),\"NO\"))","v":"NO"},"SECOP II",1,"Bogotá Mejor para Todos"]
[237,2020,"SECOP II","FDLC-CPS-237-2020","Contratos de prestación de servicios profesionales y de apoyo a la gestión","Contratación directa","Prestación de servicios profesionales y de apoyo a la gestión, o para la ejecución de trabajos artísticos que sólo puedan encomendarse a determinadas personas naturales;","APOYAR TÉCNICAMENTE A LOS RESPONSABLES E INTEGRANTES DE LOS PROCESOS EN LA IMPLEMENTACIÓN DE HERRAMIENTAS DE GESTIÓN, SIGUIENDO LOS LINEAMIENTOS METODOLÓGICOS ESTABLECIDOS POR LA OFICINA ASESORA DE PLANEACIÓN DE LA SECRETARÍA DISTRITAL DE GOBIERNO","Inversión","Bogotá Mejor para Todos",45,{"$f":"IF(ISERROR(VLOOKUP(K245,Eje_Pilar_Prop!$C$2:$E$104,2,FALSE)),\" \",VLOOKUP(K245,Eje_Pilar_Prop!$C$2:$E$104,2,FALSE))","v":"Gobernanza e influencia local, regional e internacional"},{"$f":"IF(ISERROR(VLOOKUP(K245,Eje_Pilar_Prop!$C$2:$E$104,3,FALSE)),\" \",VLOOKUP(K245,Eje_Pilar_Prop!$C$2:$E$104,3,FALSE))","v":"Eje Transversal 4 Gobierno Legitimo, Fortalecimiento Local y Eficiencia"},1395,1026266066,"KATHERIN JOHANA MORENO CASTAÑEDA",4204676,null,null,1,2102338,6307014,3924364,"2020-12-03","2020-12-03","2021-01-17",30,1,15,null,null,null,null,null,null,"X",null,0.62222217994125273,{"$f":"IF(SUMPRODUCT((A$14:A245=A245)*(B$14:B245=B245)*(D$14:D245=D245))>1,0,1)","v":1},"Contratos de prestación de servicios profesionales y de apoyo a la gestión","Contratación directa",{"$f":"IF(ISBLANK(G245),1,IFERROR(VLOOKUP(G245,Tipo!$C$12:$C$27,1,FALSE),\"NO\"))","v":"Prestación de servicios profesionales y de apoyo a la gestión, o para la ejecución de trabajos artísticos que sólo puedan encomendarse a determinadas personas naturales;"},"Inversión",{"$f":"IF(ISBLANK(K245),1,IFERROR(VLOOKUP(K245,Eje_Pilar_Prop!C221:C322,1,FALSE),\"NO\"))","v":"NO"},"SECOP II",1,"Bogotá Mejor para Todos"]
[238,2020,"SECOP II","FDLC-CPS-238-2020","Contratos de prestación de servicios profesionales y de apoyo a la gestión","Contratación directa","Prestación de servicios profesionales y de apoyo a la gestión, o para la ejecución de trabajos artísticos que sólo puedan encomendarse a determinadas personas naturales;","PRESTAR LOS SERVICIOS DE APOYO AL DESPACHO DE LA ALCALDÍA DE LA CANDELARIA, EN EL DESARROLLO DE ACTIVIDADES Y TRÁMITES DE CARÁCTER OPERATIVO Y LOGÍSTICO PARA EL BUEN FUNCIONAMIENTO DE LA DEPENDENCIA","Inversión","Bogotá Mejor para Todos",45,{"$f":"IF(ISERROR(VLOOKUP(K246,Eje_Pilar_Prop!$C$2:$E$104,2,FALSE)),\" \",VLOOKUP(K246,Eje_Pilar_Prop!$C$2:$E$104,2,FALSE))","v":"Gobernanza e influencia local, regional e internacional"},{"$f":"IF(ISERROR(VLOOKUP(K246,Eje_Pilar_Prop!$C$2:$E$104,3,FALSE)),\" \",VLOOKUP(K246,Eje_Pilar_Prop!$C$2:$E$104,3,FALSE))","v":"Eje Transversal 4 Gobierno Legitimo, Fortalecimiento Local y Eficiencia"},1395,1010190450,"VIVIANA LIZETH MONROY RAMIREZ",2632500,null,null,0,null,2632500,1404000,"2020-12-07","2020-12-07","2021-01-21",45,null,null,null,null,null,null,null,null,"X",null,0.53333333333333333,{"$f":"IF(SUMPRODUCT((A$14:A246=A246)*(B$14:B246=B246)*(D$14:D246=D246))>1,0,1)","v":1},"Contratos de prestación de servicios profesionales y de apoyo a la gestión","Contratación directa",{"$f":"IF(ISBLANK(G246),1,IFERROR(VLOOKUP(G246,Tipo!$C$12:$C$27,1,FALSE),\"NO\"))","v":"Prestación de servicios profesionales y de apoyo a la gestión, o para la ejecución de trabajos artísticos que sólo puedan encomendarse a determinadas personas naturales;"},"Inversión",{"$f":"IF(ISBLANK(K246),1,IFERROR(VLOOKUP(K246,Eje_Pilar_Prop!C222:C323,1,FALSE),\"NO\"))","v":"NO"},"SECOP II",1,"Bogotá Mejor para Todos"]
[239,2020,"SECOP II","FDLC-IMC-021-2020","Compraventa de bienes muebles","Contratación mínima cuantia","No aplica","“ADQUISICIÓN DE CONSUMIBLES DE IMPRESIÓN PARA LAS IMPRESORAS DE PROPIEDAD DEL FONDO DE DESARROLLO LOCAL DE LA CANDELARIA","Funcionamiento","Bogotá Mejor para Todos","No aplica","No Aplica","No Aplica","No Aplica","800.209.890-1","COMERCIALIZADORA VINARTA S.A.S.",20798840,null,null,0,null,20798840,null,"2020-12-11","2020-12-11","2020-12-31",20,null,null,null,null,null,null,null,null,"X",null,0,{"$f":"IF(SUMPRODUCT((A$14:A247=A247)*(B$14:B247=B247)*(D$14:D247=D247))>1,0,1)","v":1},"Compraventa de bienes muebles","Contratación mínima cuantia",{"$f":"IF(ISBLANK(G247),1,IFERROR(VLOOKUP(G247,Tipo!$C$12:$C$27,1,FALSE),\"NO\"))","v":"NO"},"Funcionamiento",{"$f":"IF(ISBLANK(K247),1,IFERROR(VLOOKUP(K247,Eje_Pilar_Prop!C223:C324,1,FALSE),\"NO\"))","v":"NO"},"SECOP II",1,"Bogotá Mejor para Todos"]
[240,2020,"SECOP II","FDLC-IMC-020-2020","Contratos de prestación de servicios profesionales y de apoyo a la gestión","Contratación directa","No aplica","Prestación de servicios para realizar las actividades propuestas por la red de mujeres productoras y emprendedoras de la candelaria, en pro de la visibilización y protección de los derechos de las mujeres candelaria","Inversión","Bogotá Mejor para Todos",45,{"$f":"IF(ISERROR(VLOOKUP(K248,Eje_Pilar_Prop!$C$2:$E$104,2,FALSE)),\" \",VLOOKUP(K248,Eje_Pilar_Prop!$C$2:$E$104,2,FALSE))","v":"Gobernanza e influencia local, regional e internacional"},{"$f":"IF(ISERROR(VLOOKUP(K248,Eje_Pilar_Prop!$C$2:$E$104,3,FALSE)),\" \",VLOOKUP(K248,Eje_Pilar_Prop!$C$2:$E$104,3,FALSE))","v":"Eje Transversal 4 Gobierno Legitimo, Fortalecimiento Local y Eficiencia"},1396,"901.204.995-8","AKRE PRODUCCIONES SAS",9037900,null,null,0,null,9037900,0,"2020-12-14","2020-12-18","2021-02-17",60,null,null,null,null,null,null,null,"X",null,null,0,{"$f":"IF(SUMPRODUCT((A$14:A248=A248)*(B$14:B248=B248)*(D$14:D248=D248))>1,0,1)","v":1},"Contratos de prestación de servicios profesionales y de apoyo a la gestión","Contratación directa",{"$f":"IF(ISBLANK(G248),1,IFERROR(VLOOKUP(G248,Tipo!$C$12:$C$27,1,FALSE),\"NO\"))","v":"NO"},"Inversión",{"$f":"IF(ISBLANK(K248),1,IFERROR(VLOOKUP(K248,Eje_Pilar_Prop!C224:C325,1,FALSE),\"NO\"))","v":"NO"},"SECOP II",1,"Bogotá Mejor para Todos"]
[241,2020,"SECOP II","FDLC-CPS-241-2020","Contratos de prestación de servicios profesionales y de apoyo a la gestión","Contratación directa","Prestación de servicios profesionales y de apoyo a la gestión, o para la ejecución de trabajos artísticos que sólo puedan encomendarse a determinadas personas naturales;","PRESTACIÓN DE SERVICIOS DE APOYO TÉCNICO EN LA ADMINISTRACIÓN DE LAS CASAS COMUNITARIAS DE LA LOCALIDAD DE LA CANDELARIA DE CONFORMIDAD CON EL ACUERDO LOCAL 006 DE 2013","Inversión","Bogotá Mejor para Todos",45,{"$f":"IF(ISERROR(VLOOKUP(K249,Eje_Pilar_Prop!$C$2:$E$104,2,FALSE)),\" \",VLOOKUP(K249,Eje_Pilar_Prop!$C$2:$E$104,2,FALSE))","v":"Gobernanza e influencia local, regional e internacional"},{"$f":"IF(ISERROR(VLOOKUP(K249,Eje_Pilar_Prop!$C$2:$E$104,3,FALSE)),\" \",VLOOKUP(K249,Eje_Pilar_Prop!$C$2:$E$104,3,FALSE))","v":"Eje Transversal 4 Gobierno Legitimo, Fortalecimiento Local y Eficiencia"},1395,52219649,"INDIRA BETANCOURT MACUASE",5794000,null,null,0,null,5794000,1448500,"2020-12-16","2020-12-16","2021-02-04",50,null,null,null,null,null,null,null,null,"X",null,0.25,{"$f":"IF(SUMPRODUCT((A$14:A249=A249)*(B$14:B249=B249)*(D$14:D249=D249))>1,0,1)","v":1},"Contratos de prestación de servicios profesionales y de apoyo a la gestión","Contratación directa",{"$f":"IF(ISBLANK(G249),1,IFERROR(VLOOKUP(G249,Tipo!$C$12:$C$27,1,FALSE),\"NO\"))","v":"Prestación de servicios profesionales y de apoyo a la gestión, o para la ejecución de trabajos artísticos que sólo puedan encomendarse a determinadas personas naturales;"},"Inversión",{"$f":"IF(ISBLANK(K249),1,IFERROR(VLOOKUP(K249,Eje_Pilar_Prop!C225:C326,1,FALSE),\"NO\"))","v":"NO"},"SECOP II",1,"Bogotá Mejor para Todos"]
[242,2020,"SECOP II","FDLC-CPS-242-2020","Contratos de prestación de servicios profesionales y de apoyo a la gestión","Contratación directa","Prestación de servicios profesionales y de apoyo a la gestión, o para la ejecución de trabajos artísticos que sólo puedan encomendarse a determinadas personas naturales;","PRESTACIÓN DE SERVICIOS DE APOYO TÉCNICO EN LA ADMINISTRACIÓN DE LAS CASAS COMUNITARIAS DE LA LOCALIDAD DE LA CANDELARIA DE CONFORMIDAD CON EL ACUERDO LOCAL 006 DE 2013","Inversión","Bogotá Mejor para Todos",45,{"$f":"IF(ISERROR(VLOOKUP(K250,Eje_Pilar_Prop!$C$2:$E$104,2,FALSE)),\" \",VLOOKUP(K250,Eje_Pilar_Prop!$C$2:$E$104,2,FALSE))","v":"Gobernanza e influencia local, regional e internacional"},{"$f":"IF(ISERROR(VLOOKUP(K250,Eje_Pilar_Prop!$C$2:$E$104,3,FALSE)),\" \",VLOOKUP(K250,Eje_Pilar_Prop!$C$2:$E$104,3,FALSE))","v":"Eje Transversal 4 Gobierno Legitimo, Fortalecimiento Local y Eficiencia"},1395,51653505,"DORA CECILIA JIMENEZ MORENO",5794000,null,null,0,null,5794000,1448500,"2020-12-16","2020-12-16","2021-02-04",50,null,null,null,null,null,null,null,null,"X",null,0.25,{"$f":"IF(SUMPRODUCT((A$14:A250=A250)*(B$14:B250=B250)*(D$14:D250=D250))>1,0,1)","v":1},"Contratos de prestación de servicios profesionales y de apoyo a la gestión","Contratación directa",{"$f":"IF(ISBLANK(G250),1,IFERROR(VLOOKUP(G250,Tipo!$C$12:$C$27,1,FALSE),\"NO\"))","v":"Prestación de servicios profesionales y de apoyo a la gestión, o para la ejecución de trabajos artísticos que sólo puedan encomendarse a determinadas personas naturales;"},"Inversión",{"$f":"IF(ISBLANK(K250),1,IFERROR(VLOOKUP(K250,Eje_Pilar_Prop!C226:C327,1,FALSE),\"NO\"))","v":"NO"},"SECOP II",1,"Bogotá Mejor para Todos"]
[243,2020,"SECOP II","FDLC-CPS-243-2020","Contratos de prestación de servicios profesionales y de apoyo a la gestión","Contratación directa","Prestación de servicios profesionales y de apoyo a la gestión, o para la ejecución de trabajos artísticos que sólo puedan encomendarse a determinadas personas naturales;","PRESTAR SERVICIOS DE APOYO COMO CONDUCTOR DE LOS VEHICULOS QUE SE ENCUENTRAN A CARGO DEL FONDO DE DESARROLLO LOCAL LA CANDELARIA","Inversión","Bogotá Mejor para Todos",45,{"$f":"IF(ISERROR(VLOOKUP(K251,Eje_Pilar_Prop!$C$2:$E$104,2,FALSE)),\" \",VLOOKUP(K251,Eje_Pilar_Prop!$C$2:$E$104,2,FALSE))","v":"Gobernanza e influencia local, regional e internacional"},{"$f":"IF(ISERROR(VLOOKUP(K251,Eje_Pilar_Prop!$C$2:$E$104,3,FALSE)),\" \",VLOOKUP(K251,Eje_Pilar_Prop!$C$2:$E$104,3,FALSE))","v":"Eje Transversal 4 Gobierno Legitimo, Fortalecimiento Local y Eficiencia"},1395,79381970,"FERNANDO FORERO BRESNEIDER",6200000,null,null,0,null,6200000,0,"2020-12-16","2020-12-16","2021-02-09",55,null,null,null,null,null,null,null,null,"X",null,0,{"$f":"IF(SUMPRODUCT((A$14:A251=A251)*(B$14:B251=B251)*(D$14:D251=D251))>1,0,1)","v":1},"Contratos de prestación de servicios profesionales y de apoyo a la gestión","Contratación directa",{"$f":"IF(ISBLANK(G251),1,IFERROR(VLOOKUP(G251,Tipo!$C$12:$C$27,1,FALSE),\"NO\"))","v":"Prestación de servicios profesionales y de apoyo a la gestión, o para la ejecución de trabajos artísticos que sólo puedan encomendarse a determinadas personas naturales;"},"Inversión",{"$f":"IF(ISBLANK(K251),1,IFERROR(VLOOKUP(K251,Eje_Pilar_Prop!C227:C328,1,FALSE),\"NO\"))","v":"NO"},"SECOP II",1,"Bogotá Mejor para Todos"]
[244,2020,"SECOP II","FDLC-CPS-244-2020","Contratos de prestación de servicios profesionales y de apoyo a la gestión","Contratación directa","Prestación de servicios profesionales y de apoyo a la gestión, o para la ejecución de trabajos artísticos que sólo puedan encomendarse a determinadas personas naturales;","PRESTAR LOS SERVICIOS DE APOYO LOGÍSTICO EN TODOS LOS EVENTOS Y ACTIVIDADES DE LA ADMINISTRACIÓN LOCAL DE LA LOCALIDAD 17 DE LA CANDELARIA","Inversión","Bogotá Mejor para Todos",45,{"$f":"IF(ISERROR(VLOOKUP(K252,Eje_Pilar_Prop!$C$2:$E$104,2,FALSE)),\" \",VLOOKUP(K252,Eje_Pilar_Prop!$C$2:$E$104,2,FALSE))","v":"Gobernanza e influencia local, regional e internacional"},{"$f":"IF(ISERROR(VLOOKUP(K252,Eje_Pilar_Prop!$C$2:$E$104,3,FALSE)),\" \",VLOOKUP(K252,Eje_Pilar_Prop!$C$2:$E$104,3,FALSE))","v":"Eje Transversal 4 Gobierno Legitimo, Fortalecimiento Local y Eficiencia"},1395,1085280532,"DEIVIS ARAVIT GORDILLO GUTIERREZ",4038000,null,null,0,null,4038000,0,"2020-12-24","2020-12-24","2021-02-12",50,null,null,null,null,null,null,null,null,"X",null,0,{"$f":"IF(SUMPRODUCT((A$14:A252=A252)*(B$14:B252=B252)*(D$14:D252=D252))>1,0,1)","v":1},"Contratos de prestación de servicios profesionales y de apoyo a la gestión","Contratación directa",{"$f":"IF(ISBLANK(G252),1,IFERROR(VLOOKUP(G252,Tipo!$C$12:$C$27,1,FALSE),\"NO\"))","v":"Prestación de servicios profesionales y de apoyo a la gestión, o para la ejecución de trabajos artísticos que sólo puedan encomendarse a determinadas personas naturales;"},"Inversión",{"$f":"IF(ISBLANK(K252),1,IFERROR(VLOOKUP(K252,Eje_Pilar_Prop!C228:C329,1,FALSE),\"NO\"))","v":"NO"},"SECOP II",1,"Bogotá Mejor para Todos"]
[245,2020,"SECOP II","FDLC-CI-245-2020","Contratos de prestación de servicios","Contratación directa","Contratos interadministrativos","Aunar esfuerzos técnicos, administrativos y financieros, para promover el ejercicio y la restitución de la autonomía e inclusión social de las personas con discapacidad (PcD) por medio del otorgamiento de DISPOSITIVOS DE ASISTENCIA PERSONAL ayudas técnicas desde una perspectiva de derechos humanos que permitan la inclusión social en las diferentes acciones de la vida cotidiana","Inversión","Bogotá Mejor para Todos",3,{"$f":"IF(ISERROR(VLOOKUP(K253,Eje_Pilar_Prop!$C$2:$E$104,2,FALSE)),\" \",VLOOKUP(K253,Eje_Pilar_Prop!$C$2:$E$104,2,FALSE))","v":"Igualdad y autonomía para una Bogotá incluyente"},{"$f":"IF(ISERROR(VLOOKUP(K253,Eje_Pilar_Prop!$C$2:$E$104,3,FALSE)),\" \",VLOOKUP(K253,Eje_Pilar_Prop!$C$2:$E$104,3,FALSE))","v":"Pilar 1 Igualdad de Calidad de Vida"},1387,900959051,"SUBRED INTEGRADA DE SERVICIOS DE SALUD CENTRO ORIENTE",58000000,null,null,null,null,58000000,0,"2020-12-31","2020-12-31","30/06/2021 ",180,null,null,null,null,null,null,null,"X",null,null,0,{"$f":"IF(SUMPRODUCT((A$14:A253=A253)*(B$14:B253=B253)*(D$14:D253=D253))>1,0,1)","v":1},"Contratos de prestación de servicios","Contratación directa",{"$f":"IF(ISBLANK(G253),1,IFERROR(VLOOKUP(G253,Tipo!$C$12:$C$27,1,FALSE),\"NO\"))","v":"Contratos interadministrativos"},"Inversión",{"$f":"IF(ISBLANK(K253),1,IFERROR(VLOOKUP(K253,Eje_Pilar_Prop!C229:C330,1,FALSE),\"NO\"))","v":"NO"},"SECOP II",1,"Bogotá Mejor para Todos"]
[246,2020,"SECOP II","FDLC-IMC-019-2020","Suministro","Contratación mínima cuantia","Prestación de servicios profesionales y de apoyo a la gestión, o para la ejecución de trabajos artísticos que sólo puedan encomendarse a determinadas personas naturales;","REALIZAR A MONTO AGOTABLE, EL SUMINISTRO DE MATERIALES Y REPUESTOS DE FERRETERÍA SEGÚN LAS ESPECIFICACIONES Y REQUERIMIENTOS TÉCNICOS PARA EL MANTENIMIENTO PREVENTIVO Y CORRECTIVO DE LOS INMUEBLES PROPIEDAD DEL FONDO DE DESARROLLO LOCAL DE LA CANDELARIA","Funcionamiento","Bogotá Mejor para Todos","No aplica","No Aplica","No Aplica","No Aplica","830.073.899-8","COMERCIALIZADORA ELECTROCON SAS",17000000,null,null,null,null,17000000,0,"2020-12-31","2020-12-31","2021-08-30",240,null,null,null,null,null,null,null,"X",null,null,0,{"$f":"IF(SUMPRODUCT((A$14:A254=A254)*(B$14:B254=B254)*(D$14:D254=D254))>1,0,1)","v":1}]
[1,2020,"N/A","N/A","Otros gastos",null,"No aplica","V/R. DE LA ARL DE LOS CONTRATISTAS A CARGO DE LA ALCALDÍA LOCAL DE LA CANDELARIA CON RIESGO 4 Y 5.","Inversión","Bogotá Mejor para Todos",19,{"$f":"IF(ISERROR(VLOOKUP(K255,Eje_Pilar_Prop!$C$2:$E$104,2,FALSE)),\" \",VLOOKUP(K255,Eje_Pilar_Prop!$C$2:$E$104,2,FALSE))","v":"Seguridad y convivencia para todos"},{"$f":"IF(ISERROR(VLOOKUP(K255,Eje_Pilar_Prop!$C$2:$E$104,3,FALSE)),\" \",VLOOKUP(K255,Eje_Pilar_Prop!$C$2:$E$104,3,FALSE))","v":"Pilar 3 Construcción de Comunidad y Cultura Ciudadana"},1392,860011153,"POSITIVA COMPAÑIA DE SEGUROS SA",611000,null,null,null,null,611000,611000,"2020-02-06","2020-02-06","2020-02-06",null,null,null,null,null,null,null,null,null,null,null,1,{"$f":"IF(SUMPRODUCT((A$14:A255=A255)*(B$14:B255=B255)*(D$14:D255=D255))>1,0,1)","v":1},{"$f":"IF(ISBLANK(#REF!),1,IFERROR(VLOOKUP(#REF!,tipo,1,FALSE),\"NO\"))","v":"NO"},{"$f":"IF(ISBLANK(#REF!),1,IFERROR(VLOOKUP(#REF!,modal,1,FALSE),\"NO\"))","v":"NO"},{"$f":"IF(ISBLANK(#REF!),1,IFERROR(VLOOKUP(#REF!,Tipo!$C$12:$C$27,1,FALSE),\"NO\"))","v":"NO"},{"$f":"IF(ISBLANK(#REF!),1,IFERROR(VLOOKUP(#REF!,afectacion,1,FALSE),\"NO\"))","v":"NO"},{"$f":"IF(ISBLANK(#REF!),1,IFERROR(VLOOKUP(#REF!,Eje_Pilar_Prop!C230:C331,1,FALSE),\"NO\"))","v":"NO"},{"$f":"IF(ISBLANK(#REF!),1,IFERROR(VLOOKUP(#REF!,SECOP,1,FALSE),\"NO\"))","v":"NO"},1,{"$f":"IF(ISBLANK(#REF!),1,IFERROR(VLOOKUP(#REF!,pdd,1,FALSE),\"NO\"))","v":"NO"}]
[1,2020,"N/A","N/A","Otros gastos",null,"No aplica","V/R. DE LA ARL DE LOS CONTRATISTAS A CARGO DE LA ALCALDÍA LOCAL DE LA CANDELARIA CON RIESGO 4 Y 5.","Inversión","Bogotá Mejor para Todos",45,{"$f":"IF(ISERROR(VLOOKUP(K256,Eje_Pilar_Prop!$C$2:$E$104,2,FALSE)),\" \",VLOOKUP(K256,Eje_Pilar_Prop!$C$2:$E$104,2,FALSE))","v":"Gobernanza e influencia local, regional e internacional"},{"$f":"IF(ISERROR(VLOOKUP(K256,Eje_Pilar_Prop!$C$2:$E$104,3,FALSE)),\" \",VLOOKUP(K256,Eje_Pilar_Prop!$C$2:$E$104,3,FALSE))","v":"Eje Transversal 4 Gobierno Legitimo, Fortalecimiento Local y Eficiencia"},1395,860011153,"POSITIVA COMPAÑIA DE SEGUROS SA",602400,null,null,null,null,{"$f":"+Q256+S256+U256","v":602400},602400,"2020-02-06","2020-02-06","2020-02-06",null,null,null,null,null,null,null,null,null,null,null,1,{"$f":"IF(SUMPRODUCT((A$14:A256=A256)*(B$14:B256=B256)*(D$14:D256=D256))>1,0,1)","v":0},{"$f":"IF(ISBLANK(#REF!),1,IFERROR(VLOOKUP(#REF!,tipo,1,FALSE),\"NO\"))","v":"NO"},{"$f":"IF(ISBLANK(#REF!),1,IFERROR(VLOOKUP(#REF!,modal,1,FALSE),\"NO\"))","v":"NO"},{"$f":"IF(ISBLANK(#REF!),1,IFERROR(VLOOKUP(#REF!,Tipo!$C$12:$C$27,1,FALSE),\"NO\"))","v":"NO"},{"$f":"IF(ISBLANK(#REF!),1,IFERROR(VLOOKUP(#REF!,afectacion,1,FALSE),\"NO\"))","v":"NO"},{"$f":"IF(ISBLANK(#REF!),1,IFERROR(VLOOKUP(#REF!,Eje_Pilar_Prop!C231:C332,1,FALSE),\"NO\"))","v":"NO"},{"$f":"IF(ISBLANK(#REF!),1,IFERROR(VLOOKUP(#REF!,SECOP,1,FALSE),\"NO\"))","v":"NO"},1,{"$f":"IF(ISBLANK(#REF!),1,IFERROR(VLOOKUP(#REF!,pdd,1,FALSE),\"NO\"))","v":"NO"}]
[4,2020,"N/A","N/A","Otros gastos",null,"No aplica","V/R. DE LA ARL DE LOS CONTRATISTAS A CARGO DE LA ALCALDIA LOCAL DE LA CANDELARIA.","Inversión","Bogotá Mejor para Todos",45,{"$f":"IF(ISERROR(VLOOKUP(K257,Eje_Pilar_Prop!$C$2:$E$104,2,FALSE)),\" \",VLOOKUP(K257,Eje_Pilar_Prop!$C$2:$E$104,2,FALSE))","v":"Gobernanza e influencia local, regional e internacional"},{"$f":"IF(ISERROR(VLOOKUP(K257,Eje_Pilar_Prop!$C$2:$E$104,3,FALSE)),\" \",VLOOKUP(K257,Eje_Pilar_Prop!$C$2:$E$104,3,FALSE))","v":"Eje Transversal 4 Gobierno Legitimo, Fortalecimiento Local y Eficiencia"},1395,860011153,"POSITIVA COMPAÑIA DE SEGUROS SA",760700,null,null,null,null,760700,760700,"2020-05-14","2020-05-14","2020-05-14",null,null,null,null,null,null,null,null,null,null,null,1,{"$f":"IF(SUMPRODUCT((A$14:A257=A257)*(B$14:B257=B257)*(D$14:D257=D257))>1,0,1)","v":1},{"$f":"IF(ISBLANK(#REF!),1,IFERROR(VLOOKUP(#REF!,tipo,1,FALSE),\"NO\"))","v":"NO"},{"$f":"IF(ISBLANK(#REF!),1,IFERROR(VLOOKUP(#REF!,modal,1,FALSE),\"NO\"))","v":"NO"},{"$f":"IF(ISBLANK(#REF!),1,IFERROR(VLOOKUP(#REF!,Tipo!$C$12:$C$27,1,FALSE),\"NO\"))","v":"NO"},{"$f":"IF(ISBLANK(#REF!),1,IFERROR(VLOOKUP(#REF!,afectacion,1,FALSE),\"NO\"))","v":"NO"},{"$f":"IF(ISBLANK(#REF!),1,IFERROR(VLOOKUP(#REF!,Eje_Pilar_Prop!C232:C333,1,FALSE),\"NO\"))","v":"NO"},{"$f":"IF(ISBLANK(#REF!),1,IFERROR(VLOOKUP(#REF!,SECOP,1,FALSE),\"NO\"))","v":"NO"},1,{"$f":"IF(ISBLANK(#REF!),1,IFERROR(VLOOKUP(#REF!,pdd,1,FALSE),\"NO\"))","v":"NO"}]
[7,2020,"N/A","96 N/A Acto Administrativo (Resolución, Decreto, Acuerdo, etc.)","Otros gastos","No aplica","No aplica","Ordenación de gasto y pago de apoyo económico Tipo C.","Inversión","Bogotá Mejor para Todos",3,{"$f":"IF(ISERROR(VLOOKUP(K258,Eje_Pilar_Prop!$C$2:$E$104,2,FALSE)),\" \",VLOOKUP(K258,Eje_Pilar_Prop!$C$2:$E$104,2,FALSE))","v":"Igualdad y autonomía para una Bogotá incluyente"},{"$f":"IF(ISERROR(VLOOKUP(K258,Eje_Pilar_Prop!$C$2:$E$104,3,FALSE)),\" \",VLOOKUP(K258,Eje_Pilar_Prop!$C$2:$E$104,3,FALSE))","v":"Pilar 1 Igualdad de Calidad de Vida"},1386,860066942,"CAJA DE COMPENSACION FAMILIAR - COMPENSAR",647425000,null,null,null,null,{"$f":"+Q258+S258+U258","v":647425000},559625000,"2020-01-31","2020-01-31","2020-01-31",null,null,null,null,null,null,null,null,null,null,null,0.86438583619724296,{"$f":"IF(SUMPRODUCT((A$14:A258=A258)*(B$14:B258=B258)*(D$14:D258=D258))>1,0,1)","v":1},{"$f":"IF(ISBLANK(#REF!),1,IFERROR(VLOOKUP(#REF!,tipo,1,FALSE),\"NO\"))","v":"NO"},{"$f":"IF(ISBLANK(#REF!),1,IFERROR(VLOOKUP(#REF!,modal,1,FALSE),\"NO\"))","v":"NO"},{"$f":"IF(ISBLANK(#REF!),1,IFERROR(VLOOKUP(#REF!,Tipo!$C$12:$C$27,1,FALSE),\"NO\"))","v":"NO"},{"$f":"IF(ISBLANK(#REF!),1,IFERROR(VLOOKUP(#REF!,afectacion,1,FALSE),\"NO\"))","v":"NO"},{"$f":"IF(ISBLANK(#REF!),1,IFERROR(VLOOKUP(#REF!,Eje_Pilar_Prop!C233:C334,1,FALSE),\"NO\"))","v":"NO"},{"$f":"IF(ISBLANK(#REF!),1,IFERROR(VLOOKUP(#REF!,SECOP,1,FALSE),\"NO\"))","v":"NO"},1,{"$f":"IF(ISBLANK(#REF!),1,IFERROR(VLOOKUP(#REF!,pdd,1,FALSE),\"NO\"))","v":"NO"}]
[8,2020,"N/A","96 N/A Acto Administrativo (Resolución, Decreto, Acuerdo, etc.)","Otros gastos","No aplica","No aplica","Pago de costos operativos - del subsidio Tipo C.","Inversión","Bogotá Mejor para Todos",3,{"$f":"IF(ISERROR(VLOOKUP(K259,Eje_Pilar_Prop!$C$2:$E$104,2,FALSE)),\" \",VLOOKUP(K259,Eje_Pilar_Prop!$C$2:$E$104,2,FALSE))","v":"Igualdad y autonomía para una Bogotá incluyente"},{"$f":"IF(ISERROR(VLOOKUP(K259,Eje_Pilar_Prop!$C$2:$E$104,3,FALSE)),\" \",VLOOKUP(K259,Eje_Pilar_Prop!$C$2:$E$104,3,FALSE))","v":"Pilar 1 Igualdad de Calidad de Vida"},1386,860066942,"CAJA DE COMPENSACION FAMILIAR - COMPENSAR",9170045,null,null,null,null,9170045,3463968,"2020-01-31","2020-01-31","2020-01-31",null,null,null,null,null,null,null,null,null,null,null,0.37774820079945082,{"$f":"IF(SUMPRODUCT((A$14:A259=A259)*(B$14:B259=B259)*(D$14:D259=D259))>1,0,1)","v":1},{"$f":"IF(ISBLANK(#REF!),1,IFERROR(VLOOKUP(#REF!,tipo,1,FALSE),\"NO\"))","v":"NO"},{"$f":"IF(ISBLANK(#REF!),1,IFERROR(VLOOKUP(#REF!,modal,1,FALSE),\"NO\"))","v":"NO"},{"$f":"IF(ISBLANK(#REF!),1,IFERROR(VLOOKUP(#REF!,Tipo!$C$12:$C$27,1,FALSE),\"NO\"))","v":"NO"},{"$f":"IF(ISBLANK(#REF!),1,IFERROR(VLOOKUP(#REF!,afectacion,1,FALSE),\"NO\"))","v":"NO"},{"$f":"IF(ISBLANK(#REF!),1,IFERROR(VLOOKUP(#REF!,Eje_Pilar_Prop!C234:C335,1,FALSE),\"NO\"))","v":"NO"},{"$f":"IF(ISBLANK(#REF!),1,IFERROR(VLOOKUP(#REF!,SECOP,1,FALSE),\"NO\"))","v":"NO"},1,{"$f":"IF(ISBLANK(#REF!),1,IFERROR(VLOOKUP(#REF!,pdd,1,FALSE),\"NO\"))","v":"NO"}]
[38,2020,"N/A","96 N/A Acto Administrativo (Resolución, Decreto, Acuerdo, etc.)","Otros gastos","No aplica","No aplica","AUTORIZAR LA TRANSFERENCIA DE RECURSOS CON DESTINO A LA DIRECCIÓN DISTRITAL DE TESORERÍA PARA ATENDER EL CANAL DE TRANSFERENCIAS MONETARIAS¿","Inversión","Bogotá Mejor para Todos",3,{"$f":"IF(ISERROR(VLOOKUP(K260,Eje_Pilar_Prop!$C$2:$E$104,2,FALSE)),\" \",VLOOKUP(K260,Eje_Pilar_Prop!$C$2:$E$104,2,FALSE))","v":"Igualdad y autonomía para una Bogotá incluyente"},{"$f":"IF(ISERROR(VLOOKUP(K260,Eje_Pilar_Prop!$C$2:$E$104,3,FALSE)),\" \",VLOOKUP(K260,Eje_Pilar_Prop!$C$2:$E$104,3,FALSE))","v":"Pilar 1 Igualdad de Calidad de Vida"},1386,null,"FONDO DE DESARROLLO LOCAL DE LA CANDELARIA",277279252,null,null,null,null,277279252,277279252,"2020-06-12","2020-06-12","2020-06-12",null,null,null,null,null,null,null,null,null,null,null,1,{"$f":"IF(SUMPRODUCT((A$14:A260=A260)*(B$14:B260=B260)*(D$14:D260=D260))>1,0,1)","v":1},{"$f":"IF(ISBLANK(#REF!),1,IFERROR(VLOOKUP(#REF!,tipo,1,FALSE),\"NO\"))","v":"NO"},{"$f":"IF(ISBLANK(#REF!),1,IFERROR(VLOOKUP(#REF!,modal,1,FALSE),\"NO\"))","v":"NO"},{"$f":"IF(ISBLANK(#REF!),1,IFERROR(VLOOKUP(#REF!,Tipo!$C$12:$C$27,1,FALSE),\"NO\"))","v":"NO"},{"$f":"IF(ISBLANK(#REF!),1,IFERROR(VLOOKUP(#REF!,afectacion,1,FALSE),\"NO\"))","v":"NO"},{"$f":"IF(ISBLANK(#REF!),1,IFERROR(VLOOKUP(#REF!,Eje_Pilar_Prop!C235:C336,1,FALSE),\"NO\"))","v":"NO"},{"$f":"IF(ISBLANK(#REF!),1,IFERROR(VLOOKUP(#REF!,SECOP,1,FALSE),\"NO\"))","v":"NO"},1,{"$f":"IF(ISBLANK(#REF!),1,IFERROR(VLOOKUP(#REF!,pdd,1,FALSE),\"NO\"))","v":"NO"}]
[77,2020,"N/A","N/A","Otros gastos",null,"No aplica","CAUSAR Y ORDENAR EL PAGO POR CONCEPTO DE COTIZACION AL SISTEMA DE RIESGOS LABORALES DE LOS CONTRATISTAS VINCULADOS CON EL FONDO DE DESARROLLOLOCAL DE LA CANDELARIA PERSONAL CONTRATISTA PRESTADOR DE SERVICIOSCUYASACTIVIDADES ESTÁN CLASIFICADAS EN EL NIVEL D⤃㭱컨ש픀ש挖\u0005","Inversión","Bogotá Mejor para Todos",19,{"$f":"IF(ISERROR(VLOOKUP(K261,Eje_Pilar_Prop!$C$2:$E$104,2,FALSE)),\" \",VLOOKUP(K261,Eje_Pilar_Prop!$C$2:$E$104,2,FALSE))","v":"Seguridad y convivencia para todos"},{"$f":"IF(ISERROR(VLOOKUP(K261,Eje_Pilar_Prop!$C$2:$E$104,3,FALSE)),\" \",VLOOKUP(K261,Eje_Pilar_Prop!$C$2:$E$104,3,FALSE))","v":"Pilar 3 Construcción de Comunidad y Cultura Ciudadana"},1392,860011153,"POSITIVA COMPAÑIA DE SEGUROS SA",2630800,null,null,null,null,2630800,2630800,"2020-12-30","2020-12-30","2020-12-30",null,null,null,null,null,null,null,null,null,null,null,1,{"$f":"IF(SUMPRODUCT((A$14:A261=A261)*(B$14:B261=B261)*(D$14:D261=D261))>1,0,1)","v":1},{"$f":"IF(ISBLANK(#REF!),1,IFERROR(VLOOKUP(#REF!,tipo,1,FALSE),\"NO\"))","v":"NO"},{"$f":"IF(ISBLANK(#REF!),1,IFERROR(VLOOKUP(#REF!,modal,1,FALSE),\"NO\"))","v":"NO"},{"$f":"IF(ISBLANK(#REF!),1,IFERROR(VLOOKUP(#REF!,Tipo!$C$12:$C$27,1,FALSE),\"NO\"))","v":"NO"},{"$f":"IF(ISBLANK(#REF!),1,IFERROR(VLOOKUP(#REF!,afectacion,1,FALSE),\"NO\"))","v":"NO"},{"$f":"IF(ISBLANK(#REF!),1,IFERROR(VLOOKUP(#REF!,Eje_Pilar_Prop!C236:C337,1,FALSE),\"NO\"))","v":"NO"},{"$f":"IF(ISBLANK(#REF!),1,IFERROR(VLOOKUP(#REF!,SECOP,1,FALSE),\"NO\"))","v":"NO"},1,{"$f":"IF(ISBLANK(#REF!),1,IFERROR(VLOOKUP(#REF!,pdd,1,FALSE),\"NO\"))","v":"NO"}]
[77,2020,"N/A","N/A","Otros gastos",null,"No aplica","CAUSAR YORDENAR EL PAGO POR CONCEPTO DE COTIZACIÓN DEL SITEMA DERIESGOSLABORALES DE LOS CONTRATISTAS VINCULADOS CON EL FONDO DEDESARROLLO LOCADE LA CANDELARIA PERSONAL CONTRATISTA PRESTADOR DESERVICIOS CUYAS ACTI VIDADES ESTÁN CLASIFICADAS EN EL NIVEL DE R⤃㭱컨ש픀ש挖\u0005","Inversión","Bogotá Mejor para Todos",45,{"$f":"IF(ISERROR(VLOOKUP(K262,Eje_Pilar_Prop!$C$2:$E$104,2,FALSE)),\" \",VLOOKUP(K262,Eje_Pilar_Prop!$C$2:$E$104,2,FALSE))","v":"Gobernanza e influencia local, regional e internacional"},{"$f":"IF(ISERROR(VLOOKUP(K262,Eje_Pilar_Prop!$C$2:$E$104,3,FALSE)),\" \",VLOOKUP(K262,Eje_Pilar_Prop!$C$2:$E$104,3,FALSE))","v":"Eje Transversal 4 Gobierno Legitimo, Fortalecimiento Local y Eficiencia"},1395,860011153,"POSITIVA COMPAÑIA DE SEGUROS SA",3810800,null,null,null,null,{"$f":"+Q262+S262+U262","v":3810800},3810800,"2020-12-01","2020-12-01","2020-12-01",null,null,null,null,null,null,null,null,null,null,null,1,{"$f":"IF(SUMPRODUCT((A$14:A262=A262)*(B$14:B262=B262)*(D$14:D262=D262))>1,0,1)","v":0},{"$f":"IF(ISBLANK(#REF!),1,IFERROR(VLOOKUP(#REF!,tipo,1,FALSE),\"NO\"))","v":"NO"},{"$f":"IF(ISBLANK(#REF!),1,IFERROR(VLOOKUP(#REF!,modal,1,FALSE),\"NO\"))","v":"NO"},{"$f":"IF(ISBLANK(#REF!),1,IFERROR(VLOOKUP(#REF!,Tipo!$C$12:$C$27,1,FALSE),\"NO\"))","v":"NO"},{"$f":"IF(ISBLANK(#REF!),1,IFERROR(VLOOKUP(#REF!,afectacion,1,FALSE),\"NO\"))","v":"NO"},{"$f":"IF(ISBLANK(#REF!),1,IFERROR(VLOOKUP(#REF!,Eje_Pilar_Prop!C237:C338,1,FALSE),\"NO\"))","v":"NO"},{"$f":"IF(ISBLANK(#REF!),1,IFERROR(VLOOKUP(#REF!,SECOP,1,FALSE),\"NO\"))","v":"NO"},1,{"$f":"IF(ISBLANK(#REF!),1,IFERROR(VLOOKUP(#REF!,pdd,1,FALSE),\"NO\"))","v":"NO"}]
[66,2020,"SECOP II","FDLC-CMA-003-2020","Interventoría","Concurso de méritos","No aplica","CONTINUACION DE LA INTERVENTORÍA TÉCNICA, ADMINISTRATIVA, FINANCIERA, SOCIAL, AMBIENTAL Y SISTEMA DE SEGURIDAD Y SALUD EN EL TRABAJO - SG-SST, DEL CONTRATO DE OBRA 101 de 2018, QUE TIENE POR OBJETO: “REALIZAR A PRECIO GLOBAL FIJO LA ACTUALIZACIÓN, AJUSTES Y/O COMPLEMENTACIÓN DE LOS ESTUDIOS Y DISEÑOS Y A MONTO AGOTABLE LA CONSTRUCCIÓN DEL TRAMO FALTANTE DEL PROYECTO RAPS NIEVES UBICADO EN LA CARRERA 4 ENTRE CALLES 13 Y 10 EN LA LOCALIDAD DE LA CANDELARIA, EN BOGOTÁ D.C.","Inversión","Bogotá Mejor para Todos",18,{"$f":"IF(ISERROR(VLOOKUP(K263,Eje_Pilar_Prop!$C$2:$E$104,2,FALSE)),\" \",VLOOKUP(K263,Eje_Pilar_Prop!$C$2:$E$104,2,FALSE))","v":"Mejor movilidad para todos"},{"$f":"IF(ISERROR(VLOOKUP(K263,Eje_Pilar_Prop!$C$2:$E$104,3,FALSE)),\" \",VLOOKUP(K263,Eje_Pilar_Prop!$C$2:$E$104,3,FALSE))","v":"Pilar 2 Democracía Urbana"},1391,900104908,"INGENIEROS CONSTRUCTORES Y ASESORES SAS",359561470,null,null,null,144997067,{"$f":"+Q263+S263+U263","v":504558537},138468821,"2020-04-14","2020-05-06","2021-03-28",150,null,null,null,null,null,null,null,"X",null,null,0.27443559239589282,{"$f":"IF(SUMPRODUCT((A$14:A263=A263)*(B$14:B263=B263)*(D$14:D263=D263))>1,0,1)","v":1}]
[2,2019,"SECOP II","FDLC-CPS-002-2019","Contratos de prestación de servicios profesionales y de apoyo a la gestión","Contratación directa","Prestación de servicios profesionales y de apoyo a la gestión, o para la ejecución de trabajos artísticos que sólo puedan encomendarse a determinadas personas naturales;","PRESTAR SERVICIOS PROFESIONALES AL FONDO DE DESARROLLO LOCAL DE LA CANDELARIA EN LOS TRAMITES RELACIONADOS EN LOS PROCESOS PRECONTRACTUALES, CONTRACTUALES Y POS CONTRACTUALES Y EN LAS DEMAS ACTIVIDADES QUE ALLI SE REQUIERAN, DE CONFORMIDA CON LOS ESTUDIOS PREVIOS.","Inversión","Bogotá Mejor para Todos",45,{"$f":"IF(ISERROR(VLOOKUP(K264,Eje_Pilar_Prop!$C$2:$E$104,2,FALSE)),\" \",VLOOKUP(K264,Eje_Pilar_Prop!$C$2:$E$104,2,FALSE))","v":"Gobernanza e influencia local, regional e internacional"},{"$f":"IF(ISERROR(VLOOKUP(K264,Eje_Pilar_Prop!$C$2:$E$104,3,FALSE)),\" \",VLOOKUP(K264,Eje_Pilar_Prop!$C$2:$E$104,3,FALSE))","v":"Eje Transversal 4 Gobierno Legitimo, Fortalecimiento Local y Eficiencia"},1395,1015437538,"WENDY LORENA RAMIREZ ESPITIA",null,null,null,2,1476468,{"$f":"+Q264+S264+U264","v":1476468},1181174,"2019-01-21","2019-01-21","2020-02-28",330,2,70,null,null,null,null,null,null,"X",null,0.79999972908319039,2]
[6,2019,"SECOP II","FDLC-CPS-006-2019","Contratos de prestación de servicios profesionales y de apoyo a la gestión","Contratación directa","Prestación de servicios profesionales y de apoyo a la gestión, o para la ejecución de trabajos artísticos que sólo puedan encomendarse a determinadas personas naturales;","ADICION 2 AL CPS 6 DE 2019 CUYO OBJETO ES: PRESTACION DE SERVICIOS PROFESIONALES PARA APOYAR LA FORMULACIÓN, GESTIÓN Y SEGUIMIENTO DE ACTIVIDADES ENFOCADAS A LA GESTIÓN AMBIENTAL EXTERNA, ENCAMINADAS A LA MITIGACIÓN DE LOS DIFERENTES IMPACTOS AMBIENTALES Y LA CONSERVACIÓN DE LOS RECURSOS NATURALES DE LA LOCALIDAD","Inversión","Bogotá Mejor para Todos",38,{"$f":"IF(ISERROR(VLOOKUP(K265,Eje_Pilar_Prop!$C$2:$E$104,2,FALSE)),\" \",VLOOKUP(K265,Eje_Pilar_Prop!$C$2:$E$104,2,FALSE))","v":"Recuperación y manejo de la Estructura Ecológica Principal"},{"$f":"IF(ISERROR(VLOOKUP(K265,Eje_Pilar_Prop!$C$2:$E$104,3,FALSE)),\" \",VLOOKUP(K265,Eje_Pilar_Prop!$C$2:$E$104,3,FALSE))","v":"Eje Transversal 3 Sostenibilidad Ambiental basada en la eficiencia energética"},1393,1074416048,"LEIVER ALEXIS MORENO GUZMAN",null,null,null,2,3499776,3499776,3499776,"2019-01-22","2019-01-22","2020-05-25",340,2,140,null,null,null,null,null,null,null,"X",1,2]
[6,2019,"SECOP II","FDLC-CPS-006-2019","Contratos de prestación de servicios profesionales y de apoyo a la gestión","Contratación directa","Prestación de servicios profesionales y de apoyo a la gestión, o para la ejecución de trabajos artísticos que sólo puedan encomendarse a determinadas personas naturales;","ADICIÓN NO. 3 Y PRORROGA NO. 3 AL CONTRATO DE PRESTACIÓN DE SERVICIOS PROFESIONALES PARA APOYAR LA FORMULACIÓN, GESTIÓN Y SEGUIMIENTO DE ACTIVIDADES ENFOCADAS A LA GESTIÓN AMBIENTAL EXTERNA, ENCAMINADAS A LA MITIGACIÓN DE LOS DIFERENTES IMPACTOS AMBIENTALES Y LA CONSERVACIÓN DE LOS RECURSOS NATURALES DE LA LOCALIDAD.","Inversión","Bogotá Mejor para Todos",38,{"$f":"IF(ISERROR(VLOOKUP(K266,Eje_Pilar_Prop!$C$2:$E$104,2,FALSE)),\" \",VLOOKUP(K266,Eje_Pilar_Prop!$C$2:$E$104,2,FALSE))","v":"Recuperación y manejo de la Estructura Ecológica Principal"},{"$f":"IF(ISERROR(VLOOKUP(K266,Eje_Pilar_Prop!$C$2:$E$104,3,FALSE)),\" \",VLOOKUP(K266,Eje_Pilar_Prop!$C$2:$E$104,3,FALSE))","v":"Eje Transversal 3 Sostenibilidad Ambiental basada en la eficiencia energética"},1393,1074416048,"LEIVER ALEXIS MORENO GUZMAN",null,null,null,3,15748992,15748992,15578581,"2019-01-22","2019-01-22","2020-05-25",340,2,140,null,null,null,null,null,null,null,"X",0.98917956146018737,3]
[11,2019,"SECOP II","FDLC-CPS-011-2019","Contratos de prestación de servicios profesionales y de apoyo a la gestión","Contratación directa","Prestación de servicios profesionales y de apoyo a la gestión, o para la ejecución de trabajos artísticos que sólo puedan encomendarse a determinadas personas naturales;","ADICIÓN - CPS 11- PRESTACIÓN DE SERVICIOS PROFESIONALES RELACIONADOS CON EL APOYO JURÍDICO EN DESARROLLODEL PROYECTO 1391 \"MOVILIDAD Y ESPACIO PÚBLICO MEJOR PARA TODOS ¿","Inversión","Bogotá Mejor para Todos",18,{"$f":"IF(ISERROR(VLOOKUP(K267,Eje_Pilar_Prop!$C$2:$E$104,2,FALSE)),\" \",VLOOKUP(K267,Eje_Pilar_Prop!$C$2:$E$104,2,FALSE))","v":"Mejor movilidad para todos"},{"$f":"IF(ISERROR(VLOOKUP(K267,Eje_Pilar_Prop!$C$2:$E$104,3,FALSE)),\" \",VLOOKUP(K267,Eje_Pilar_Prop!$C$2:$E$104,3,FALSE))","v":"Pilar 2 Democracía Urbana"},1391,1121827147,"ana karen pulido novoa",null,null,null,2,15640000,{"$f":"+Q267+S267+U267","v":15640000},15639999,"2019-01-25","2019-01-25","2020-06-09",330,2,{"$f":"96+69","v":165},null,null,null,null,null,null,null,"X",0.99999993606138105,2]
[12,2019,"SECOP II","FDLC-CPS-012-2019","Contratos de prestación de servicios profesionales y de apoyo a la gestión","Contratación directa","Prestación de servicios profesionales y de apoyo a la gestión, o para la ejecución de trabajos artísticos que sólo puedan encomendarse a determinadas personas naturales;","adición 2-PRESTAR SERVICIOS DE APOYO COMO CONDUCTOR DE LOS VEHÍCULOS QUE SE ENCUENTRAN A CARGO DEL FONDO DE DESARROLLO LOCAL DE LA CANDELARIA.","Inversión","Bogotá Mejor para Todos",45,{"$f":"IF(ISERROR(VLOOKUP(K268,Eje_Pilar_Prop!$C$2:$E$104,2,FALSE)),\" \",VLOOKUP(K268,Eje_Pilar_Prop!$C$2:$E$104,2,FALSE))","v":"Gobernanza e influencia local, regional e internacional"},{"$f":"IF(ISERROR(VLOOKUP(K268,Eje_Pilar_Prop!$C$2:$E$104,3,FALSE)),\" \",VLOOKUP(K268,Eje_Pilar_Prop!$C$2:$E$104,3,FALSE))","v":"Eje Transversal 4 Gobierno Legitimo, Fortalecimiento Local y Eficiencia"},1395,79714948,"OSCAR ANTONIO ZAMBRANO GUTIERREZ",null,null,null,2,535903,535903,535903,"2019-01-23","2019-01-23","2020-01-30",330,1,36,null,null,null,null,null,null,null,"X",1,2]
[13,2019,"SECOP II","FDLC-CPS-013-2019","Contratos de prestación de servicios profesionales y de apoyo a la gestión","Contratación directa","Prestación de servicios profesionales y de apoyo a la gestión, o para la ejecución de trabajos artísticos que sólo puedan encomendarse a determinadas personas naturales;","ADICIÓN 2 -PRESTAR SERVICIOS DE APOYO COMO CONDUCTOR DE LOS VEHÍCULOS QUE SE ENCUENTRAN A CARGO DEL FONDO DE DESARROLLO LOCAL DE LA CANDELARIAPARA TODOS","Inversión","Bogotá Mejor para Todos",45,{"$f":"IF(ISERROR(VLOOKUP(K269,Eje_Pilar_Prop!$C$2:$E$104,2,FALSE)),\" \",VLOOKUP(K269,Eje_Pilar_Prop!$C$2:$E$104,2,FALSE))","v":"Gobernanza e influencia local, regional e internacional"},{"$f":"IF(ISERROR(VLOOKUP(K269,Eje_Pilar_Prop!$C$2:$E$104,3,FALSE)),\" \",VLOOKUP(K269,Eje_Pilar_Prop!$C$2:$E$104,3,FALSE))","v":"Eje Transversal 4 Gobierno Legitimo, Fortalecimiento Local y Eficiencia"},1395,1010187694,"CHRISTIAM CAMILO ROMERO WALTEROS",null,null,null,2,535903,535903,535903,"2019-01-23","2019-01-23","2020-01-30",330,1,39,null,null,null,null,null,null,null,"X",1,2]
[14,2019,"SECOP II","FDLC-CPS-014-2019","Contratos de prestación de servicios profesionales y de apoyo a la gestión","Contratación directa","Prestación de servicios profesionales y de apoyo a la gestión, o para la ejecución de trabajos artísticos que sólo puedan encomendarse a determinadas personas naturales;","ADICION 2 AL CPS 14 DE 2019 CUYO OBJETO ES: PRESTAR SERVICIO ASISTENCIAL DE APOYO EN EL ÁREA DE GESTIÓN DE DESARROLLO LOCAL CDI, PARA LA NOTIFICACIÓN DE CORRESPONDENCIA EN GENERAL","Inversión","Bogotá Mejor para Todos",45,{"$f":"IF(ISERROR(VLOOKUP(K270,Eje_Pilar_Prop!$C$2:$E$104,2,FALSE)),\" \",VLOOKUP(K270,Eje_Pilar_Prop!$C$2:$E$104,2,FALSE))","v":"Gobernanza e influencia local, regional e internacional"},{"$f":"IF(ISERROR(VLOOKUP(K270,Eje_Pilar_Prop!$C$2:$E$104,3,FALSE)),\" \",VLOOKUP(K270,Eje_Pilar_Prop!$C$2:$E$104,3,FALSE))","v":"Eje Transversal 4 Gobierno Legitimo, Fortalecimiento Local y Eficiencia"},1395,1010168625,"CLAUDIA CATALINA PERILLA CORREA",null,null,null,2,765576,765576,765576,"2019-01-25","2019-01-25","2020-01-31",330,2,38,null,null,null,null,null,null,null,"X",1,2]
[15,2019,"SECOP II","FDLC-CPS-015-2019","Contratos de prestación de servicios profesionales y de apoyo a la gestión","Contratación directa","Prestación de servicios profesionales y de apoyo a la gestión, o para la ejecución de trabajos artísticos que sólo puedan encomendarse a determinadas personas naturales;","ADICION Y PRORROGA # 2 AL CPS 15 DE 2019 CUYO OBJETO ES: PRESTACIÓN DE SERVICIOS PROFESIONALES PARA APOYAR Y FORTALECER LA OFICINA DE PRESUPUESTO DEL FONDO DE DESARROLLO LOCAL EN LAS GESTIONES ADMINISTRATIVAS U FINANCIERAS DE LA ENTIDAD.","Inversión","Bogotá Mejor para Todos",45,{"$f":"IF(ISERROR(VLOOKUP(K271,Eje_Pilar_Prop!$C$2:$E$104,2,FALSE)),\" \",VLOOKUP(K271,Eje_Pilar_Prop!$C$2:$E$104,2,FALSE))","v":"Gobernanza e influencia local, regional e internacional"},{"$f":"IF(ISERROR(VLOOKUP(K271,Eje_Pilar_Prop!$C$2:$E$104,3,FALSE)),\" \",VLOOKUP(K271,Eje_Pilar_Prop!$C$2:$E$104,3,FALSE))","v":"Eje Transversal 4 Gobierno Legitimo, Fortalecimiento Local y Eficiencia"},1395,1026557127,"ISABEL  SANCHEZ RODRIGUEZ",null,null,null,2,17763088,17763088,17583663,"2019-01-23","2019-01-23","2020-04-30",330,2,129,null,null,null,null,null,null,null,"X",0.98989899729146191,2]
[18,2019,"SECOP II","FDLC-CPS-018-2019","Contratos de prestación de servicios profesionales y de apoyo a la gestión","Contratación directa","Prestación de servicios profesionales y de apoyo a la gestión, o para la ejecución de trabajos artísticos que sólo puedan encomendarse a determinadas personas naturales;","ADICION Y PRORROGA 2 AL CPS 18 CUYO OBJETO ES: PRESTAR SERVICIO ASISTENCIAL DE APOYO EN EL ÁREA DE GESTIÓN DE DESARROLLO LOCAL ¿ CDI, PARA LA NOTIFICACIÓN DE CORRESPONDENCIA EN GENERAL.","Inversión","Bogotá Mejor para Todos",45,{"$f":"IF(ISERROR(VLOOKUP(K272,Eje_Pilar_Prop!$C$2:$E$104,2,FALSE)),\" \",VLOOKUP(K272,Eje_Pilar_Prop!$C$2:$E$104,2,FALSE))","v":"Gobernanza e influencia local, regional e internacional"},{"$f":"IF(ISERROR(VLOOKUP(K272,Eje_Pilar_Prop!$C$2:$E$104,3,FALSE)),\" \",VLOOKUP(K272,Eje_Pilar_Prop!$C$2:$E$104,3,FALSE))","v":"Eje Transversal 4 Gobierno Legitimo, Fortalecimiento Local y Eficiencia"},1395,1121855155,"HERNAN EDUARDO RODRIGUEZ BEDOYA",null,null,null,2,612461,612461,612461,"2019-01-24","2019-01-24","2020-01-31",330,2,38,null,null,null,null,null,null,null,"X",1,2]
[25,2019,"SECOP II","FDLC-CPS-025-2019","Contratos de prestación de servicios profesionales y de apoyo a la gestión","Contratación directa","Prestación de servicios profesionales y de apoyo a la gestión, o para la ejecución de trabajos artísticos que sólo puedan encomendarse a determinadas personas naturales;","ADICIÓN -APOYAR LA GESTION DOCUMENTAL DE LA ALCALDIA LOCAL, ACOMPAÑANDO AL EQUIPO JURIDICO DE DEPURACION EN LA LABORES OPERATIVAS QUE GENERA EL PROCESO DE IMPULSO DE LAS ACTUACIONES ADMINISTRATIVAS EXISTENTES EN LAS DIFERENTES ALCALDIAS LOCALES","Inversión","Bogotá Mejor para Todos",45,{"$f":"IF(ISERROR(VLOOKUP(K273,Eje_Pilar_Prop!$C$2:$E$104,2,FALSE)),\" \",VLOOKUP(K273,Eje_Pilar_Prop!$C$2:$E$104,2,FALSE))","v":"Gobernanza e influencia local, regional e internacional"},{"$f":"IF(ISERROR(VLOOKUP(K273,Eje_Pilar_Prop!$C$2:$E$104,3,FALSE)),\" \",VLOOKUP(K273,Eje_Pilar_Prop!$C$2:$E$104,3,FALSE))","v":"Eje Transversal 4 Gobierno Legitimo, Fortalecimiento Local y Eficiencia"},1395,49729700,"NEREIDA  HERNANDEZ FLOREZ",null,null,null,2,2296728,2296728,2296728,"2019-01-24","2019-01-25","2020-04-24",330,2,150,null,null,null,null,null,null,null,"X",1,2]
[29,2019,"SECOP II","FDLC-CPS-029-2019","Contratos de prestación de servicios profesionales y de apoyo a la gestión","Contratación directa","Prestación de servicios profesionales y de apoyo a la gestión, o para la ejecución de trabajos artísticos que sólo puedan encomendarse a determinadas personas naturales;","ADICIÓN Y PRORROGA NO. 2 AL CPS NO.29 DE 2019, CUYO OBJETO ES:PRESTACIÓN DE SERVICIOS ASISTENCIALES DE APOYO A LA GESTIÓN DEL FONDO DE DESARROLLO LOCAL DE LA CANDELARIA ¿ CDI PARA EL MANEJO Y PROCESO DE DISTRIBUCIÓN DE CORRESPONDENCIA EN GENERAL.","Inversión","Bogotá Mejor para Todos",45,{"$f":"IF(ISERROR(VLOOKUP(K274,Eje_Pilar_Prop!$C$2:$E$104,2,FALSE)),\" \",VLOOKUP(K274,Eje_Pilar_Prop!$C$2:$E$104,2,FALSE))","v":"Gobernanza e influencia local, regional e internacional"},{"$f":"IF(ISERROR(VLOOKUP(K274,Eje_Pilar_Prop!$C$2:$E$104,3,FALSE)),\" \",VLOOKUP(K274,Eje_Pilar_Prop!$C$2:$E$104,3,FALSE))","v":"Eje Transversal 4 Gobierno Legitimo, Fortalecimiento Local y Eficiencia"},1395,1010227910,"CARLOS ARMANDO GONZALEZ RASGO",null,null,null,2,612461,612461,612461,"2019-01-25","2019-01-25","2020-01-24",330,2,38,null,null,null,null,null,null,null,"X",1,2]
[32,2019,"SECOP II","FDLC-CPS-032-2019","Contratos de prestación de servicios profesionales y de apoyo a la gestión","Contratación directa","Prestación de servicios profesionales y de apoyo a la gestión, o para la ejecución de trabajos artísticos que sólo puedan encomendarse a determinadas personas naturales;","ADICIÓN 2 -PRESTACIÓN DE SERVICIOS PROFESIONALES COMO ADMINISTRADOR DE RED LOCAL,  ENLACE  CON LA  SECRETARIA DISTRITAL  DE  GOBIERNO, BRINDANDO   SOPORTE   EN   MATERIA   DE   SISTEMAS   (SOFTWARE   Y HARDWARE)   A   LOS   USUARIOS   INTERNOS   Y   EXTERNOS   DE   LAS DIFERENTES ÁREAS DELA ALCALDIA LOCAL LA CANDELARIA.","Inversión","Bogotá Mejor para Todos",45,{"$f":"IF(ISERROR(VLOOKUP(K275,Eje_Pilar_Prop!$C$2:$E$104,2,FALSE)),\" \",VLOOKUP(K275,Eje_Pilar_Prop!$C$2:$E$104,2,FALSE))","v":"Gobernanza e influencia local, regional e internacional"},{"$f":"IF(ISERROR(VLOOKUP(K275,Eje_Pilar_Prop!$C$2:$E$104,3,FALSE)),\" \",VLOOKUP(K275,Eje_Pilar_Prop!$C$2:$E$104,3,FALSE))","v":"Eje Transversal 4 Gobierno Legitimo, Fortalecimiento Local y Eficiencia"},1395,79814029,"AGUSTIN  LARA BELTRAN",null,null,null,2,1076551,1076551,1076551,"2019-01-25","2019-01-25","2020-01-31",330,1,37,null,null,null,null,null,null,null,"X",1,2]
[39,2019,"SECOP II","FDLC-CPS-039-2019","Contratos de prestación de servicios profesionales y de apoyo a la gestión","Contratación directa","Prestación de servicios profesionales y de apoyo a la gestión, o para la ejecución de trabajos artísticos que sólo puedan encomendarse a determinadas personas naturales;","ADICIÓN 2 -PRESTACIÓN DE SERVICIOS DE APOYO Y ASISTENCIA ADMINISTRATIVA A LA GESTIÓN DE LA JUNTA ADMINISTRADORA LOCAL DE LA CANDELARIA","Inversión","Bogotá Mejor para Todos",45,{"$f":"IF(ISERROR(VLOOKUP(K276,Eje_Pilar_Prop!$C$2:$E$104,2,FALSE)),\" \",VLOOKUP(K276,Eje_Pilar_Prop!$C$2:$E$104,2,FALSE))","v":"Gobernanza e influencia local, regional e internacional"},{"$f":"IF(ISERROR(VLOOKUP(K276,Eje_Pilar_Prop!$C$2:$E$104,3,FALSE)),\" \",VLOOKUP(K276,Eje_Pilar_Prop!$C$2:$E$104,3,FALSE))","v":"Eje Transversal 4 Gobierno Legitimo, Fortalecimiento Local y Eficiencia"},1395,51879946,"ISABEL CRISTINA BULLA RODRIGUEZ",null,null,null,2,765576,765576,765576,"2019-01-29","2019-01-29","2020-01-28",330,1,30,null,null,null,null,null,null,null,"X",1,2]
[42,2019,"SECOP II","FDLC-CPS-042-2019","Contratos de prestación de servicios profesionales y de apoyo a la gestión","Contratación directa","Prestación de servicios profesionales y de apoyo a la gestión, o para la ejecución de trabajos artísticos que sólo puedan encomendarse a determinadas personas naturales;","PRESTACION DE SERVICIO PROFESIONALES PARA APOYAR JURIDICAMENTE LA EJECUCION DE LAS ACCIONE SREQUERIDAS PARA LA DEPURACION DE LAS ACTUACIONESADMINISTRATIVAS QUE CURSAN EN LA ALCALDIA","Inversión","Bogotá Mejor para Todos",45,{"$f":"IF(ISERROR(VLOOKUP(K277,Eje_Pilar_Prop!$C$2:$E$104,2,FALSE)),\" \",VLOOKUP(K277,Eje_Pilar_Prop!$C$2:$E$104,2,FALSE))","v":"Gobernanza e influencia local, regional e internacional"},{"$f":"IF(ISERROR(VLOOKUP(K277,Eje_Pilar_Prop!$C$2:$E$104,3,FALSE)),\" \",VLOOKUP(K277,Eje_Pilar_Prop!$C$2:$E$104,3,FALSE))","v":"Eje Transversal 4 Gobierno Legitimo, Fortalecimiento Local y Eficiencia"},1395,51875915,"LUZ SOFIA AMAYA CASTAÑEDA",null,null,null,2,14501880,{"$f":"+Q277+S277+U277","v":14501880},14501880,"2019-01-29","2019-01-30","2020-05-29",330,2,150,null,null,null,null,null,null,null,"X",1,2]
[52,2019,"SECOP II","FDLC-CPS-052-2019","Contratos de prestación de servicios profesionales y de apoyo a la gestión","Contratación directa","Prestación de servicios profesionales y de apoyo a la gestión, o para la ejecución de trabajos artísticos que sólo puedan encomendarse a determinadas personas naturales;","ADICIÓN - CPS 052-2019 OBJETO: ¿PRESTACIÓN DE SERVICIOS PROFESIONALES PARA LIDERAR Y GARANTIZAR LA IMPLEMENTACIÓN Y SEGUIMIENTO DE LOS PROCESOS Y PROCEDIMIENTOS DEL SERVICIO SOCIAL ¿.","Inversión","Bogotá Mejor para Todos",3,{"$f":"IF(ISERROR(VLOOKUP(K278,Eje_Pilar_Prop!$C$2:$E$104,2,FALSE)),\" \",VLOOKUP(K278,Eje_Pilar_Prop!$C$2:$E$104,2,FALSE))","v":"Igualdad y autonomía para una Bogotá incluyente"},{"$f":"IF(ISERROR(VLOOKUP(K278,Eje_Pilar_Prop!$C$2:$E$104,3,FALSE)),\" \",VLOOKUP(K278,Eje_Pilar_Prop!$C$2:$E$104,3,FALSE))","v":"Pilar 1 Igualdad de Calidad de Vida"},1386,1121834435,"JUANITA  DIAZ VILLALOBOS",null,null,null,1,1973675,1973675,1973675,"2019-02-01","2019-02-01","2020-02-15",345,1,32,null,null,null,null,null,null,null,"X",1,2]
[52,2019,"SECOP II","FDLC-CPS-052-2019","Contratos de prestación de servicios profesionales y de apoyo a la gestión","Contratación directa","Prestación de servicios profesionales y de apoyo a la gestión, o para la ejecución de trabajos artísticos que sólo puedan encomendarse a determinadas personas naturales;","CPS 052-2019 \"PRESTACIÓN DE SERVICIOS PROFESIONALES PARA LIDERAR Y GARANTIZAR LA IMPLEMENTACIÓN Y SEGUIMIENTO DE LOS PROCESOS Y PROCEDIMIENTOS DEL SERVICIO SOCIAL\"","Inversión","Bogotá Mejor para Todos",3,{"$f":"IF(ISERROR(VLOOKUP(K279,Eje_Pilar_Prop!$C$2:$E$104,2,FALSE)),\" \",VLOOKUP(K279,Eje_Pilar_Prop!$C$2:$E$104,2,FALSE))","v":"Igualdad y autonomía para una Bogotá incluyente"},{"$f":"IF(ISERROR(VLOOKUP(K279,Eje_Pilar_Prop!$C$2:$E$104,3,FALSE)),\" \",VLOOKUP(K279,Eje_Pilar_Prop!$C$2:$E$104,3,FALSE))","v":"Pilar 1 Igualdad de Calidad de Vida"},1386,1121834435,"JUANITA  DIAZ VILLALOBOS",null,null,null,1,13456885,{"$f":"+Q279+S279+U279","v":13456885},5741604,"2019-02-01","2019-02-01","2020-02-15",345,1,32,null,null,null,null,null,null,"X",null,0.4266666468502926,3]
[67,2019,"SECOP II","FDLC-CPS-067-2019","Contratos de prestación de servicios profesionales y de apoyo a la gestión","Contratación directa","Prestación de servicios profesionales y de apoyo a la gestión, o para la ejecución de trabajos artísticos que sólo puedan encomendarse a determinadas personas naturales;","ADICION 2 Y PRORROG 2 AL CPS 67 DE 2019 CUYO OBJETO ES: PRESTAR SERVICIOS PROFESIONALES PARA APOYAR AL ALCALDE LOCAL EN LA GESTIÓN DE LOS ASUNTOS RELACIONADOS CON SEGURIDAD CIUDADANA, CONVIVENCIA Y PREVENCIÓN DE CONFLICITIVIDADES, VIOLENCIAS Y DELITOS EN LA LOCALIDAD, DE CONFORMIDAD CON EL MARCO NORMATIVO APLICABLE EN LA MATERIA.","Inversión","Bogotá Mejor para Todos",45,{"$f":"IF(ISERROR(VLOOKUP(K280,Eje_Pilar_Prop!$C$2:$E$104,2,FALSE)),\" \",VLOOKUP(K280,Eje_Pilar_Prop!$C$2:$E$104,2,FALSE))","v":"Gobernanza e influencia local, regional e internacional"},{"$f":"IF(ISERROR(VLOOKUP(K280,Eje_Pilar_Prop!$C$2:$E$104,3,FALSE)),\" \",VLOOKUP(K280,Eje_Pilar_Prop!$C$2:$E$104,3,FALSE))","v":"Eje Transversal 4 Gobierno Legitimo, Fortalecimiento Local y Eficiencia"},1395,17344074,"JOSE JAVIER MESA CESPEDES",null,null,null,2,2168220,2168220,2168220,"2019-02-08","2019-02-08","2020-06-06",345,3,133,null,null,null,null,null,null,null,"X",1,2]
[67,2019,"SECOP II","FDLC-CPS-067-2019","Contratos de prestación de servicios profesionales y de apoyo a la gestión","Contratación directa","Prestación de servicios profesionales y de apoyo a la gestión, o para la ejecución de trabajos artísticos que sólo puedan encomendarse a determinadas personas naturales;","CPS-2019 Adición 3 Prórroga 3, PRESTAR SUS SERVICIOS PROFESIONALES PAR APOYAR AL ALCALDE LOCAL EN LA GESTIÓN DE LOS ASUNTOS RELACIONADOS CON SEGURIDAD CIUDADANA, CONVIVENCIA Y REVENCIÓN DE CONFLICTIVIDADES, VIOLENCIAS Y DELITOS EN LA LOCALIDAD , DE CONFORMIDAD CON EL MARCO NORMATIVO APLICABLE EN LA MATERIA.","Inversión","Bogotá Mejor para Todos",45,{"$f":"IF(ISERROR(VLOOKUP(K281,Eje_Pilar_Prop!$C$2:$E$104,2,FALSE)),\" \",VLOOKUP(K281,Eje_Pilar_Prop!$C$2:$E$104,2,FALSE))","v":"Gobernanza e influencia local, regional e internacional"},{"$f":"IF(ISERROR(VLOOKUP(K281,Eje_Pilar_Prop!$C$2:$E$104,3,FALSE)),\" \",VLOOKUP(K281,Eje_Pilar_Prop!$C$2:$E$104,3,FALSE))","v":"Eje Transversal 4 Gobierno Legitimo, Fortalecimiento Local y Eficiencia"},1395,17344074,"JOSE JAVIER MESA CESPEDES",null,null,null,3,15010758,15010758,14176827,"2019-02-08","2019-02-08","2020-06-06",345,3,133,null,null,null,null,null,null,"X",null,0.94444444444444442,3]
[68,2019,"SECOP II","FDLC-CPS-068-2019","Contratos de prestación de servicios profesionales y de apoyo a la gestión","Contratación directa","Prestación de servicios profesionales y de apoyo a la gestión, o para la ejecución de trabajos artísticos que sólo puedan encomendarse a determinadas personas naturales;","ADICIÓN - PRESTAR SUS SERVICIOS DE APOYO EN LAS TAREAS  OPERATIVAS DE CARACTER ARCHIVISTICO DESARROLLADAS EN LA ALCALDÍA LOCAL PARA GARANTIZAR LA APLICACIÓN CORRECTA DE LOS PROCEDIMIENTOS TÉCNICOS.","Inversión","Bogotá Mejor para Todos",45,{"$f":"IF(ISERROR(VLOOKUP(K282,Eje_Pilar_Prop!$C$2:$E$104,2,FALSE)),\" \",VLOOKUP(K282,Eje_Pilar_Prop!$C$2:$E$104,2,FALSE))","v":"Gobernanza e influencia local, regional e internacional"},{"$f":"IF(ISERROR(VLOOKUP(K282,Eje_Pilar_Prop!$C$2:$E$104,3,FALSE)),\" \",VLOOKUP(K282,Eje_Pilar_Prop!$C$2:$E$104,3,FALSE))","v":"Eje Transversal 4 Gobierno Legitimo, Fortalecimiento Local y Eficiencia"},1395,1022352287,"CINDY CATALINA OJEDA LOPEZ",null,null,null,1,15562320,15562320,15458165,"2019-02-08","2019-02-08","2020-08-27",330,1,150,null,null,null,null,null,null,null,"X",0.99330723182661707,2]
[70,2019,"SECOP II","FDLC-CPS-070-2019","Contratos de prestación de servicios profesionales y de apoyo a la gestión","Contratación directa","Prestación de servicios profesionales y de apoyo a la gestión, o para la ejecución de trabajos artísticos que sólo puedan encomendarse a determinadas personas naturales;","ADICION - PRSTACION DE SERVICIOS PROFESIONALES PARA APOYAR JURIDICAMENTE LA EJECUCION DE LAS ACCIONES REQUERIDAS PARA EL TRAMITE E IMPULSO PROCESAL DE LAS ACTUACIONES CONTRAVENCIONALES Y/O QUERELLAS QUE CURSEN EN LA INSPECCION DE POLICIA DE LA LOCALIDAD DE LA CANDELARIA","Inversión","Bogotá Mejor para Todos",45,{"$f":"IF(ISERROR(VLOOKUP(K283,Eje_Pilar_Prop!$C$2:$E$104,2,FALSE)),\" \",VLOOKUP(K283,Eje_Pilar_Prop!$C$2:$E$104,2,FALSE))","v":"Gobernanza e influencia local, regional e internacional"},{"$f":"IF(ISERROR(VLOOKUP(K283,Eje_Pilar_Prop!$C$2:$E$104,3,FALSE)),\" \",VLOOKUP(K283,Eje_Pilar_Prop!$C$2:$E$104,3,FALSE))","v":"Eje Transversal 4 Gobierno Legitimo, Fortalecimiento Local y Eficiencia"},1395,1018443671,"JOSE RICARDO PULGARIN ALVAREZ",null,null,null,2,3340067,3340067,3340067,"2019-02-12","2019-02-13","2020-05-28",330,3,137,null,null,null,null,null,null,null,"X",1,2]
[70,2019,"SECOP II","FDLC-CPS-070-2019","Contratos de prestación de servicios profesionales y de apoyo a la gestión","Contratación directa","Prestación de servicios profesionales y de apoyo a la gestión, o para la ejecución de trabajos artísticos que sólo puedan encomendarse a determinadas personas naturales;","ADICIÓN No. 3 y PRORROGA No. 3 AL CONTRATO DE PRETACIÓN DE SERVICIOS PROFESIONALES PARA APOYAR JURÍDICAMENTE LA EJECUCIÓN DE LAS ACCIONES REQUERIDAS PARA EL TRÁMITE E IMPULSO PROCESAL DE LAS ACTUACIONES CONTRAVENCIONALES Y/O QUERELLAS QUE CURSEN EN LA INSPECCIÓN DE POLICÍA DE LA LOCALIDAD LA CCANDELARIA.","Inversión","Bogotá Mejor para Todos",45,{"$f":"IF(ISERROR(VLOOKUP(K284,Eje_Pilar_Prop!$C$2:$E$104,2,FALSE)),\" \",VLOOKUP(K284,Eje_Pilar_Prop!$C$2:$E$104,2,FALSE))","v":"Gobernanza e influencia local, regional e internacional"},{"$f":"IF(ISERROR(VLOOKUP(K284,Eje_Pilar_Prop!$C$2:$E$104,3,FALSE)),\" \",VLOOKUP(K284,Eje_Pilar_Prop!$C$2:$E$104,3,FALSE))","v":"Eje Transversal 4 Gobierno Legitimo, Fortalecimiento Local y Eficiencia"},1395,1018443671,"JOSE RICARDO PULGARIN ALVAREZ",null,null,null,3,13663914,13663914,13512092,"2019-02-12","2019-02-13","2020-05-28",330,3,137,null,null,null,null,null,null,null,"X",0.98888883521954252,2]
[78,2019,"SECOP II","FDLC-CPS-078-2019","Contratos de prestación de servicios profesionales y de apoyo a la gestión","Contratación directa","Prestación de servicios profesionales y de apoyo a la gestión, o para la ejecución de trabajos artísticos que sólo puedan encomendarse a determinadas personas naturales;","ADICIÓN - PRESTACIÓN DE SERVICIOS PROFESIONALES PARA APOYAR AL ALCALDE LOCAL EN PROYECTOS, ACCIONES Y ESTRATEGIAS CULTURALES, MUSICALES Y ARTÍSTICAS ENFOCADAS A LAS INSTANCIAS DE PARTICIPACIÓN DE LA LOCALIDAD LA CANDELARIA","Inversión","Bogotá Mejor para Todos",11,{"$f":"IF(ISERROR(VLOOKUP(K285,Eje_Pilar_Prop!$C$2:$E$104,2,FALSE)),\" \",VLOOKUP(K285,Eje_Pilar_Prop!$C$2:$E$104,2,FALSE))","v":"Mejores oportunidades para el desarrollo a través de la cultura, la recreación y el deporte"},{"$f":"IF(ISERROR(VLOOKUP(K285,Eje_Pilar_Prop!$C$2:$E$104,3,FALSE)),\" \",VLOOKUP(K285,Eje_Pilar_Prop!$C$2:$E$104,3,FALSE))","v":"Pilar 1 Igualdad de Calidad de Vida"},1389,1010207254,"ELY DAVID MURILLO CORDOBA",null,null,null,2,7825266,7825266,7825266,"2019-02-28","2019-02-28","2020-03-27",330,1,90,null,null,null,null,null,null,null,"X",1,2]
[96,2019,"SECOP II","FDLC-LP-005-2019","Obra pública","Licitación pública","No aplica","ADICIÓN Y PRÓRROGA NO. 01 CONTRATO DE OBRA PÚBLICA NO. 096 DE 2020 CUYOOBJETO ES “REALIZAR LA SEGUNDA FASE DE LA CONSTRUCCIÓN DE LA CALLE 10ENTRE LAS CARRERA 4 Y CARRERA 5 Y CARRERA 6 Y CARRERA 7 EN LA LOCALIDADDELA CANDELARIA, EN BOGOTÁ D.C.”","Inversión","Bogotá Mejor para Todos",18,{"$f":"IF(ISERROR(VLOOKUP(K286,Eje_Pilar_Prop!$C$2:$E$104,2,FALSE)),\" \",VLOOKUP(K286,Eje_Pilar_Prop!$C$2:$E$104,2,FALSE))","v":"Mejor movilidad para todos"},{"$f":"IF(ISERROR(VLOOKUP(K286,Eje_Pilar_Prop!$C$2:$E$104,3,FALSE)),\" \",VLOOKUP(K286,Eje_Pilar_Prop!$C$2:$E$104,3,FALSE))","v":"Pilar 2 Democracía Urbana"},1391,830041411,"CONSULTORIA Y CONSTRUCCION S.A.S.",null,null,null,1,537506515.35000002,{"$f":"+Q286+S286+U286","v":537506515.35000002},0,"2019-07-11","22/07/2019 ","2021-05-19",240,null,null,null,null,null,null,null,"X",null,null,0,2]
[96,2019,"SECOP II","FDLC-LP-005-2019","Obra pública","Licitación pública","No aplica","ADICIÓN Y PRÓRROGA NO. 01 CONTRATO DE OBRA PÚBLICA NO. 096 DE 2020 CUYOOBJETO ES “REALIZAR LA SEGUNDA FASE DE LA CONSTRUCCIÓN DE LA CALLE 10ENTRE LAS CARRERA 4 Y CARRERA 5 Y CARRERA 6 Y CARRERA 7 EN LA LOCALIDADDELA CANDELARIA, EN BOGOTÁ D.C.”","Inversión","Bogotá Mejor para Todos",18,{"$f":"IF(ISERROR(VLOOKUP(K287,Eje_Pilar_Prop!$C$2:$E$104,2,FALSE)),\" \",VLOOKUP(K287,Eje_Pilar_Prop!$C$2:$E$104,2,FALSE))","v":"Mejor movilidad para todos"},{"$f":"IF(ISERROR(VLOOKUP(K287,Eje_Pilar_Prop!$C$2:$E$104,3,FALSE)),\" \",VLOOKUP(K287,Eje_Pilar_Prop!$C$2:$E$104,3,FALSE))","v":"Pilar 2 Democracía Urbana"},1391,830041411,"CONSULTORIA Y CONSTRUCCION S.A.S.",null,null,null,1,198803779.65000001,198803779.65000001,0,"2019-07-11","22/07/2019 ","2021-05-19",240,null,null,null,null,null,null,null,"X",null,null,0,2]
[97,2019,"SECOP II","FDLC-CMA-006-2019","Interventoría","Concurso de méritos","No aplica","ADICIÓN Y PRÓRROGA No. 01 CONTRATO DE INTERVENTORIA No. 097 DEL 2019,cucuyo objeto es: “INTERVENTORÍA TÉCNICA, ADMINISTRATIVA, FINANCIERA, SOCIAL, AMBIENTAL Y SISO DEL CONTRATO DE OBRA QUE SE DERIVE DE LA LICITACIÓN PUBLICA QUE TIENE POR OBJETO: REALIZAR SEGUNDA FASE DEL PROYECTO DE PEATONALIZACION DE LA CALLE 10, EJECUTANDO A PRECIOS UNITARIOS FIJOS LA CONTINUACION DE LA CONSTRUCCIÓN DE LA CALLE 10 ENTRE LAS CARRERAS 4 Y 5 Y CARRERAS 6 Y 7 EN LA LOCALIDAD DE LA CANDELARIA, EN BOGOTÁ D.C","Inversión","Bogotá Mejor para Todos",18,{"$f":"IF(ISERROR(VLOOKUP(K288,Eje_Pilar_Prop!$C$2:$E$104,2,FALSE)),\" \",VLOOKUP(K288,Eje_Pilar_Prop!$C$2:$E$104,2,FALSE))","v":"Mejor movilidad para todos"},{"$f":"IF(ISERROR(VLOOKUP(K288,Eje_Pilar_Prop!$C$2:$E$104,3,FALSE)),\" \",VLOOKUP(K288,Eje_Pilar_Prop!$C$2:$E$104,3,FALSE))","v":"Pilar 2 Democracía Urbana"},1391,9013035831,"CONSORCIO INTERURBANO",null,null,null,1,66372156.259999998,66372156.259999998,0,"2019-07-11","22/07/2019 ","2021-05-19",240,null,null,null,null,null,null,null,"X",null,null,0,2]
[97,2019,"SECOP II","FDLC-CMA-006-2019","Interventoría","Concurso de méritos","No aplica","ADICIÓN Y PRÓRROGA No. 01 CONTRATO DE INTERVENTORIA No. 097 DEL 2019,cucuyo objeto es: “INTERVENTORÍA TÉCNICA, ADMINISTRATIVA, FINANCIERA, SOCIAL, AMBIENTAL Y SISO DEL CONTRATO DE OBRA QUE SE DERIVE DE LA LICITACIÓN PUBLICA QUE TIENE POR OBJETO: REALIZAR SEGUNDA FASE DEL PROYECTO DE PEATONALIZACION DE LA CALLE 10, EJECUTANDO A PRECIOS UNITARIOS FIJOS LA CONTINUACION DE LA CONSTRUCCIÓN DE LA CALLE 10 ENTRE LAS CARRERAS 4 Y 5 Y CARRERAS 6 Y 7 EN LA LOCALIDAD DE LA CANDELARIA, EN BOGOTÁ D.C","Inversión","Bogotá Mejor para Todos",18,{"$f":"IF(ISERROR(VLOOKUP(K289,Eje_Pilar_Prop!$C$2:$E$104,2,FALSE)),\" \",VLOOKUP(K289,Eje_Pilar_Prop!$C$2:$E$104,2,FALSE))","v":"Mejor movilidad para todos"},{"$f":"IF(ISERROR(VLOOKUP(K289,Eje_Pilar_Prop!$C$2:$E$104,3,FALSE)),\" \",VLOOKUP(K289,Eje_Pilar_Prop!$C$2:$E$104,3,FALSE))","v":"Pilar 2 Democracía Urbana"},1391,9013035831,"CONSORCIO INTERURBANO",null,null,null,1,24548605.740000002,24548605.740000002,0,"2019-07-11","22/07/2019 ","2021-05-19",240,null,null,null,null,null,null,null,"X",null,null,0,2]
[101,2018,"SECOP II","FDLC-LP-011-2018","Obra pública","Licitación pública","No aplica","ADICIÓN -REALIZAR A PRECIO GLOBAL FIJO LA ACTUALIZACIÓN, AJUSTES Y/O COMPLEMENTACIÓN DE LOS ESTUDIOS Y DISEÑOS Y A MONTO AGOTABLE LA CONSTRUCCIÓN   DEL TRAMO FALTANTE DEL PROYECTO RAPS NIEVES UBICADO EN LA CARRERA 4 ENTRE CALLES 13 Y 10 EN LA LOCALIDAD DE LA CANDELARIA, EN BOGOTÁ D.C.¿","Inversión","Bogotá Mejor para Todos",18,{"$f":"IF(ISERROR(VLOOKUP(K290,Eje_Pilar_Prop!$C$2:$E$104,2,FALSE)),\" \",VLOOKUP(K290,Eje_Pilar_Prop!$C$2:$E$104,2,FALSE))","v":"Mejor movilidad para todos"},{"$f":"IF(ISERROR(VLOOKUP(K290,Eje_Pilar_Prop!$C$2:$E$104,3,FALSE)),\" \",VLOOKUP(K290,Eje_Pilar_Prop!$C$2:$E$104,3,FALSE))","v":"Pilar 2 Democracía Urbana"},1391,"901238161-9","UNION TEMPORAL BJ",null,null,null,1,813731211,{"$f":"+Q290+S290+U290","v":813731211},135855509,"2018-12-17","2019-03-06","2021-03-28",300,null,null,null,null,null,null,null,"X",null,null,0.16695378911796466,2]
[101,2018,"SECOP II","FDLC-LP-011-2018","Obra pública","Licitación pública","No aplica","REALIZAR A PRECIO GLOBAL FIJO LA ACTUALIZACIÓN, AJUSTES Y/O COMPLEMENTACIÓN DE LOS ESTUDIOS Y DISEÑOS Y A MONTO AGOTABLE LA CONSTRUCCIÓN DEL TRAMO FALTANTE DEL PROYECTO RAPS NIEVES UBICADO EN LA CARRERA 4 ENTRE CALLES 13 Y 10 EN LA LOCALIDAD DE LA CANDELARIA, EN BOGOTÁ D.C.","Inversión","Bogotá Mejor para Todos",18,{"$f":"IF(ISERROR(VLOOKUP(K291,Eje_Pilar_Prop!$C$2:$E$104,2,FALSE)),\" \",VLOOKUP(K291,Eje_Pilar_Prop!$C$2:$E$104,2,FALSE))","v":"Mejor movilidad para todos"},{"$f":"IF(ISERROR(VLOOKUP(K291,Eje_Pilar_Prop!$C$2:$E$104,3,FALSE)),\" \",VLOOKUP(K291,Eje_Pilar_Prop!$C$2:$E$104,3,FALSE))","v":"Pilar 2 Democracía Urbana"},1391,"901238161-9","UNION TEMPORAL BJ",null,null,null,2,184766601.81999999,{"$f":"+Q291+S291+U291","v":184766601.81999999},0,"2018-12-17","2019-03-06","2021-03-28",300,2,753,null,null,null,null,null,"X",null,null,{"$f":"IF(ISERROR(W291/V291),\"-\",(W291/V291))","v":0},2]
[101,2018,"SECOP II","FDLC-LP-011-2018","Obra pública","Licitación pública","No aplica","REALIZAR A PRECIO GLOBAL FIJO LA ACTUALIZACIÓN, AJUSTES Y/O COMPLEMENTACIÓN DE LOS ESTUDIOS Y DISEÑOS Y A MONTO AGOTABLE LA CONSTRUCCIÓN DEL TRAMO FALTANTE DEL PROYECTO RAPS NIEVES UBICADO EN LA CARRERA 4 ENTRE CALLES 13 Y 10 EN LA LOCALIDAD DE LA CANDELARIA, EN BOGOTÁ D.C.","Inversión","Bogotá Mejor para Todos",18,{"$f":"IF(ISERROR(VLOOKUP(K292,Eje_Pilar_Prop!$C$2:$E$104,2,FALSE)),\" \",VLOOKUP(K292,Eje_Pilar_Prop!$C$2:$E$104,2,FALSE))","v":"Mejor movilidad para todos"},{"$f":"IF(ISERROR(VLOOKUP(K292,Eje_Pilar_Prop!$C$2:$E$104,3,FALSE)),\" \",VLOOKUP(K292,Eje_Pilar_Prop!$C$2:$E$104,3,FALSE))","v":"Pilar 2 Democracía Urbana"},1391,"901238161-9","UNION TEMPORAL BJ",null,null,null,2,68338332.180000007,{"$f":"+Q292+S292+U292","v":68338332.180000007},0,"2018-12-17","2019-03-06","2021-03-28",300,2,753,null,null,null,null,null,"X",null,null,0,2]
[101,2018,"SECOP II","FDLC-LP-011-2018","Obra pública","Licitación pública","No aplica","REALIZAR A PRECIO GLOBAL FIJO LA ACTUALIZACIÓN, AJUSTES Y/O COMPLEMENTACIÓN DE LOS ESTUDIOS Y DISEÑOS Y A MONTO AGOTABLE LA CONSTRUCCIÓN DEL TRAMO FALTANTE DEL PROYECTO RAPS NIEVES UBICADO EN LA CARRERA 4 ENTRE CALLES 13 Y 10 EN LA LOCALIDAD DE LA CANDELARIA, EN BOGOTÁ D.C.","Inversión","Bogotá Mejor para Todos",18,{"$f":"IF(ISERROR(VLOOKUP(K293,Eje_Pilar_Prop!$C$2:$E$104,2,FALSE)),\" \",VLOOKUP(K293,Eje_Pilar_Prop!$C$2:$E$104,2,FALSE))","v":"Mejor movilidad para todos"},{"$f":"IF(ISERROR(VLOOKUP(K293,Eje_Pilar_Prop!$C$2:$E$104,3,FALSE)),\" \",VLOOKUP(K293,Eje_Pilar_Prop!$C$2:$E$104,3,FALSE))","v":"Pilar 2 Democracía Urbana"},1391,"901238161-9","UNION TEMPORAL BJ",null,null,null,2,171550000,171550000,0,"2018-12-17","2019-03-06","2021-03-28",300,2,753,null,null,null,null,null,"X",null,null,0,2]
[101,2018,"SECOP II","FDLC-LP-011-2018","Obra pública","Licitación pública","No aplica","REALIZAR A PRECIO GLOBAL FIJO LA ACTUALIZACIÓN, AJUSTES Y/O COMPLEMENTACIÓN DE LOS ESTUDIOS Y DISEÑOS Y A MONTO AGOTABLE LA CONSTRUCCIÓN DEL TRAMO FALTANTE DEL PROYECTO RAPS NIEVES UBICADO EN LA CARRERA 4 ENTRE CALLES 13 Y 10 EN LA LOCALIDAD DE LA CANDELARIA, EN BOGOTÁ D.C.","Inversión","Bogotá Mejor para Todos",18,{"$f":"IF(ISERROR(VLOOKUP(K294,Eje_Pilar_Prop!$C$2:$E$104,2,FALSE)),\" \",VLOOKUP(K294,Eje_Pilar_Prop!$C$2:$E$104,2,FALSE))","v":"Mejor movilidad para todos"},{"$f":"IF(ISERROR(VLOOKUP(K294,Eje_Pilar_Prop!$C$2:$E$104,3,FALSE)),\" \",VLOOKUP(K294,Eje_Pilar_Prop!$C$2:$E$104,3,FALSE))","v":"Pilar 2 Democracía Urbana"},1391,"901238161-9","UNION TEMPORAL BJ",null,null,null,2,63450000.000000007,63450000.000000007,0,"2018-12-17","2019-03-06","2021-03-28",300,2,753,null,null,null,null,null,"X",null,null,0,2]
[101,2018,"SECOP II","FDLC-LP-011-2018","Obra pública","Licitación pública","No aplica","REALIZAR A PRECIO GLOBAL FIJO LA ACTUALIZACIÓN, AJUSTES Y/O COMPLEMENTACIÓN DE LOS ESTUDIOS Y DISEÑOS Y A MONTO AGOTABLE LA CONSTRUCCIÓN DEL TRAMO FALTANTE DEL PROYECTO RAPS NIEVES UBICADO EN LA CARRERA 4 ENTRE CALLES 13 Y 10 EN LA LOCALIDAD DE LA CANDELARIA, EN BOGOTÁ D.C.","Inversión","Bogotá Mejor para Todos",18,{"$f":"IF(ISERROR(VLOOKUP(K295,Eje_Pilar_Prop!$C$2:$E$104,2,FALSE)),\" \",VLOOKUP(K295,Eje_Pilar_Prop!$C$2:$E$104,2,FALSE))","v":"Mejor movilidad para todos"},{"$f":"IF(ISERROR(VLOOKUP(K295,Eje_Pilar_Prop!$C$2:$E$104,3,FALSE)),\" \",VLOOKUP(K295,Eje_Pilar_Prop!$C$2:$E$104,3,FALSE))","v":"Pilar 2 Democracía Urbana"},1391,"901238161-9","UNION TEMPORAL BJ",null,null,null,2,337183349.26999998,{"$f":"+Q295+S295+U295","v":337183349.26999998},0,"2018-12-17","2019-03-06","2021-03-28",300,2,753,null,null,null,null,null,"X",null,null,0,2]
[101,2018,"SECOP II","FDLC-LP-011-2018","Obra pública","Licitación pública","No aplica","REALIZAR A PRECIO GLOBAL FIJO LA ACTUALIZACIÓN, AJUSTES Y/O COMPLEMENTACIÓN DE LOS ESTUDIOS Y DISEÑOS Y A MONTO AGOTABLE LA CONSTRUCCIÓN DEL TRAMO FALTANTE DEL PROYECTO RAPS NIEVES UBICADO EN LA CARRERA 4 ENTRE CALLES 13 Y 10 EN LA LOCALIDAD DE LA CANDELARIA, EN BOGOTÁ D.C.","Inversión","Bogotá Mejor para Todos",18,{"$f":"IF(ISERROR(VLOOKUP(K296,Eje_Pilar_Prop!$C$2:$E$104,2,FALSE)),\" \",VLOOKUP(K296,Eje_Pilar_Prop!$C$2:$E$104,2,FALSE))","v":"Mejor movilidad para todos"},{"$f":"IF(ISERROR(VLOOKUP(K296,Eje_Pilar_Prop!$C$2:$E$104,3,FALSE)),\" \",VLOOKUP(K296,Eje_Pilar_Prop!$C$2:$E$104,3,FALSE))","v":"Pilar 2 Democracía Urbana"},1391,"901238161-9","UNION TEMPORAL BJ",null,null,null,2,124711649.73,{"$f":"+Q296+S296+U296","v":124711649.73},0,"2018-12-17","2019-03-06","2021-03-28",300,2,753,null,null,null,null,null,"X",null,null,0,2]
[103,2018,"SECOP II","FDLC-LP-013-2018","Obra pública","Licitación pública","No aplica","ADICIÓN- REALIZAR A PRECIOS UNITARIOS FIJOS LA CONSTRUCCIÓN DE LA ¿CASA CULTURAL DE ZIPA¿ UBICADA EN LA CALLE 9 N° 3- 93 DEL FONDO DE DESARROLLO LOCAL DE LA CANDELARIA.","Inversión","Bogotá Mejor para Todos",37,{"$f":"IF(ISERROR(VLOOKUP(K297,Eje_Pilar_Prop!$C$2:$E$104,2,FALSE)),\" \",VLOOKUP(K297,Eje_Pilar_Prop!$C$2:$E$104,2,FALSE))","v":"Consolidar el turismo como factor de desarrollo, confianza y felicidad para Bogotá Región"},{"$f":"IF(ISERROR(VLOOKUP(K297,Eje_Pilar_Prop!$C$2:$E$104,3,FALSE)),\" \",VLOOKUP(K297,Eje_Pilar_Prop!$C$2:$E$104,3,FALSE))","v":"Eje Transversal 2 Desarrollo Económico basado en el conocimiento"},1394," 901082172-8","CONSORCIO GAMER",null,null,null,2,267200893,267200893,252650752,"2018-12-21","2019-01-15","2020-01-14",360,null,null,null,null,null,null,null,null,"X",null,0.94554606147966724,2]
[103,2018,"SECOP II","FDLC-LP-013-2018","Obra pública","Licitación pública","No aplica","ADICIÓN- REALIZAR A PRECIOS UNITARIOS FIJOS LA CONSTRUCCIÓN DE LA ¿CASA CULTURAL DE ZIPA¿ UBICADA EN LA CALLE 9 N° 3- 93 DEL FONDO DE DESARROLLO LOCAL DE LA CANDELARIA.","Inversión","Bogotá Mejor para Todos",37,{"$f":"IF(ISERROR(VLOOKUP(K298,Eje_Pilar_Prop!$C$2:$E$104,2,FALSE)),\" \",VLOOKUP(K298,Eje_Pilar_Prop!$C$2:$E$104,2,FALSE))","v":"Consolidar el turismo como factor de desarrollo, confianza y felicidad para Bogotá Región"},{"$f":"IF(ISERROR(VLOOKUP(K298,Eje_Pilar_Prop!$C$2:$E$104,3,FALSE)),\" \",VLOOKUP(K298,Eje_Pilar_Prop!$C$2:$E$104,3,FALSE))","v":"Eje Transversal 2 Desarrollo Económico basado en el conocimiento"},1394," 901082172-8","CONSORCIO GAMER",null,null,null,2,430393816,430393816,249166004,"2018-12-21","2019-01-15","2020-01-14",360,null,null,null,null,null,null,null,null,"X",null,0.57892561355946615,2]
[105,2018,"SECOP II","FDLC-CMA-017-2018","Obra pública","Concurso de méritos","No aplica","ADICIÓN - INTERVENTORIA -REALIZAR LA INTERVENTORÍA TÉCNICA, ADMINISTRATIVA, FINANCIERA, SOCIAL, AMBIENTAL Y SISO DE LOS CONTRATOS CELEBRADOS PARA LA EJECUCIÓN DE OBRAS DE CONSTRUCCIÓN Y MANTENIMIENTO DE SEDES DEL FONDO DE DESARROLLO LOCAL DE LA CANDELARIA.","Inversión","Bogotá Mejor para Todos",37,{"$f":"IF(ISERROR(VLOOKUP(K299,Eje_Pilar_Prop!$C$2:$E$104,2,FALSE)),\" \",VLOOKUP(K299,Eje_Pilar_Prop!$C$2:$E$104,2,FALSE))","v":"Consolidar el turismo como factor de desarrollo, confianza y felicidad para Bogotá Región"},{"$f":"IF(ISERROR(VLOOKUP(K299,Eje_Pilar_Prop!$C$2:$E$104,3,FALSE)),\" \",VLOOKUP(K299,Eje_Pilar_Prop!$C$2:$E$104,3,FALSE))","v":"Eje Transversal 2 Desarrollo Económico basado en el conocimiento"},1394,"900105134-5","CONSORCIO LA CANDELARIA",null,null,null,1,32799107,32799107,32799107,"2018-12-21","2019-01-15","2020-11-14",360,null,null,null,null,null,null,null,null,"X",null,1,{"$f":"IF(SUMPRODUCT((A$14:A299=A299)*(B$14:B299=B299)*(D$14:D299=D299))>1,0,1)","v":1}]
[105,2018,"SECOP II","FDLC-CMA-017-2018","Interventoría","Concurso de méritos","No aplica","ADICIÓN CONTRATO 105 - REALIZAR LA INTERVENTORÍA TÉCNICA, ADMINISTRATIVA, FINANCIERA, SOCIAL, AMBIENTAL Y SISO DE LOS CONTRATOS CELEBRADOS PARA LA EJECUCIÓN DE OBRAS DE CONSTRUCCIÓN Y MANTENIMIENTO DE SEDES DEL FONDO DE DESARROLLO LOCAL DE LA CANDELARIA.","Inversión","Bogotá Mejor para Todos",37,{"$f":"IF(ISERROR(VLOOKUP(K300,Eje_Pilar_Prop!$C$2:$E$104,2,FALSE)),\" \",VLOOKUP(K300,Eje_Pilar_Prop!$C$2:$E$104,2,FALSE))","v":"Consolidar el turismo como factor de desarrollo, confianza y felicidad para Bogotá Región"},{"$f":"IF(ISERROR(VLOOKUP(K300,Eje_Pilar_Prop!$C$2:$E$104,3,FALSE)),\" \",VLOOKUP(K300,Eje_Pilar_Prop!$C$2:$E$104,3,FALSE))","v":"Eje Transversal 2 Desarrollo Económico basado en el conocimiento"},1394,"900105134-5","CONSORCIO LA CANDELARIA",null,null,null,1,52852272,52852272,34000065,"2018-12-21","2019-01-15","2020-11-14",360,null,null,null,null,null,null,null,null,"X",null,0.64330375428325959,{"$f":"IF(SUMPRODUCT((A$14:A300=A300)*(B$14:B300=B300)*(D$14:D300=D300))>1,0,1)","v":0}]
[109,2019,"SECOP II","FDLC-LP-016-2019","Obra pública","Licitación pública","No aplica","RELIZAR LA TERCERA FASE DEL ROYECTO DE PEATONALIZACIÓN DE LA CALLE 10,EJECUTANDO A PRECIOS UNITARIOS FIJOS EL TRAMO FALTANTE DE LACONSTRUCCIÓN DE LA CALLE 10 ENTRE LAS CARRERAS 5 Y CARRERA 6 EN LALOCALIDAD DE LA CANDELARIA, EN BOGOTÁ, D.C.","Inversión","Bogotá Mejor para Todos",18,{"$f":"IF(ISERROR(VLOOKUP(K301,Eje_Pilar_Prop!$C$2:$E$104,2,FALSE)),\" \",VLOOKUP(K301,Eje_Pilar_Prop!$C$2:$E$104,2,FALSE))","v":"Mejor movilidad para todos"},{"$f":"IF(ISERROR(VLOOKUP(K301,Eje_Pilar_Prop!$C$2:$E$104,3,FALSE)),\" \",VLOOKUP(K301,Eje_Pilar_Prop!$C$2:$E$104,3,FALSE))","v":"Pilar 2 Democracía Urbana"},1391,"901351087-4","CONSORCIO INDGER",null,null,null,1,73000000,{"$f":"+Q301+S301+U301","v":73000000},0,"2019-12-19","2020-02-11","2021-01-28",150,2,352,null,null,null,null,null,null,"X",null,0,{"$f":"IF(SUMPRODUCT((A$14:A301=A301)*(B$14:B301=B301)*(D$14:D301=D301))>1,0,1)","v":1}]
[109,2019,"SECOP II","FDLC-LP-016-2019","Obra pública","Licitación pública","No aplica","RELIZAR LA TERCERA FASE DEL ROYECTO DE PEATONALIZACIÓN DE LA CALLE 10,EJECUTANDO A PRECIOS UNITARIOS FIJOS EL TRAMO FALTANTE DE LACONSTRUCCIÓN DE LA CALLE 10 ENTRE LAS CARRERAS 5 Y CARRERA 6 EN LALOCALIDAD DE LA CANDELARIA, EN BOGOTÁ, D.C.","Inversión","Bogotá Mejor para Todos",18,{"$f":"IF(ISERROR(VLOOKUP(K302,Eje_Pilar_Prop!$C$2:$E$104,2,FALSE)),\" \",VLOOKUP(K302,Eje_Pilar_Prop!$C$2:$E$104,2,FALSE))","v":"Mejor movilidad para todos"},{"$f":"IF(ISERROR(VLOOKUP(K302,Eje_Pilar_Prop!$C$2:$E$104,3,FALSE)),\" \",VLOOKUP(K302,Eje_Pilar_Prop!$C$2:$E$104,3,FALSE))","v":"Pilar 2 Democracía Urbana"},1391,"901351087-4","CONSORCIO INDGER",null,null,null,1,27000000,27000000,0,"2019-12-19","2020-02-11","2021-01-28",150,2,352,null,null,null,null,null,null,"X",null,0,{"$f":"IF(SUMPRODUCT((A$14:A302=A302)*(B$14:B302=B302)*(D$14:D302=D302))>1,0,1)","v":0}]
[110,2019,"SECOP II","FDLC-CMA-019-2019","Interventoría","Concurso de méritos","No aplica","INTERVENTORÍA TÉCNICA, ADMINISTRATIVA, FINANCIERA, CONTABLE, SOCIAL, AMBIENTAL Y SISO DEL CONTRATO DE OBRA QUE SE DERIVE DE LA LICITACIÓN PUBLICA QUE TIENE POR OBJETO: REALIZAR LA TERCERA FASE DEL PROYECTO DE PEATONALIZACIÓN DE LA CALLE 10, EJECUTANDO A PRECIOS UNITARIOS FIJOS EL TRAMO FALTANTE DE LA CONSTRUCCIÓN DE LA CALLE 10 ENTRE LAS CARRERA 5 Y CARRERA 6 EN LA LOCALIDAD DE LA CANDELARIA, EN BOGOTÁ D.C","Inversión","Bogotá Mejor para Todos",18,{"$f":"IF(ISERROR(VLOOKUP(K303,Eje_Pilar_Prop!$C$2:$E$104,2,FALSE)),\" \",VLOOKUP(K303,Eje_Pilar_Prop!$C$2:$E$104,2,FALSE))","v":"Mejor movilidad para todos"},{"$f":"IF(ISERROR(VLOOKUP(K303,Eje_Pilar_Prop!$C$2:$E$104,3,FALSE)),\" \",VLOOKUP(K303,Eje_Pilar_Prop!$C$2:$E$104,3,FALSE))","v":"Pilar 2 Democracía Urbana"},1391,"901350777-3","CONSORCIO DEL NORTE",null,null,null,1,30229294.890000001,30229294.890000001,0,"2019-12-20","2020-02-11","2021-01-28",150,2,352,null,null,null,null,null,null,"X",null,0,{"$f":"IF(SUMPRODUCT((A$14:A303=A303)*(B$14:B303=B303)*(D$14:D303=D303))>1,0,1)","v":1}]
[110,2019,"SECOP II","FDLC-CMA-019-2019","Interventoría","Concurso de méritos","No aplica","INTERVENTORÍA TÉCNICA, ADMINISTRATIVA, FINANCIERA, CONTABLE, SOCIAL, AMBIENTAL Y SISO DEL CONTRATO DE OBRA QUE SE DERIVE DE LA LICITACIÓN PUBLICA QUE TIENE POR OBJETO: REALIZAR LA TERCERA FASE DEL PROYECTO DE PEATONALIZACIÓN DE LA CALLE 10, EJECUTANDO A PRECIOS UNITARIOS FIJOS EL TRAMO FALTANTE DE LA CONSTRUCCIÓN DE LA CALLE 10 ENTRE LAS CARRERA 5 Y CARRERA 6 EN LA LOCALIDAD DE LA CANDELARIA, EN BOGOTÁ D.C","Inversión","Bogotá Mejor para Todos",18,{"$f":"IF(ISERROR(VLOOKUP(K304,Eje_Pilar_Prop!$C$2:$E$104,2,FALSE)),\" \",VLOOKUP(K304,Eje_Pilar_Prop!$C$2:$E$104,2,FALSE))","v":"Mejor movilidad para todos"},{"$f":"IF(ISERROR(VLOOKUP(K304,Eje_Pilar_Prop!$C$2:$E$104,3,FALSE)),\" \",VLOOKUP(K304,Eje_Pilar_Prop!$C$2:$E$104,3,FALSE))","v":"Pilar 2 Democracía Urbana"},1391,"901350777-3","CONSORCIO DEL NORTE",null,null,null,1,11180698.110000001,11180698.110000001,0,"2019-12-20","2020-02-11","2021-01-28",150,2,352,null,null,null,null,null,null,"X",null,0,{"$f":"IF(SUMPRODUCT((A$14:A304=A304)*(B$14:B304=B304)*(D$14:D304=D304))>1,0,1)","v":0}]
[92020,"2020",null,"N/A","Otros gastos",null,"No aplica","PAGO HONORARIOS EDILES FONDO DESARROLLO LOCAL LA CANDELARIA, MES DESEPTIEMBRE DE 2020","Funcionamiento","Bogotá Mejor para Todos","No aplica","No Aplica","No Aplica","No Aplica","79593962","EDUARDO TITO GOMEZ CERON",7492000,null,null,null,null,7492000,7492000,"2020-10-21",null,null,null,null,null,null,null,null,null,null,null,null,null,1,{"$f":"IF(SUMPRODUCT((A$14:A305=A305)*(B$14:B305=B305)*(D$14:D305=D305))>1,0,1)","v":1}]
[92020,"2020",null,"N/A","Otros gastos",null,"No aplica","PAGO HONORARIOS EDILES FONDO DESARROLLO LOCAL LA CANDELARIA, MES DESEPTIEMBRE DE 2020","Funcionamiento","Bogotá Mejor para Todos","No aplica","No Aplica","No Aplica","No Aplica","3838495","JUAN CAMILO CASTELLANOS MEDINA",7492000,null,null,null,null,7492000,7492000,"2020-10-21",null,null,null,null,null,null,null,null,null,null,null,null,null,1,{"$f":"IF(SUMPRODUCT((A$14:A306=A306)*(B$14:B306=B306)*(D$14:D306=D306))>1,0,1)","v":0}]
[92020,"2020",null,"N/A","Otros gastos",null,"No aplica","PAGO HONORARIOS EDILES FONDO DESARROLLO LOCAL LA CANDELARIA, MES DESEPTIEMBRE DE 2020","Funcionamiento","Bogotá Mejor para Todos","No aplica","No Aplica","No Aplica","No Aplica","1010160868","GINNA ALEXANDRA QUIROGA GAMBOA",7492000,null,null,null,null,7492000,7492000,"2020-10-21",null,null,null,null,null,null,null,null,null,null,null,null,null,1,{"$f":"IF(SUMPRODUCT((A$14:A307=A307)*(B$14:B307=B307)*(D$14:D307=D307))>1,0,1)","v":0}]
[92020,"2020",null,"N/A","Otros gastos",null,"No aplica","PAGO HONORARIOS EDILES FONDO DESARROLLO LOCAL LA CANDELARIA, MES DESEPTIEMBRE DE 2020","Funcionamiento","Bogotá Mejor para Todos","No aplica","No Aplica","No Aplica","No Aplica","79687787","JUAN CARLOS MAHECHA ROBAYO",7492000,null,null,null,null,7492000,7492000,"2020-10-21",null,null,null,null,null,null,null,null,null,null,null,null,null,1,{"$f":"IF(SUMPRODUCT((A$14:A308=A308)*(B$14:B308=B308)*(D$14:D308=D308))>1,0,1)","v":0}]
[92020,"2020",null,"N/A","Otros gastos",null,"No aplica","PAGO HONORARIOS EDILES FONDO DESARROLLO LOCAL LA CANDELARIA, MES DESEPTIEMBRE DE 2020","Funcionamiento","Bogotá Mejor para Todos","No aplica","No Aplica","No Aplica","No Aplica","1010209957","MIGUEL ANGEL RODRIGUEZ RODRIGUEZ",7492000,null,null,null,null,7492000,7492000,"2020-10-21",null,null,null,null,null,null,null,null,null,null,null,null,null,1,{"$f":"IF(SUMPRODUCT((A$14:A309=A309)*(B$14:B309=B309)*(D$14:D309=D309))>1,0,1)","v":0}]
[92020,"2020",null,"N/A","Otros gastos",null,"No aplica","PAGO HONORARIOS EDILES FONDO DESARROLLO LOCAL LA CANDELARIA, MES DESEPTIEMBRE DE 2020","Funcionamiento","Bogotá Mejor para Todos","No aplica","No Aplica","No Aplica","No Aplica","79651441","ALVARO ENRIQUE SANCHEZ CARRILLO",7492000,null,null,null,null,7492000,7492000,"2020-10-21",null,null,null,null,null,null,null,null,null,null,null,null,null,1,{"$f":"IF(SUMPRODUCT((A$14:A310=A310)*(B$14:B310=B310)*(D$14:D310=D310))>1,0,1)","v":0}]
[92020,"2020",null,"N/A","Otros gastos",null,"No aplica","PAGO HONORARIOS EDILES FONDO DESARROLLO LOCAL LA CANDELARIA, MES DESEPTIEMBRE DE 2020","Funcionamiento","Bogotá Mejor para Todos","No aplica","No Aplica","No Aplica","No Aplica","88141104","DAGOBERTO  RODRIGUEZ MARTINEZ",7492000,null,null,null,null,7492000,7492000,"2020-10-21",null,null,null,null,null,null,null,null,null,null,null,null,null,1,{"$f":"IF(SUMPRODUCT((A$14:A311=A311)*(B$14:B311=B311)*(D$14:D311=D311))>1,0,1)","v":0}]
[911,"2020",null,"N/A","Otros gastos",null,"No aplica","PAGO DE LOS HONORARIOS DE LOS EDILES DE LA LOCALIDAD LA CANDELARIA, PORLAS SESIONES REALIZADAS DURANTE EL MES DE OCTUBRE DE 2020, CONFORME ALAS ACTAS ANEXAS, RELACIÓN DE ASISTNCIA Y CAUSACIÓN CONTABLE.","Funcionamiento","Bogotá Mejor para Todos","No aplica","No Aplica","No Aplica","No Aplica","79593962","EDUARDO TITO GOMEZ CERON",7492000,null,null,null,null,7492000,7492000,"2020-11-10",null,null,null,null,null,null,null,null,null,null,null,null,null,1,{"$f":"IF(SUMPRODUCT((A$14:A312=A312)*(B$14:B312=B312)*(D$14:D312=D312))>1,0,1)","v":1}]
[911,"2020",null,"N/A","Otros gastos",null,"No aplica","PAGO DE LOS HONORARIOS DE LOS EDILES DE LA LOCALIDAD LA CANDELARIA, PORLAS SESIONES REALIZADAS DURANTE EL MES DE OCTUBRE DE 2020, CONFORME ALAS ACTAS ANEXAS, RELACIÓN DE ASISTNCIA Y CAUSACIÓN CONTABLE.","Funcionamiento","Bogotá Mejor para Todos","No aplica","No Aplica","No Aplica","No Aplica","3838495","JUAN CAMILO CASTELLANOS MEDINA",7492000,null,null,null,null,7492000,7492000,"2020-11-10",null,null,null,null,null,null,null,null,null,null,null,null,null,1,{"$f":"IF(SUMPRODUCT((A$14:A313=A313)*(B$14:B313=B313)*(D$14:D313=D313))>1,0,1)","v":0}]
[911,"2020",null,"N/A","Otros gastos",null,"No aplica","PAGO DE LOS HONORARIOS DE LOS EDILES DE LA LOCALIDAD LA CANDELARIA, PORLAS SESIONES REALIZADAS DURANTE EL MES DE OCTUBRE DE 2020, CONFORME ALAS ACTAS ANEXAS, RELACIÓN DE ASISTNCIA Y CAUSACIÓN CONTABLE.","Funcionamiento","Bogotá Mejor para Todos","No aplica","No Aplica","No Aplica","No Aplica","1010160868","GINNA ALEXANDRA QUIROGA GAMBOA",7492000,null,null,null,null,7492000,7492000,"2020-11-10",null,null,null,null,null,null,null,null,null,null,null,null,null,1,{"$f":"IF(SUMPRODUCT((A$14:A314=A314)*(B$14:B314=B314)*(D$14:D314=D314))>1,0,1)","v":0}]
[911,"2020",null,"N/A","Otros gastos",null,"No aplica","PAGO DE LOS HONORARIOS DE LOS EDILES DE LA LOCALIDAD LA CANDELARIA, PORLAS SESIONES REALIZADAS DURANTE EL MES DE OCTUBRE DE 2020, CONFORME ALAS ACTAS ANEXAS, RELACIÓN DE ASISTNCIA Y CAUSACIÓN CONTABLE.","Funcionamiento","Bogotá Mejor para Todos","No aplica","No Aplica","No Aplica","No Aplica","79687787","JUAN CARLOS MAHECHA ROBAYO",7492000,null,null,null,null,7492000,7492000,"2020-11-10",null,null,null,null,null,null,null,null,null,null,null,null,null,1,{"$f":"IF(SUMPRODUCT((A$14:A315=A315)*(B$14:B315=B315)*(D$14:D315=D315))>1,0,1)","v":0}]
[911,"2020",null,"N/A","Otros gastos",null,"No aplica","PAGO DE LOS HONORARIOS DE LOS EDILES DE LA LOCALIDAD LA CANDELARIA, PORLAS SESIONES REALIZADAS DURANTE EL MES DE OCTUBRE DE 2020, CONFORME ALAS ACTAS ANEXAS, RELACIÓN DE ASISTNCIA Y CAUSACIÓN CONTABLE.","Funcionamiento","Bogotá Mejor para Todos","No aplica","No Aplica","No Aplica","No Aplica","1010209957","MIGUEL ANGEL RODRIGUEZ RODRIGUEZ",7492000,null,null,null,null,7492000,7492000,"2020-11-10",null,null,null,null,null,null,null,null,null,null,null,null,null,1,{"$f":"IF(SUMPRODUCT((A$14:A316=A316)*(B$14:B316=B316)*(D$14:D316=D316))>1,0,1)","v":0}]
[911,"2020",null,"N/A","Otros gastos",null,"No aplica","PAGO DE LOS HONORARIOS DE LOS EDILES DE LA LOCALIDAD LA CANDELARIA, PORLAS SESIONES REALIZADAS DURANTE EL MES DE OCTUBRE DE 2020, CONFORME ALAS ACTAS ANEXAS, RELACIÓN DE ASISTNCIA Y CAUSACIÓN CONTABLE.","Funcionamiento","Bogotá Mejor para Todos","No aplica","No Aplica","No Aplica","No Aplica","79651441","ALVARO ENRIQUE SANCHEZ CARRILLO",7492000,null,null,null,null,7492000,7492000,"2020-11-10",null,null,null,null,null,null,null,null,null,null,null,null,null,1,{"$f":"IF(SUMPRODUCT((A$14:A317=A317)*(B$14:B317=B317)*(D$14:D317=D317))>1,0,1)","v":0}]
[911,"2020",null,"N/A","Otros gastos",null,"No aplica","PAGO DE LOS HONORARIOS DE LOS EDILES DE LA LOCALIDAD LA CANDELARIA, PORLAS SESIONES REALIZADAS DURANTE EL MES DE OCTUBRE DE 2020, CONFORME ALAS ACTAS ANEXAS, RELACIÓN DE ASISTNCIA Y CAUSACIÓN CONTABLE.","Funcionamiento","Bogotá Mejor para Todos","No aplica","No Aplica","No Aplica","No Aplica","88141104","DAGOBERTO  RODRIGUEZ MARTINEZ",7492000,null,null,null,null,7492000,7492000,"2020-11-11",null,null,null,null,null,null,null,null,null,null,null,null,null,1,{"$f":"IF(SUMPRODUCT((A$14:A318=A318)*(B$14:B318=B318)*(D$14:D318=D318))>1,0,1)","v":0}]
[112020,"2020",null,"N/A","Otros gastos",null,"No aplica","VALOR DE LOS HONORARIOS DE LOS EDILES DE LA LOCALIDAD DE LA CANDELARIA,POR LA ASISTENCIA A LAS SESIONES REALIZADAS DURANTE EL MES DE NOVIEMBREDE 2020, CONFORME A LAS ACTAS ANEXAS, RELACIÓN DE ASISTENCIA Y CAUSACIÓNCONTABLE.","Funcionamiento","Bogotá Mejor para Todos","No aplica","No Aplica","No Aplica","No Aplica","79593962","EDUARDO TITO GOMEZ CERON",7492000,null,null,null,null,7492000,7492000,"2020-12-02",null,null,null,null,null,null,null,null,null,null,null,null,null,1,{"$f":"IF(SUMPRODUCT((A$14:A319=A319)*(B$14:B319=B319)*(D$14:D319=D319))>1,0,1)","v":1}]
[112020,"2020",null,"N/A","Otros gastos",null,"No aplica","VALOR DE LOS HONORARIOS DE LOS EDILES DE LA LOCALIDAD DE LA CANDELARIA,POR LA ASISTENCIA A LAS SESIONES REALIZADAS DURANTE EL MES DE NOVIEMBREDE 2020, CONFORME A LAS ACTAS ANEXAS, RELACIÓN DE ASISTENCIA Y CAUSACIÓNCONTABLE.","Funcionamiento","Bogotá Mejor para Todos","No aplica","No Aplica","No Aplica","No Aplica","3838495","JUAN CAMILO CASTELLANOS MEDINA",7492000,null,null,null,null,7492000,7492000,"2020-12-02",null,null,null,null,null,null,null,null,null,null,null,null,null,1,{"$f":"IF(SUMPRODUCT((A$14:A320=A320)*(B$14:B320=B320)*(D$14:D320=D320))>1,0,1)","v":0}]
[112020,"2020",null,"N/A","Otros gastos",null,"No aplica","VALOR DE LOS HONORARIOS DE LOS EDILES DE LA LOCALIDAD DE LA CANDELARIA,POR LA ASISTENCIA A LAS SESIONES REALIZADAS DURANTE EL MES DE NOVIEMBREDE 2020, CONFORME A LAS ACTAS ANEXAS, RELACIÓN DE ASISTENCIA Y CAUSACIÓNCONTABLE.","Funcionamiento","Bogotá Mejor para Todos","No aplica","No Aplica","No Aplica","No Aplica","1010160868","GINNA ALEXANDRA QUIROGA GAMBOA",7492000,null,null,null,null,7492000,7492000,"2020-12-02",null,null,null,null,null,null,null,null,null,null,null,null,null,1,{"$f":"IF(SUMPRODUCT((A$14:A321=A321)*(B$14:B321=B321)*(D$14:D321=D321))>1,0,1)","v":0}]
[112020,"2020",null,"N/A","Otros gastos",null,"No aplica","VALOR DE LOS HONORARIOS DE LOS EDILES DE LA LOCALIDAD DE LA CANDELARIA,POR LA ASISTENCIA A LAS SESIONES REALIZADAS DURANTE EL MES DE NOVIEMBREDE 2020, CONFORME A LAS ACTAS ANEXAS, RELACIÓN DE ASISTENCIA Y CAUSACIÓNCONTABLE.","Funcionamiento","Bogotá Mejor para Todos","No aplica","No Aplica","No Aplica","No Aplica","79687787","JUAN CARLOS MAHECHA ROBAYO",7492000,null,null,null,null,7492000,7492000,"2020-12-02",null,null,null,null,null,null,null,null,null,null,null,null,null,1,{"$f":"IF(SUMPRODUCT((A$14:A322=A322)*(B$14:B322=B322)*(D$14:D322=D322))>1,0,1)","v":0}]
[112020,"2020",null,"N/A","Otros gastos",null,"No aplica","VALOR DE LOS HONORARIOS DE LOS EDILES DE LA LOCALIDAD DE LA CANDELARIA,POR LA ASISTENCIA A LAS SESIONES REALIZADAS DURANTE EL MES DE NOVIEMBREDE 2020, CONFORME A LAS ACTAS ANEXAS, RELACIÓN DE ASISTENCIA Y CAUSACIÓNCONTABLE.","Funcionamiento","Bogotá Mejor para Todos","No aplica","No Aplica","No Aplica","No Aplica","88141104","DAGOBERTO  RODRIGUEZ MARTINEZ",7492000,null,null,null,null,7492000,7492000,"2020-12-02",null,null,null,null,null,null,null,null,null,null,null,null,null,1,{"$f":"IF(SUMPRODUCT((A$14:A323=A323)*(B$14:B323=B323)*(D$14:D323=D323))>1,0,1)","v":0}]
[112020,"2020",null,"N/A","Otros gastos",null,"No aplica","VALOR DE LOS HONORARIOS DE LOS EDILES DE LA LOCALIDAD DE LA CANDELARIA,POR LA ASISTENCIA A LAS SESIONES REALIZADAS DURANTE EL MES DE NOVIEMBREDE 2020, CONFORME A LAS ACTAS ANEXAS, RELACIÓN DE ASISTENCIA Y CAUSACIÓNCONTABLE.","Funcionamiento","Bogotá Mejor para Todos","No aplica","No Aplica","No Aplica","No Aplica","1010209957","MIGUEL ANGEL RODRIGUEZ RODRIGUEZ",7492000,null,null,null,null,7492000,7492000,"2020-12-02",null,null,null,null,null,null,null,null,null,null,null,null,null,1,{"$f":"IF(SUMPRODUCT((A$14:A324=A324)*(B$14:B324=B324)*(D$14:D324=D324))>1,0,1)","v":0}]
[112020,"2020",null,"N/A","Otros gastos",null,"No aplica","VALOR DE LOS HONORARIOS DE LOS EDILES DE LA LOCALIDAD DE LA CANDELARIA,POR LA ASISTENCIA A LAS SESIONES REALIZADAS DURANTE EL MES DE NOVIEMBREDE 2020, CONFORME A LAS ACTAS ANEXAS, RELACIÓN DE ASISTENCIA Y CAUSACIÓNCONTABLE.","Funcionamiento","Bogotá Mejor para Todos","No aplica","No Aplica","No Aplica","No Aplica","79651441","ALVARO ENRIQUE SANCHEZ CARRILLO",7492000,null,null,null,null,7492000,7492000,"2020-12-02",null,null,null,null,null,null,null,null,null,null,null,null,null,1,{"$f":"IF(SUMPRODUCT((A$14:A325=A325)*(B$14:B325=B325)*(D$14:D325=D325))>1,0,1)","v":0}]
[2812,"2020",null,"N/A","Otros gastos",null,"No aplica","PAGO DE LOS HONORARIOS DE LOS EDILES DE LA LOCALIDAD DE LA CANDELARIA,CORRESPONDIENTES AL MES DE DICIEMBRE DE 2020, SEGUN LAS ACTAS RECIBIDAS,LISTADO DE ASISTENCIA A LAS SESIONES Y CAUSACIÓN CONTABLE EMITIDA PORCONTABILIDAD.","Funcionamiento","Bogotá Mejor para Todos","No aplica","No Aplica","No Aplica","No Aplica","79593962","EDUARDO TITO GOMEZ CERON",7492000,null,null,null,null,7492000,7492000,"2020-12-28",null,null,null,null,null,null,null,null,null,null,null,null,null,1,{"$f":"IF(SUMPRODUCT((A$14:A326=A326)*(B$14:B326=B326)*(D$14:D326=D326))>1,0,1)","v":1}]
[2812,"2020",null,"N/A","Otros gastos",null,"No aplica","PAGO DE LOS HONORARIOS DE LOS EDILES DE LA LOCALIDAD DE LA CANDELARIA,CORRESPONDIENTES AL MES DE DICIEMBRE DE 2020, SEGUN LAS ACTAS RECIBIDAS,LISTADO DE ASISTENCIA A LAS SESIONES Y CAUSACIÓN CONTABLE EMITIDA PORCONTABILIDAD.","Funcionamiento","Bogotá Mejor para Todos","No aplica","No Aplica","No Aplica","No Aplica","3838495","JUAN CAMILO CASTELLANOS MEDINA",7492000,null,null,null,null,7492000,7492000,"2020-12-28",null,null,null,null,null,null,null,null,null,null,null,null,null,1,{"$f":"IF(SUMPRODUCT((A$14:A327=A327)*(B$14:B327=B327)*(D$14:D327=D327))>1,0,1)","v":0}]
[2812,"2020",null,"N/A","Otros gastos",null,"No aplica","PAGO DE LOS HONORARIOS DE LOS EDILES DE LA LOCALIDAD DE LA CANDELARIA,CORRESPONDIENTES AL MES DE DICIEMBRE DE 2020, SEGUN LAS ACTAS RECIBIDAS,LISTADO DE ASISTENCIA A LAS SESIONES Y CAUSACIÓN CONTABLE EMITIDA PORCONTABILIDAD.","Funcionamiento","Bogotá Mejor para Todos","No aplica","No Aplica","No Aplica","No Aplica","1010160868","GINNA ALEXANDRA QUIROGA GAMBOA",7492000,null,null,null,null,7492000,7492000,"2020-12-28",null,null,null,null,null,null,null,null,null,null,null,null,null,1,{"$f":"IF(SUMPRODUCT((A$14:A328=A328)*(B$14:B328=B328)*(D$14:D328=D328))>1,0,1)","v":0}]
[2812,"2020",null,"N/A","Otros gastos",null,"No aplica","PAGO DE LOS HONORARIOS DE LOS EDILES DE LA LOCALIDAD DE LA CANDELARIA,CORRESPONDIENTES AL MES DE DICIEMBRE DE 2020, SEGUN LAS ACTAS RECIBIDAS,LISTADO DE ASISTENCIA A LAS SESIONES Y CAUSACIÓN CONTABLE EMITIDA PORCONTABILIDAD.","Funcionamiento","Bogotá Mejor para Todos","No aplica","No Aplica","No Aplica","No Aplica","79687787","JUAN CARLOS MAHECHA ROBAYO",7492000,null,null,null,null,7492000,7492000,"2020-12-28",null,null,null,null,null,null,null,null,null,null,null,null,null,1,{"$f":"IF(SUMPRODUCT((A$14:A329=A329)*(B$14:B329=B329)*(D$14:D329=D329))>1,0,1)","v":0}]
[2812,"2020",null,"N/A","Otros gastos",null,"No aplica","PAGO DE LOS HONORARIOS DE LOS EDILES DE LA LOCALIDAD DE LA CANDELARIA,CORRESPONDIENTES AL MES DE DICIEMBRE DE 2020, SEGUN LAS ACTAS RECIBIDAS,LISTADO DE ASISTENCIA A LAS SESIONES Y CAUSACIÓN CONTABLE EMITIDA PORCONTABILIDAD.","Funcionamiento","Bogotá Mejor para Todos","No aplica","No Aplica","No Aplica","No Aplica","1010209957","MIGUEL ANGEL RODRIGUEZ RODRIGUEZ",7492000,null,null,null,null,7492000,7492000,"2020-12-28",null,null,null,null,null,null,null,null,null,null,null,null,null,1,{"$f":"IF(SUMPRODUCT((A$14:A330=A330)*(B$14:B330=B330)*(D$14:D330=D330))>1,0,1)","v":0}]
[2812,"2020",null,"N/A","Otros gastos",null,"No aplica","PAGO DE LOS HONORARIOS DE LOS EDILES DE LA LOCALIDAD DE LA CANDELARIA,CORRESPONDIENTES AL MES DE DICIEMBRE DE 2020, SEGUN LAS ACTAS RECIBIDAS,LISTADO DE ASISTENCIA A LAS SESIONES Y CAUSACIÓN CONTABLE EMITIDA PORCONTABILIDAD.","Funcionamiento","Bogotá Mejor para Todos","No aplica","No Aplica","No Aplica","No Aplica","88141104","DAGOBERTO  RODRIGUEZ MARTINEZ",7492000,null,null,null,null,7492000,7492000,"2020-12-28",null,null,null,null,null,null,null,null,null,null,null,null,null,1,{"$f":"IF(SUMPRODUCT((A$14:A331=A331)*(B$14:B331=B331)*(D$14:D331=D331))>1,0,1)","v":0}]
[2812,"2020",null,"N/A","Otros gastos",null,"No aplica","PAGO DE LOS HONORARIOS DE LOS EDILES DE LA LOCALIDAD DE LA CANDELARIA,CORRESPONDIENTES AL MES DE DICIEMBRE DE 2020, SEGUN LAS ACTAS RECIBIDAS,LISTADO DE ASISTENCIA A LAS SESIONES Y CAUSACIÓN CONTABLE EMITIDA PORCONTABILIDAD.","Funcionamiento","Bogotá Mejor para Todos","No aplica","No Aplica","No Aplica","No Aplica","79651441","ALVARO ENRIQUE SANCHEZ CARRILLO",7492000,null,null,null,null,7492000,7492000,"2020-12-28",null,null,null,null,null,null,null,null,null,null,null,null,null,1,{"$f":"IF(SUMPRODUCT((A$14:A332=A332)*(B$14:B332=B332)*(D$14:D332=D332))>1,0,1)","v":0}]
[1,"2020",null,"N/A","Otros gastos",null,"No aplica","V/R. DE LOS HONORARIOS DE LOS EDILES DE LA LOCALIDAD DE LA CANDELARIA POR LA ASISTENCIA A LAS SESIONES REALIZADAS DURANTE EL MES DE ENERO DE 2020, SEGUN RELACIÓN DE ASSITENCIA, ACTAS Y CAUSACIÓN CONTABLE.","Funcionamiento","Bogotá Mejor para Todos","No aplica","No Aplica","No Aplica","No Aplica","79593962","EDUARDO TITO GOMEZ CERON",7127100,null,null,null,null,7127100,7127100,"2020-01-30",null,null,null,null,null,null,null,null,null,null,null,null,null,1,{"$f":"IF(SUMPRODUCT((A$14:A333=A333)*(B$14:B333=B333)*(D$14:D333=D333))>1,0,1)","v":1}]
[1,"2020",null,"N/A","Otros gastos",null,"No aplica","V/R. DE LOS HONORARIOS DE LOS EDILES DE LA LOCALIDAD DE LA CANDELARIA POR LA ASISTENCIA A LAS SESIONES REALIZADAS DURANTE EL MES DE ENERO DE 2020, SEGUN RELACIÓN DE ASSITENCIA, ACTAS Y CAUSACIÓN CONTABLE.","Funcionamiento","Bogotá Mejor para Todos","No aplica","No Aplica","No Aplica","No Aplica","3838495","JUAN CAMILO CASTELLANOS MEDINA",7127100,null,null,null,null,7127100,7127100,"2020-01-30",null,null,null,null,null,null,null,null,null,null,null,null,null,1,{"$f":"IF(SUMPRODUCT((A$14:A334=A334)*(B$14:B334=B334)*(D$14:D334=D334))>1,0,1)","v":0}]
[1,"2020",null,"N/A","Otros gastos",null,"No aplica","V/R. DE LOS HONORARIOS DE LOS EDILES DE LA LOCALIDAD DE LA CANDELARIA POR LA ASISTENCIA A LAS SESIONES REALIZADAS DURANTE EL MES DE ENERO DE 2020, SEGUN RELACIÓN DE ASSITENCIA, ACTAS Y CAUSACIÓN CONTABLE.","Funcionamiento","Bogotá Mejor para Todos","No aplica","No Aplica","No Aplica","No Aplica","1010160868","GINNA ALEXANDRA QUIROGA GAMBOA",7127100,null,null,null,null,7127100,7127100,"2020-01-30",null,null,null,null,null,null,null,null,null,null,null,null,null,1,{"$f":"IF(SUMPRODUCT((A$14:A335=A335)*(B$14:B335=B335)*(D$14:D335=D335))>1,0,1)","v":0}]
[1,"2020",null,"N/A","Otros gastos",null,"No aplica","V/R. DE LOS HONORARIOS DE LOS EDILES DE LA LOCALIDAD DE LA CANDELARIA POR LA ASISTENCIA A LAS SESIONES REALIZADAS DURANTE EL MES DE ENERO DE 2020, SEGUN RELACIÓN DE ASSITENCIA, ACTAS Y CAUSACIÓN CONTABLE.","Funcionamiento","Bogotá Mejor para Todos","No aplica","No Aplica","No Aplica","No Aplica","79687787","JUAN CARLOS MAHECHA ROBAYO",7127100,null,null,null,null,7127100,7127100,"2020-01-30",null,null,null,null,null,null,null,null,null,null,null,null,null,1,{"$f":"IF(SUMPRODUCT((A$14:A336=A336)*(B$14:B336=B336)*(D$14:D336=D336))>1,0,1)","v":0}]
[1,"2020",null,"N/A","Otros gastos",null,"No aplica","V/R. DE LOS HONORARIOS DE LOS EDILES DE LA LOCALIDAD DE LA CANDELARIA POR LA ASISTENCIA A LAS SESIONES REALIZADAS DURANTE EL MES DE ENERO DE 2020, SEGUN RELACIÓN DE ASSITENCIA, ACTAS Y CAUSACIÓN CONTABLE.","Funcionamiento","Bogotá Mejor para Todos","No aplica","No Aplica","No Aplica","No Aplica","1010209957","MIGUEL ANGEL RODRIGUEZ RODRIGUEZ",7127100,null,null,null,null,7127100,7127100,"2020-01-30",null,null,null,null,null,null,null,null,null,null,null,null,null,1,{"$f":"IF(SUMPRODUCT((A$14:A337=A337)*(B$14:B337=B337)*(D$14:D337=D337))>1,0,1)","v":0}]
[1,"2020",null,"N/A","Otros gastos",null,"No aplica","V/R. DE LOS HONORARIOS DE LOS EDILES DE LA LOCALIDAD DE LA CANDELARIA POR LA ASISTENCIA A LAS SESIONES REALIZADAS DURANTE EL MES DE ENERO DE 2020, SEGUN RELACIÓN DE ASSITENCIA, ACTAS Y CAUSACIÓN CONTABLE.","Funcionamiento","Bogotá Mejor para Todos","No aplica","No Aplica","No Aplica","No Aplica","79651441","ALVARO ENRIQUE SANCHEZ CARRILLO",7127100,null,null,null,null,7127100,7127100,"2020-01-30",null,null,null,null,null,null,null,null,null,null,null,null,null,1,{"$f":"IF(SUMPRODUCT((A$14:A338=A338)*(B$14:B338=B338)*(D$14:D338=D338))>1,0,1)","v":0}]
[1,"2020",null,"N/A","Otros gastos",null,"No aplica","V/R. DE LOS HONORARIOS DE LOS EDILES DE LA LOCALIDAD DE LA CANDELARIA POR LA ASISTENCIA A LAS SESIONES REALIZADAS DURANTE EL MES DE ENERO DE 2020, SEGUN RELACIÓN DE ASSITENCIA, ACTAS Y CAUSACIÓN CONTABLE.","Funcionamiento","Bogotá Mejor para Todos","No aplica","No Aplica","No Aplica","No Aplica","88141104","DAGOBERTO  RODRIGUEZ MARTINEZ",7127100,null,null,null,null,7127100,7127100,"2020-01-30",null,null,null,null,null,null,null,null,null,null,null,null,null,1,{"$f":"IF(SUMPRODUCT((A$14:A339=A339)*(B$14:B339=B339)*(D$14:D339=D339))>1,0,1)","v":0}]
[2,"2020",null,"N/A","Otros gastos",null,"No aplica","VALOR HONORARIOS EDILES  DE LA LOCALIDAD DE LA CANDELARIA POR LAS SESIONES REALIZADAS Y ASISTIDAS EN EL MES DE FEBRERO","Funcionamiento","Bogotá Mejor para Todos","No aplica","No Aplica","No Aplica","No Aplica","79593962","EDUARDO TITO GOMEZ CERON",7127100,null,null,null,null,7127100,7127100,"2020-03-02",null,null,null,null,null,null,null,null,null,null,null,null,null,1,{"$f":"IF(SUMPRODUCT((A$14:A340=A340)*(B$14:B340=B340)*(D$14:D340=D340))>1,0,1)","v":1}]
[2,"2020",null,"N/A","Otros gastos",null,"No aplica","VALOR HONORARIOS EDILES  DE LA LOCALIDAD DE LA CANDELARIA POR LAS SESIONES REALIZADAS Y ASISTIDAS","Funcionamiento","Bogotá Mejor para Todos","No aplica","No Aplica","No Aplica","No Aplica","3838495","JUAN CAMILO CASTELLANOS MEDINA",7127100,null,null,null,null,7127100,7127100,"2020-03-02",null,null,null,null,null,null,null,null,null,null,null,null,null,1,{"$f":"IF(SUMPRODUCT((A$14:A341=A341)*(B$14:B341=B341)*(D$14:D341=D341))>1,0,1)","v":0}]
[2,"2020",null,"N/A","Otros gastos",null,"No aplica","VALOR HONORARIOS EDILES  DE LA LOCALIDAD DE LA CANDELARIA POR LAS SESIONES REALIZADAS Y ASISTIDAS EN EL MES DE FEBRERO","Funcionamiento","Bogotá Mejor para Todos","No aplica","No Aplica","No Aplica","No Aplica","1010160868","GINNA ALEXANDRA QUIROGA GAMBOA",7127100,null,null,null,null,7127100,7127100,"2020-03-02",null,null,null,null,null,null,null,null,null,null,null,null,null,1,{"$f":"IF(SUMPRODUCT((A$14:A342=A342)*(B$14:B342=B342)*(D$14:D342=D342))>1,0,1)","v":0}]
[2,"2020",null,"N/A","Otros gastos",null,"No aplica","VALOR HONORARIOS EDILES  DE LA LOCALIDAD DE LA CANDELARIA POR LAS SESIONES REALIZADAS Y ASISTIDAS EN EL MES DE FEBRERO","Funcionamiento","Bogotá Mejor para Todos","No aplica","No Aplica","No Aplica","No Aplica","79687787","JUAN CARLOS MAHECHA ROBAYO",7127100,null,null,null,null,7127100,7127100,"2020-03-02",null,null,null,null,null,null,null,null,null,null,null,null,null,1,{"$f":"IF(SUMPRODUCT((A$14:A343=A343)*(B$14:B343=B343)*(D$14:D343=D343))>1,0,1)","v":0}]
[2,"2020",null,"N/A","Otros gastos",null,"No aplica","VALOR HONORARIOS EDILES  DE LA LOCALIDAD DE LA CANDELARIA POR LAS SESIONES REALIZADAS Y ASISTIDAS","Funcionamiento","Bogotá Mejor para Todos","No aplica","No Aplica","No Aplica","No Aplica","1010209957","MIGUEL ANGEL RODRIGUEZ RODRIGUEZ",7127100,null,null,null,null,7127100,7127100,"2020-03-02",null,null,null,null,null,null,null,null,null,null,null,null,null,1,{"$f":"IF(SUMPRODUCT((A$14:A344=A344)*(B$14:B344=B344)*(D$14:D344=D344))>1,0,1)","v":0}]
[2,"2020",null,"N/A","Otros gastos",null,"No aplica","VALOR HONORARIOS EDILES  DE LA LOCALIDAD DE LA CANDELARIA POR LAS SESIONES REALIZADAS Y ASISTIDAS","Funcionamiento","Bogotá Mejor para Todos","No aplica","No Aplica","No Aplica","No Aplica","79651441","ALVARO ENRIQUE SANCHEZ CARRILLO",7127100,null,null,null,null,7127100,7127100,"2020-03-02",null,null,null,null,null,null,null,null,null,null,null,null,null,1,{"$f":"IF(SUMPRODUCT((A$14:A345=A345)*(B$14:B345=B345)*(D$14:D345=D345))>1,0,1)","v":0}]
[2,"2020",null,"N/A","Otros gastos",null,"No aplica","VALOR HONORARIOS EDILES  DE LA LOCALIDAD DE LA CANDELARIA POR LAS SESIONES REALIZADAS Y ASISTIDAS","Funcionamiento","Bogotá Mejor para Todos","No aplica","No Aplica","No Aplica","No Aplica","88141104","DAGOBERTO  RODRIGUEZ MARTINEZ",7127100,null,null,null,null,7127100,7127100,"2020-03-02",null,null,null,null,null,null,null,null,null,null,null,null,null,1,{"$f":"IF(SUMPRODUCT((A$14:A346=A346)*(B$14:B346=B346)*(D$14:D346=D346))>1,0,1)","v":0}]
[3,"2020",null,"N/A","Otros gastos",null,"No aplica","V/R. DE LOS  HONORARIOS DE LOS EDILES DE LA LOCALIDAD POR LA ASISTENCIA A LAS SESIONES REALIZADAS DURANTE EL MES DE MARZO DE 2020, SEGUN ACTAS, RELACIÓN DE ASISTENCIA Y CAUSACIÓN CONTABLE.","Funcionamiento","Bogotá Mejor para Todos","No aplica","No Aplica","No Aplica","No Aplica","79593962","EDUARDO TITO GOMEZ CERON",7492000,null,null,null,null,7492000,7492000,"2020-03-25",null,null,null,null,null,null,null,null,null,null,null,null,null,1,{"$f":"IF(SUMPRODUCT((A$14:A347=A347)*(B$14:B347=B347)*(D$14:D347=D347))>1,0,1)","v":1}]
[3,"2020",null,"N/A","Otros gastos",null,"No aplica","V/R. DE LOS  HONORARIOS DE LOS EDILES DE LA LOCALIDAD POR LA ASISTENCIA A LAS SESIONES REALIZADAS DURANTE EL MES DE MARZO DE 2020, SEGUN ACTAS, RELACIÓN DE ASISTENCIA Y CAUSACIÓN CONTABLE.","Funcionamiento","Bogotá Mejor para Todos","No aplica","No Aplica","No Aplica","No Aplica","3838495","JUAN CAMILO CASTELLANOS MEDINA",7492000,null,null,null,null,7492000,7492000,"2020-03-25",null,null,null,null,null,null,null,null,null,null,null,null,null,1,{"$f":"IF(SUMPRODUCT((A$14:A348=A348)*(B$14:B348=B348)*(D$14:D348=D348))>1,0,1)","v":0}]
[3,"2020",null,"N/A","Otros gastos",null,"No aplica","V/R. DE LOS  HONORARIOS DE LOS EDILES DE LA LOCALIDAD POR LA ASISTENCIA A LAS SESIONES REALIZADAS DURANTE EL MES DE MARZO DE 2020, SEGUN ACTAS, RELACIÓN DE ASISTENCIA Y CAUSACIÓN CONTABLE.","Funcionamiento","Bogotá Mejor para Todos","No aplica","No Aplica","No Aplica","No Aplica","1010160868","GINNA ALEXANDRA QUIROGA GAMBOA",7492000,null,null,null,null,7492000,7492000,"2020-03-25",null,null,null,null,null,null,null,null,null,null,null,null,null,1,{"$f":"IF(SUMPRODUCT((A$14:A349=A349)*(B$14:B349=B349)*(D$14:D349=D349))>1,0,1)","v":0}]
[3,"2020",null,"N/A","Otros gastos",null,"No aplica","V/R. DE LOS  HONORARIOS DE LOS EDILES DE LA LOCALIDAD POR LA ASISTENCIA A LAS SESIONES REALIZADAS DURANTE EL MES DE MARZO DE 2020, SEGUN ACTAS, RELACIÓN DE ASISTENCIA Y CAUSACIÓN CONTABLE.","Funcionamiento","Bogotá Mejor para Todos","No aplica","No Aplica","No Aplica","No Aplica","79687787","JUAN CARLOS MAHECHA ROBAYO",7492000,null,null,null,null,7492000,7492000,"2020-03-25",null,null,null,null,null,null,null,null,null,null,null,null,null,1,{"$f":"IF(SUMPRODUCT((A$14:A350=A350)*(B$14:B350=B350)*(D$14:D350=D350))>1,0,1)","v":0}]
[3,"2020",null,"N/A","Otros gastos",null,"No aplica","V/R. DE LOS  HONORARIOS DE LOS EDILES DE LA LOCALIDAD POR LA ASISTENCIA A LAS SESIONES REALIZADAS DURANTE EL MES DE MARZO DE 2020, SEGUN ACTAS, RELACIÓN DE ASISTENCIA Y CAUSACIÓN CONTABLE.","Funcionamiento","Bogotá Mejor para Todos","No aplica","No Aplica","No Aplica","No Aplica","1010209957","MIGUEL ANGEL RODRIGUEZ RODRIGUEZ",7492000,null,null,null,null,7492000,7492000,"2020-03-25",null,null,null,null,null,null,null,null,null,null,null,null,null,1,{"$f":"IF(SUMPRODUCT((A$14:A351=A351)*(B$14:B351=B351)*(D$14:D351=D351))>1,0,1)","v":0}]
[3,"2020",null,"N/A","Otros gastos",null,"No aplica","V/R. DE LOS  HONORARIOS DE LOS EDILES DE LA LOCALIDAD POR LA ASISTENCIA A LAS SESIONES REALIZADAS DURANTE EL MES DE MARZO DE 2020, SEGUN ACTAS, RELACIÓN DE ASISTENCIA Y CAUSACIÓN CONTABLE.","Funcionamiento","Bogotá Mejor para Todos","No aplica","No Aplica","No Aplica","No Aplica","79651441","ALVARO ENRIQUE SANCHEZ CARRILLO",7492000,null,null,null,null,7492000,7492000,"2020-03-25",null,null,null,null,null,null,null,null,null,null,null,null,null,1,{"$f":"IF(SUMPRODUCT((A$14:A352=A352)*(B$14:B352=B352)*(D$14:D352=D352))>1,0,1)","v":0}]
[3,"2020",null,"N/A","Otros gastos",null,"No aplica","V/R. DE LOS  HONORARIOS DE LOS EDILES DE LA LOCALIDAD POR LA ASISTENCIA A LAS SESIONES REALIZADAS DURANTE EL MES DE MARZO DE 2020, SEGUN ACTAS, RELACIÓN DE ASISTENCIA Y CAUSACIÓN CONTABLE.","Funcionamiento","Bogotá Mejor para Todos","No aplica","No Aplica","No Aplica","No Aplica","88141104","DAGOBERTO  RODRIGUEZ MARTINEZ",7492000,null,null,null,null,7492000,7492000,"2020-03-25",null,null,null,null,null,null,null,null,null,null,null,null,null,1,{"$f":"IF(SUMPRODUCT((A$14:A353=A353)*(B$14:B353=B353)*(D$14:D353=D353))>1,0,1)","v":0}]
[4,"2020",null,"N/A","Otros gastos",null,"No aplica","V/R. DE LOS HONORARIOS DE LOS EDILES DE LA LOCALIDAD DE LA CANDELARIA, POR LA ASSITENCIA A LAS SESIONES REALIZADAS DURANTE EL MES DE ABRIL DE 2020 AL IGUAL DE DEL VALOR CORRESPONDIENTE AL INCREMENTO DE LOS MESES DE NERO Y FEBRERO DE 2020.","Funcionamiento","Bogotá Mejor para Todos","No aplica","No Aplica","No Aplica","No Aplica","79593962","EDUARDO TITO GOMEZ CERON",8221800,null,null,null,null,8221800,8221800,"2020-05-02",null,null,null,null,null,null,null,null,null,null,null,null,null,1,{"$f":"IF(SUMPRODUCT((A$14:A354=A354)*(B$14:B354=B354)*(D$14:D354=D354))>1,0,1)","v":1}]
[4,"2020",null,"N/A","Otros gastos",null,"No aplica","V/R. DE LOS HONORARIOS DE LOS EDILES DE LA LOCALIDAD DE LA CANDELARIA, POR LA ASSITENCIA A LAS SESIONES REALIZADAS DURANTE EL MES DE ABRIL DE 2020 AL IGUAL DE DEL VALOR CORRESPONDIENTE AL INCREMENTO DE LOS MESES DE NERO Y FEBRERO DE 2020.","Funcionamiento","Bogotá Mejor para Todos","No aplica","No Aplica","No Aplica","No Aplica","3838495","JUAN CAMILO CASTELLANOS MEDINA",8221800,null,null,null,null,8221800,8221800,"2020-05-02",null,null,null,null,null,null,null,null,null,null,null,null,null,{"$f":"IF(ISERROR(W355/V355),\"-\",(W355/V355))","v":1},{"$f":"IF(SUMPRODUCT((A$14:A355=A355)*(B$14:B355=B355)*(D$14:D355=D355))>1,0,1)","v":0}]
[4,"2020",null,"N/A","Otros gastos",null,"No aplica","V/R. DE LOS HONORARIOS DE LOS EDILES DE LA LOCALIDAD DE LA CANDELARIA, POR LA ASSITENCIA A LAS SESIONES REALIZADAS DURANTE EL MES DE ABRIL DE 2020 AL IGUAL DE DEL VALOR CORRESPONDIENTE AL INCREMENTO DE LOS MESES DE NERO Y FEBRERO DE 2020.","Funcionamiento","Bogotá Mejor para Todos","No aplica","No Aplica","No Aplica","No Aplica","1010160868","GINNA ALEXANDRA QUIROGA GAMBOA",8221800,null,null,null,null,8221800,8221800,"2020-05-02",null,null,null,null,null,null,null,null,null,null,null,null,null,1,{"$f":"IF(SUMPRODUCT((A$14:A356=A356)*(B$14:B356=B356)*(D$14:D356=D356))>1,0,1)","v":0}]
[4,"2020",null,"N/A","Otros gastos",null,"No aplica","V/R. DE LOS HONORARIOS DE LOS EDILES DE LA LOCALIDAD DE LA CANDELARIA, POR LA ASSITENCIA A LAS SESIONES REALIZADAS DURANTE EL MES DE ABRIL DE 2020 AL IGUAL DE DEL VALOR CORRESPONDIENTE AL INCREMENTO DE LOS MESES DE NERO Y FEBRERO DE 2020.","Funcionamiento","Bogotá Mejor para Todos","No aplica","No Aplica","No Aplica","No Aplica","79687787","JUAN CARLOS MAHECHA ROBAYO",8221800,null,null,null,null,8221800,8221800,"2020-05-02",null,null,null,null,null,null,null,null,null,null,null,null,null,1,{"$f":"IF(SUMPRODUCT((A$14:A357=A357)*(B$14:B357=B357)*(D$14:D357=D357))>1,0,1)","v":0}]
[4,"2020",null,"N/A","Otros gastos",null,"No aplica","V/R. DE LOS HONORARIOS DE LOS EDILES DE LA LOCALIDAD DE LA CANDELARIA, POR LA ASSITENCIA A LAS SESIONES REALIZADAS DURANTE EL MES DE ABRIL DE 2020 AL IGUAL DE DEL VALOR CORRESPONDIENTE AL INCREMENTO DE LOS MESES DE NERO Y FEBRERO DE 2020.","Funcionamiento","Bogotá Mejor para Todos","No aplica","No Aplica","No Aplica","No Aplica","1010209957","MIGUEL ANGEL RODRIGUEZ RODRIGUEZ",8221800,null,null,null,null,8221800,8221800,"2020-05-02",null,null,null,null,null,null,null,null,null,null,null,null,null,1,{"$f":"IF(SUMPRODUCT((A$14:A358=A358)*(B$14:B358=B358)*(D$14:D358=D358))>1,0,1)","v":0}]
[4,"2020",null,"N/A","Otros gastos",null,"No aplica","V/R. DE LOS HONORARIOS DE LOS EDILES DE LA LOCALIDAD DE LA CANDELARIA, POR LA ASSITENCIA A LAS SESIONES REALIZADAS DURANTE EL MES DE ABRIL DE 2020 AL IGUAL DE DEL VALOR CORRESPONDIENTE AL INCREMENTO DE LOS MESES DE NERO Y FEBRERO DE 2020.","Funcionamiento","Bogotá Mejor para Todos","No aplica","No Aplica","No Aplica","No Aplica","79651441","ALVARO ENRIQUE SANCHEZ CARRILLO",8221800,null,null,null,null,8221800,8221800,"2020-05-02",null,null,null,null,null,null,null,null,null,null,null,null,null,1,{"$f":"IF(SUMPRODUCT((A$14:A359=A359)*(B$14:B359=B359)*(D$14:D359=D359))>1,0,1)","v":0}]
[4,"2020",null,"N/A","Otros gastos",null,"No aplica","V/R. DE LOS HONORARIOS DE LOS EDILES DE LA LOCALIDAD DE LA CANDELARIA, POR LA ASSITENCIA A LAS SESIONES REALIZADAS DURANTE EL MES DE ABRIL DE 2020 AL IGUAL DE DEL VALOR CORRESPONDIENTE AL INCREMENTO DE LOS MESES DE NERO Y FEBRERO DE 2020.","Funcionamiento","Bogotá Mejor para Todos","No aplica","No Aplica","No Aplica","No Aplica","88141104","DAGOBERTO  RODRIGUEZ MARTINEZ",8221800,null,null,null,null,8221800,8221800,"2020-05-02",null,null,null,null,null,null,null,null,null,null,null,null,null,1,{"$f":"IF(SUMPRODUCT((A$14:A360=A360)*(B$14:B360=B360)*(D$14:D360=D360))>1,0,1)","v":0}]
[5,"2020",null,"N/A","Otros gastos",null,"No aplica","V/R. DE LOS HONORARIOS DE LOS EDILES DE LA LOCALIDAD DE LA CANDELARIA POR LA ASISTENCIA A LAS SESIONES REALIZADS DURANTE EL MES D MAYO DE 2020, ACORDE A LAS ACTAS ANEXAS, RELACIÓN DE ASISTENCIA Y CAUSACIÓN CONTABLE.","Funcionamiento","Bogotá Mejor para Todos","No aplica","No Aplica","No Aplica","No Aplica","79593962","EDUARDO TITO GOMEZ CERON",7492000,null,null,null,null,7492000,7492000,"2020-05-31",null,null,null,null,null,null,null,null,null,null,null,null,null,1,{"$f":"IF(SUMPRODUCT((A$14:A361=A361)*(B$14:B361=B361)*(D$14:D361=D361))>1,0,1)","v":1}]
[5,"2020",null,"N/A","Otros gastos",null,"No aplica","V/R. DE LOS HONORARIOS DE LOS EDILES DE LA LOCALIDAD DE LA CANDELARIA POR LA ASISTENCIA A LAS SESIONES REALIZADS DURANTE EL MES D MAYO DE 2020, ACORDE A LAS ACTAS ANEXAS, RELACIÓN DE ASISTENCIA Y CAUSACIÓN CONTABLE.","Funcionamiento","Bogotá Mejor para Todos","No aplica","No Aplica","No Aplica","No Aplica","3838495","JUAN CAMILO CASTELLANOS MEDINA",7492000,null,null,null,null,7492000,7492000,"2020-05-31",null,null,null,null,null,null,null,null,null,null,null,null,null,1,{"$f":"IF(SUMPRODUCT((A$14:A362=A362)*(B$14:B362=B362)*(D$14:D362=D362))>1,0,1)","v":0}]
[5,"2020",null,"N/A","Otros gastos",null,"No aplica","V/R. DE LOS HONORARIOS DE LOS EDILES DE LA LOCALIDAD DE LA CANDELARIA POR LA ASISTENCIA A LAS SESIONES REALIZADS DURANTE EL MES D MAYO DE 2020, ACORDE A LAS ACTAS ANEXAS, RELACIÓN DE ASISTENCIA Y CAUSACIÓN CONTABLE.","Funcionamiento","Bogotá Mejor para Todos","No aplica","No Aplica","No Aplica","No Aplica","1010160868","GINNA ALEXANDRA QUIROGA GAMBOA",7492000,null,null,null,null,7492000,7492000,"2020-05-31",null,null,null,null,null,null,null,null,null,null,null,null,null,1,{"$f":"IF(SUMPRODUCT((A$14:A363=A363)*(B$14:B363=B363)*(D$14:D363=D363))>1,0,1)","v":0}]
[5,"2020",null,"N/A","Otros gastos",null,"No aplica","V/R. DE LOS HONORARIOS DE LOS EDILES DE LA LOCALIDAD DE LA CANDELARIA POR LA ASISTENCIA A LAS SESIONES REALIZADS DURANTE EL MES D MAYO DE 2020, ACORDE A LAS ACTAS ANEXAS, RELACIÓN DE ASISTENCIA Y CAUSACIÓN CONTABLE.","Funcionamiento","Bogotá Mejor para Todos","No aplica","No Aplica","No Aplica","No Aplica","79687787","JUAN CARLOS MAHECHA ROBAYO",7492000,null,null,null,null,7492000,7492000,"2020-05-31",null,null,null,null,null,null,null,null,null,null,null,null,null,1,{"$f":"IF(SUMPRODUCT((A$14:A364=A364)*(B$14:B364=B364)*(D$14:D364=D364))>1,0,1)","v":0}]
[5,"2020",null,"N/A","Otros gastos",null,"No aplica","V/R. DE LOS HONORARIOS DE LOS EDILES DE LA LOCALIDAD DE LA CANDELARIA POR LA ASISTENCIA A LAS SESIONES REALIZADS DURANTE EL MES D MAYO DE 2020, ACORDE A LAS ACTAS ANEXAS, RELACIÓN DE ASISTENCIA Y CAUSACIÓN CONTABLE.","Funcionamiento","Bogotá Mejor para Todos","No aplica","No Aplica","No Aplica","No Aplica","1010209957","MIGUEL ANGEL RODRIGUEZ RODRIGUEZ",7492000,null,null,null,null,7492000,7492000,"2020-05-31",null,null,null,null,null,null,null,null,null,null,null,null,null,1,{"$f":"IF(SUMPRODUCT((A$14:A365=A365)*(B$14:B365=B365)*(D$14:D365=D365))>1,0,1)","v":0}]
[5,"2020",null,"N/A","Otros gastos",null,"No aplica","V/R. DE LOS HONORARIOS DE LOS EDILES DE LA LOCALIDAD DE LA CANDELARIA POR LA ASISTENCIA A LAS SESIONES REALIZADS DURANTE EL MES D MAYO DE 2020, ACORDE A LAS ACTAS ANEXAS, RELACIÓN DE ASISTENCIA Y CAUSACIÓN CONTABLE.","Funcionamiento","Bogotá Mejor para Todos","No aplica","No Aplica","No Aplica","No Aplica","79651441","ALVARO ENRIQUE SANCHEZ CARRILLO",7492000,null,null,null,null,7492000,7492000,"2020-05-31",null,null,null,null,null,null,null,null,null,null,null,null,null,1,{"$f":"IF(SUMPRODUCT((A$14:A366=A366)*(B$14:B366=B366)*(D$14:D366=D366))>1,0,1)","v":0}]
[5,"2020",null,"N/A","Otros gastos",null,"No aplica","V/R. DE LOS HONORARIOS DE LOS EDILES DE LA LOCALIDAD DE LA CANDELARIA POR LA ASISTENCIA A LAS SESIONES REALIZADS DURANTE EL MES D MAYO DE 2020, ACORDE A LAS ACTAS ANEXAS, RELACIÓN DE ASISTENCIA Y CAUSACIÓN CONTABLE.","Funcionamiento","Bogotá Mejor para Todos","No aplica","No Aplica","No Aplica","No Aplica","88141104","DAGOBERTO  RODRIGUEZ MARTINEZ",7492000,null,null,null,null,{"$f":"+Q367+S367+U367","v":7492000},7492000,"2020-05-31",null,null,null,null,null,null,null,null,null,null,null,null,null,1,{"$f":"IF(SUMPRODUCT((A$14:A367=A367)*(B$14:B367=B367)*(D$14:D367=D367))>1,0,1)","v":0}]
[5,"2020",null,"N/A","Otros gastos",null,"No aplica","V/R. AJUSTE ARL DEL EDIL EDUARDO TITO, SEGUN HONORARIOS DEL MES DE MAYO DE 2020","Funcionamiento","Bogotá Mejor para Todos","No aplica","No Aplica","No Aplica","No Aplica",860011153,"POSITIVA COMPAÑIA DE SEGUROS SA",1000,null,null,null,null,1000,1000,"2020-06-02",null,null,null,null,null,null,null,null,null,null,null,null,null,1,{"$f":"IF(SUMPRODUCT((A$14:A368=A368)*(B$14:B368=B368)*(D$14:D368=D368))>1,0,1)","v":0}]
[6,"2020",null,"N/A","Otros gastos",null,"No aplica","V/R. DE LOS HONORARIOS DE LOS EDILES DE LA LOCALIDAD DE LA CANDELARIA POR LA ASISTENCIA A LAS SESIONES RALIZADAS DURANTE EL MES JUNIO DE 2020, ACORDE A LAS ACTAS, RELACIÓN DE ASISTENCIA Y CAUSACIÓN CONTABLE RESPECTIVA.","Funcionamiento","Bogotá Mejor para Todos","No aplica","No Aplica","No Aplica","No Aplica","79593962","EDUARDO TITO GOMEZ CERON",7492000,null,null,null,null,7492000,7492000,"2020-06-30",null,null,null,null,null,null,null,null,null,null,null,null,null,1,{"$f":"IF(SUMPRODUCT((A$14:A369=A369)*(B$14:B369=B369)*(D$14:D369=D369))>1,0,1)","v":1}]
[6,"2020",null,"N/A","Otros gastos",null,"No aplica","V/R. DE LOS HONORARIOS DE LOS EDILES DE LA LOCALIDAD DE LA CANDELARIA POR LA ASISTENCIA A LAS SESIONES RALIZADAS DURANTE EL MES JUNIO DE 2020, ACORDE A LAS ACTAS, RELACIÓN DE ASISTENCIA Y CAUSACIÓN CONTABLE RESPECTIVA.","Funcionamiento","Bogotá Mejor para Todos","No aplica","No Aplica","No Aplica","No Aplica","3838495","JUAN CAMILO CASTELLANOS MEDINA",7492000,null,null,null,null,7492000,7492000,"2020-06-30",null,null,null,null,null,null,null,null,null,null,null,null,null,1,{"$f":"IF(SUMPRODUCT((A$14:A370=A370)*(B$14:B370=B370)*(D$14:D370=D370))>1,0,1)","v":0}]
[6,"2020",null,"N/A","Otros gastos",null,"No aplica","V/R. DE LOS HONORARIOS DE LOS EDILES DE LA LOCALIDAD DE LA CANDELARIA POR LA ASISTENCIA A LAS SESIONES RALIZADAS DURANTE EL MES JUNIO DE 2020, ACORDE A LAS ACTAS, RELACIÓN DE ASISTENCIA Y CAUSACIÓN CONTABLE RESPECTIVA.","Funcionamiento","Bogotá Mejor para Todos","No aplica","No Aplica","No Aplica","No Aplica","1010160868","GINNA ALEXANDRA QUIROGA GAMBOA",7492000,null,null,null,null,7492000,7492000,"2020-06-30",null,null,null,null,null,null,null,null,null,null,null,null,null,1,{"$f":"IF(SUMPRODUCT((A$14:A371=A371)*(B$14:B371=B371)*(D$14:D371=D371))>1,0,1)","v":0}]
[6,"2020",null,"N/A","Otros gastos",null,"No aplica","V/R. DE LOS HONORARIOS DE LOS EDILES DE LA LOCALIDAD DE LA CANDELARIA POR LA ASISTENCIA A LAS SESIONES RALIZADAS DURANTE EL MES JUNIO DE 2020, ACORDE A LAS ACTAS, RELACIÓN DE ASISTENCIA Y CAUSACIÓN CONTABLE RESPECTIVA.","Funcionamiento","Bogotá Mejor para Todos","No aplica","No Aplica","No Aplica","No Aplica","79687787","JUAN CARLOS MAHECHA ROBAYO",7492000,null,null,null,null,7492000,7492000,"2020-06-30",null,null,null,null,null,null,null,null,null,null,null,null,null,1,{"$f":"IF(SUMPRODUCT((A$14:A372=A372)*(B$14:B372=B372)*(D$14:D372=D372))>1,0,1)","v":0}]
[6,"2020",null,"N/A","Otros gastos",null,"No aplica","V/R. DE LOS HONORARIOS DE LOS EDILES DE LA LOCALIDAD DE LA CANDELARIA POR LA ASISTENCIA A LAS SESIONES RALIZADAS DURANTE EL MES JUNIO DE 2020, ACORDE A LAS ACTAS, RELACIÓN DE ASISTENCIA Y CAUSACIÓN CONTABLE RESPECTIVA.","Funcionamiento","Bogotá Mejor para Todos","No aplica","No Aplica","No Aplica","No Aplica","1010209957","MIGUEL ANGEL RODRIGUEZ RODRIGUEZ",7492000,null,null,null,null,7492000,7492000,"2020-06-30",null,null,null,null,null,null,null,null,null,null,null,null,null,1,{"$f":"IF(SUMPRODUCT((A$14:A373=A373)*(B$14:B373=B373)*(D$14:D373=D373))>1,0,1)","v":0}]
[6,"2020",null,"N/A","Otros gastos",null,"No aplica","V/R. DE LOS HONORARIOS DE LOS EDILES DE LA LOCALIDAD DE LA CANDELARIA POR LA ASISTENCIA A LAS SESIONES RALIZADAS DURANTE EL MES JUNIO DE 2020, ACORDE A LAS ACTAS, RELACIÓN DE ASISTENCIA Y CAUSACIÓN CONTABLE RESPECTIVA.","Funcionamiento","Bogotá Mejor para Todos","No aplica","No Aplica","No Aplica","No Aplica","79651441","ALVARO ENRIQUE SANCHEZ CARRILLO",7492000,null,null,null,null,7492000,7492000,"2020-06-30",null,null,null,null,null,null,null,null,null,null,null,null,null,1,{"$f":"IF(SUMPRODUCT((A$14:A374=A374)*(B$14:B374=B374)*(D$14:D374=D374))>1,0,1)","v":0}]
[6,"2020",null,"N/A","Otros gastos",null,"No aplica","V/R. DE LOS HONORARIOS DE LOS EDILES DE LA LOCALIDAD DE LA CANDELARIA POR LA ASISTENCIA A LAS SESIONES RALIZADAS DURANTE EL MES JUNIO DE 2020, ACORDE A LAS ACTAS, RELACIÓN DE ASISTENCIA Y CAUSACIÓN CONTABLE RESPECTIVA.","Funcionamiento","Bogotá Mejor para Todos","No aplica","No Aplica","No Aplica","No Aplica","88141104","DAGOBERTO  RODRIGUEZ MARTINEZ",7492000,null,null,null,null,7492000,7492000,"2020-06-30",null,null,null,null,null,null,null,null,null,null,null,null,null,1,{"$f":"IF(SUMPRODUCT((A$14:A375=A375)*(B$14:B375=B375)*(D$14:D375=D375))>1,0,1)","v":0}]
[7,"2020",null,"N/A","Otros gastos",null,"No aplica","V/R. DE LOS HONORARIOS DE LOS EDILES DE LA LOCALIDAD DE LA CANDELARIA POR LA ASISTENCIA A LAS SESIONES REALIZADAS DURANTE EL MES DE JULIO DE 2020, ACORDE A LAS ACTAS ANEXAS,RELACIÓN DE ASISTENCIA Y CAUSACIÓN CONTABLE.","Funcionamiento","Bogotá Mejor para Todos","No aplica","No Aplica","No Aplica","No Aplica","79593962","EDUARDO TITO GOMEZ CERON",7492000,null,null,null,null,7492000,7492000,"2020-08-01",null,null,null,null,null,null,null,null,null,null,null,null,null,1,{"$f":"IF(SUMPRODUCT((A$14:A376=A376)*(B$14:B376=B376)*(D$14:D376=D376))>1,0,1)","v":1}]
[7,"2020",null,"N/A","Otros gastos",null,"No aplica","V/R. DE LOS HONORARIOS DE LOS EDILES DE LA LOCALIDAD DE LA CANDELARIA POR LA ASISTENCIA A LAS SESIONES REALIZADAS DURANTE EL MES DE JULIO DE 2020, ACORDE A LAS ACTAS ANEXAS,RELACIÓN DE ASISTENCIA Y CAUSACIÓN CONTABLE.","Funcionamiento","Bogotá Mejor para Todos","No aplica","No Aplica","No Aplica","No Aplica","3838495","JUAN CAMILO CASTELLANOS MEDINA",7492000,null,null,null,null,7492000,7492000,"2020-08-01",null,null,null,null,null,null,null,null,null,null,null,null,null,1,{"$f":"IF(SUMPRODUCT((A$14:A377=A377)*(B$14:B377=B377)*(D$14:D377=D377))>1,0,1)","v":0}]
[7,"2020",null,"N/A","Otros gastos",null,"No aplica","V/R. DE LOS HONORARIOS DE LOS EDILES DE LA LOCALIDAD DE LA CANDELARIA POR LA ASISTENCIA A LAS SESIONES REALIZADAS DURANTE EL MES DE JULIO DE 2020, ACORDE A LAS ACTAS ANEXAS,RELACIÓN DE ASISTENCIA Y CAUSACIÓN CONTABLE.","Funcionamiento","Bogotá Mejor para Todos","No aplica","No Aplica","No Aplica","No Aplica","1010160868","GINNA ALEXANDRA QUIROGA GAMBOA",7492000,null,null,null,null,7492000,7492000,"2020-08-01",null,null,null,null,null,null,null,null,null,null,null,null,null,1,{"$f":"IF(SUMPRODUCT((A$14:A378=A378)*(B$14:B378=B378)*(D$14:D378=D378))>1,0,1)","v":0}]
[7,"2020",null,"N/A","Otros gastos",null,"No aplica","V/R. DE LOS HONORARIOS DE LOS EDILES DE LA LOCALIDAD DE LA CANDELARIA POR LA ASISTENCIA A LAS SESIONES REALIZADAS DURANTE EL MES DE JULIO DE 2020, ACORDE A LAS ACTAS ANEXAS,RELACIÓN DE ASISTENCIA Y CAUSACIÓN CONTABLE.","Funcionamiento","Bogotá Mejor para Todos","No aplica","No Aplica","No Aplica","No Aplica","79687787","JUAN CARLOS MAHECHA ROBAYO",7492000,null,null,null,null,7492000,7492000,"2020-08-01",null,null,null,null,null,null,null,null,null,null,null,null,null,1,{"$f":"IF(SUMPRODUCT((A$14:A379=A379)*(B$14:B379=B379)*(D$14:D379=D379))>1,0,1)","v":0}]
[7,"2020",null,"N/A","Otros gastos",null,"No aplica","V/R. DE LOS HONORARIOS DE LOS EDILES DE LA LOCALIDAD DE LA CANDELARIA POR LA ASISTENCIA A LAS SESIONES REALIZADAS DURANTE EL MES DE JULIO DE 2020, ACORDE A LAS ACTAS ANEXAS,RELACIÓN DE ASISTENCIA Y CAUSACIÓN CONTABLE.","Funcionamiento","Bogotá Mejor para Todos","No aplica","No Aplica","No Aplica","No Aplica","1010209957","MIGUEL ANGEL RODRIGUEZ RODRIGUEZ",7492000,null,null,null,null,7492000,7492000,"2020-08-01",null,null,null,null,null,null,null,null,null,null,null,null,null,1,{"$f":"IF(SUMPRODUCT((A$14:A380=A380)*(B$14:B380=B380)*(D$14:D380=D380))>1,0,1)","v":0}]
[7,"2020",null,"N/A","Otros gastos",null,"No aplica","V/R. DE LOS HONORARIOS DE LOS EDILES DE LA LOCALIDAD DE LA CANDELARIA POR LA ASISTENCIA A LAS SESIONES REALIZADAS DURANTE EL MES DE JULIO DE 2020, ACORDE A LAS ACTAS ANEXAS,RELACIÓN DE ASISTENCIA Y CAUSACIÓN CONTABLE.","Funcionamiento","Bogotá Mejor para Todos","No aplica","No Aplica","No Aplica","No Aplica","79651441","ALVARO ENRIQUE SANCHEZ CARRILLO",7492000,null,null,null,null,7492000,7492000,"2020-08-01",null,null,null,null,null,null,null,null,null,null,null,null,null,1,{"$f":"IF(SUMPRODUCT((A$14:A381=A381)*(B$14:B381=B381)*(D$14:D381=D381))>1,0,1)","v":0}]
[7,"2020",null,"N/A","Otros gastos",null,"No aplica","V/R. DE LOS HONORARIOS DE LOS EDILES DE LA LOCALIDAD DE LA CANDELARIA POR LA ASISTENCIA A LAS SESIONES REALIZADAS DURANTE EL MES DE JULIO DE 2020, ACORDE A LAS ACTAS ANEXAS,RELACIÓN DE ASISTENCIA Y CAUSACIÓN CONTABLE.","Funcionamiento","Bogotá Mejor para Todos","No aplica","No Aplica","No Aplica","No Aplica","88141104","DAGOBERTO  RODRIGUEZ MARTINEZ",7492000,null,null,null,null,7492000,7492000,"2020-08-01",null,null,null,null,null,null,null,null,null,null,null,null,null,1,{"$f":"IF(SUMPRODUCT((A$14:A382=A382)*(B$14:B382=B382)*(D$14:D382=D382))>1,0,1)","v":0}]
[8,"2020",null,"N/A","Otros gastos",null,"No aplica","V/R HONORARIOS DE LOS EDILES DE LA LOCALIDAD DE LA CANDELARIA  POR LA ASISTENCIA A LAS SESIONES REALIZADAS DURANTE EL MES DE AGOSTO DE 2020, COIONFORME A LAS ACTAS ANEXAS , RELACIÓN DE ASISTENCIA Y CAUSACIÓN CONTABLE","Funcionamiento","Bogotá Mejor para Todos","No aplica","No Aplica","No Aplica","No Aplica","79593962","EDUARDO TITO GOMEZ CERON",7492000,null,null,null,null,7492000,7492000,"2020-09-08",null,null,null,null,null,null,null,null,null,null,null,null,null,1,{"$f":"IF(SUMPRODUCT((A$14:A383=A383)*(B$14:B383=B383)*(D$14:D383=D383))>1,0,1)","v":1}]
[8,"2020",null,"N/A","Otros gastos",null,"No aplica","V/R HONORARIOS DE LOS EDILES DE LA LOCALIDAD DE LA CANDELARIA  POR LA ASISTENCIA A LAS SESIONES REALIZADAS DURANTE EL MES DE AGOSTO DE 2020, COIONFORME A LAS ACTAS ANEXAS , RELACIÓN DE ASISTENCIA Y CAUSACIÓN CONTABLE","Funcionamiento","Bogotá Mejor para Todos","No aplica","No Aplica","No Aplica","No Aplica","3838495","JUAN CAMILO CASTELLANOS MEDINA",7492000,null,null,null,null,7492000,7492000,"2020-09-08",null,null,null,null,null,null,null,null,null,null,null,null,null,1,{"$f":"IF(SUMPRODUCT((A$14:A384=A384)*(B$14:B384=B384)*(D$14:D384=D384))>1,0,1)","v":0}]
[8,"2020",null,"N/A","Otros gastos",null,"No aplica","V/R HONORARIOS DE LOS EDILES DE LA LOCALIDAD DE LA CANDELARIA  POR LA ASISTENCIA A LAS SESIONES REALIZADAS DURANTE EL MES DE AGOSTO DE 2020, COIONFORME A LAS ACTAS ANEXAS , RELACIÓN DE ASISTENCIA Y CAUSACIÓN CONTABLE","Funcionamiento","Bogotá Mejor para Todos","No aplica","No Aplica","No Aplica","No Aplica","1010160868","GINNA ALEXANDRA QUIROGA GAMBOA",7492000,null,null,null,null,7492000,7492000,"2020-09-08",null,null,null,null,null,null,null,null,null,null,null,null,null,1,{"$f":"IF(SUMPRODUCT((A$14:A385=A385)*(B$14:B385=B385)*(D$14:D385=D385))>1,0,1)","v":0}]
[8,"2020",null,"N/A","Otros gastos",null,"No aplica","V/R HONORARIOS DE LOS EDILES DE LA LOCALIDAD DE LA CANDELARIA  POR LA ASISTENCIA A LAS SESIONES REALIZADAS DURANTE EL MES DE AGOSTO DE 2020, COIONFORME A LAS ACTAS ANEXAS , RELACIÓN DE ASISTENCIA Y CAUSACIÓN CONTABLE","Funcionamiento","Bogotá Mejor para Todos","No aplica","No Aplica","No Aplica","No Aplica","79687787","JUAN CARLOS MAHECHA ROBAYO",7492000,null,null,null,null,7492000,7492000,"2020-09-08",null,null,null,null,null,null,null,null,null,null,null,null,null,1,{"$f":"IF(SUMPRODUCT((A$14:A386=A386)*(B$14:B386=B386)*(D$14:D386=D386))>1,0,1)","v":0}]
[8,"2020",null,"N/A","Otros gastos",null,"No aplica","V/R HONORARIOS DE LOS EDILES DE LA LOCALIDAD DE LA CANDELARIA  POR LA ASISTENCIA A LAS SESIONES REALIZADAS DURANTE EL MES DE AGOSTO DE 2020, COIONFORME A LAS ACTAS ANEXAS , RELACIÓN DE ASISTENCIA Y CAUSACIÓN CONTABLE","Funcionamiento","Bogotá Mejor para Todos","No aplica","No Aplica","No Aplica","No Aplica","1010209957","MIGUEL ANGEL RODRIGUEZ RODRIGUEZ",7492000,null,null,null,null,7492000,7492000,"2020-09-08",null,null,null,null,null,null,null,null,null,null,null,null,null,1,{"$f":"IF(SUMPRODUCT((A$14:A387=A387)*(B$14:B387=B387)*(D$14:D387=D387))>1,0,1)","v":0}]
[9,"2020",null,"N/A","Otros gastos",null,"No aplica","V/R HONORARIOS DE LOS EDILES DE LA LOCALIDAD DE LA CANDELARIA  POR LA ASISTENCIA A LAS SESIONES REALIZADAS DURANTE EL MES DE AGOSTO DE 2020, COIONFORME A LAS ACTAS ANEXAS , RELACIÓN DE ASISTENCIA Y CAUSACIÓN CONTABLE","Funcionamiento","Bogotá Mejor para Todos","No aplica","No Aplica","No Aplica","No Aplica","79651441","ALVARO ENRIQUE SANCHEZ CARRILLO",7492000,null,null,null,null,7492000,7492000,"2020-09-08",null,null,null,null,null,null,null,null,null,null,null,null,null,1,{"$f":"IF(SUMPRODUCT((A$14:A388=A388)*(B$14:B388=B388)*(D$14:D388=D388))>1,0,1)","v":1}]
[9,"2020",null,"N/A","Otros gastos",null,"No aplica","V/R HONORARIOS DE LOS EDILES DE LA LOCALIDAD DE LA CANDELARIA  POR LA ASISTENCIA A LAS SESIONES REALIZADAS DURANTE EL MES DE AGOSTO DE 2020, COIONFORME A LAS ACTAS ANEXAS , RELACIÓN DE ASISTENCIA Y CAUSACIÓN CONTABLE","Funcionamiento","Bogotá Mejor para Todos","No aplica","No Aplica","No Aplica","No Aplica","88141104","DAGOBERTO  RODRIGUEZ MARTINEZ",7492000,null,null,null,null,7492000,7492000,"2020-09-08",null,null,null,null,null,null,null,null,null,null,null,null,null,1,{"$f":"IF(SUMPRODUCT((A$14:A389=A389)*(B$14:B389=B389)*(D$14:D389=D389))>1,0,1)","v":0}]
[92020,"2020",null,"N/A","Otros gastos",null,"No aplica","VALOR DE LA SEGURIDAD SOCIAL DE LOS EDILES DE LA LOCALIDAD LACANDELARIA, ACORDE A LOS HONORARIOS PERCIBIDOS DURANTE EL MES DESEPTIEMBRE DE 2020.","Funcionamiento","Bogotá Mejor para Todos","No aplica","No Aplica","No Aplica","No Aplica","800251440","ENTIDAD PROMOTORA DE SALUD SANITAS S.A.S",3746000,null,null,null,null,3746000,3746000,"2020-10-21",null,null,null,null,null,null,null,null,null,null,null,null,null,1,{"$f":"IF(SUMPRODUCT((A$14:A390=A390)*(B$14:B390=B390)*(D$14:D390=D390))>1,0,1)","v":0}]
[92020,"2020",null,"N/A","Otros gastos",null,"No aplica","VALOR DE LA SEGURIDAD SOCIAL DE LOS EDILES DE LA LOCALIDAD LACANDELARIA, ACORDE A LOS HONORARIOS PERCIBIDOS DURANTE EL MES DESEPTIEMBRE DE 2020.","Funcionamiento","Bogotá Mejor para Todos","No aplica","No Aplica","No Aplica","No Aplica","860066942","CAJA DE COMPENSACION FAMILIAR COMPENSAR",936500,null,null,null,null,936500,936500,"2020-10-21",null,null,null,null,null,null,null,null,null,null,null,null,null,1,{"$f":"IF(SUMPRODUCT((A$14:A391=A391)*(B$14:B391=B391)*(D$14:D391=D391))>1,0,1)","v":0}]
[92020,"2020",null,"N/A","Otros gastos",null,"No aplica","VALOR DE LA SEGURIDAD SOCIAL DE LOS EDILES DE LA LOCALIDAD LACANDELARIA, ACORDE A LOS HONORARIOS PERCIBIDOS DURANTE EL MES DESEPTIEMBRE DE 2020.","Funcionamiento","Bogotá Mejor para Todos","No aplica","No Aplica","No Aplica","No Aplica","830003564","ENTIDAD PROMOTORA DE SALUD FAMISANAR S.A .S",936500,null,null,null,null,936500,936500,"2020-10-21",null,null,null,null,null,null,null,null,null,null,null,null,null,1,{"$f":"IF(SUMPRODUCT((A$14:A392=A392)*(B$14:B392=B392)*(D$14:D392=D392))>1,0,1)","v":0}]
[92020,"2020",null,"N/A","Otros gastos",null,"No aplica","VALOR DE LA SEGURIDAD SOCIAL DE LOS EDILES DE LA LOCALIDAD LACANDELARIA, ACORDE A LOS HONORARIOS PERCIBIDOS DURANTE EL MES DESEPTIEMBRE DE 2020.","Funcionamiento","Bogotá Mejor para Todos","No aplica","No Aplica","No Aplica","No Aplica","860045904","CAJA DE COMPENSACION FAMILIAR DE CUNDINA MARCA COMFACUNDI",936500,null,null,null,null,936500,936500,"2020-10-21",null,null,null,null,null,null,null,null,null,null,null,null,null,1,{"$f":"IF(SUMPRODUCT((A$14:A393=A393)*(B$14:B393=B393)*(D$14:D393=D393))>1,0,1)","v":0}]
[911,"2020",null,"N/A","Otros gastos",null,"No aplica","PAGO DE LA SEGURIDAD SOCIAL EN SALUD DE LOS EDILES DE LA LOCALIDAD LACANDELARIA, ACORDE A LOS HONORARIOS PERCIBIDOS DURANTE EL MES DE OCTUBREDE 2020.","Funcionamiento","Bogotá Mejor para Todos","No aplica","No Aplica","No Aplica","No Aplica","800251440","ENTIDAD PROMOTORA DE SALUD SANITAS S.A.S",3746000,null,null,null,null,3746000,3746000,"2020-11-10",null,null,null,null,null,null,null,null,null,null,null,null,null,1,{"$f":"IF(SUMPRODUCT((A$14:A394=A394)*(B$14:B394=B394)*(D$14:D394=D394))>1,0,1)","v":0}]
[911,"2020",null,"N/A","Otros gastos",null,"No aplica","PAGO DE LA SEGURIDAD SOCIAL EN SALUD DE LOS EDILES DE LA LOCALIDAD LACANDELARIA, ACORDE A LOS HONORARIOS PERCIBIDOS DURANTE EL MES DE OCTUBREDE 2020.","Funcionamiento","Bogotá Mejor para Todos","No aplica","No Aplica","No Aplica","No Aplica","860066942","CAJA DE COMPENSACION FAMILIAR COMPENSAR",936500,null,null,null,null,936500,936500,"2020-11-10",null,null,null,null,null,null,null,null,null,null,null,null,null,1,{"$f":"IF(SUMPRODUCT((A$14:A395=A395)*(B$14:B395=B395)*(D$14:D395=D395))>1,0,1)","v":0}]
[911,"2020",null,"N/A","Otros gastos",null,"No aplica","PAGO DE LA SEGURIDAD SOCIAL EN SALUD DE LOS EDILES DE LA LOCALIDAD LACANDELARIA, ACORDE A LOS HONORARIOS PERCIBIDOS DURANTE EL MES DE OCTUBREDE 2020.","Funcionamiento","Bogotá Mejor para Todos","No aplica","No Aplica","No Aplica","No Aplica","830003564","ENTIDAD PROMOTORA DE SALUD FAMISANAR S.A .S",936500,null,null,null,null,936500,936500,"2020-11-10",null,null,null,null,null,null,null,null,null,null,null,null,null,1,{"$f":"IF(SUMPRODUCT((A$14:A396=A396)*(B$14:B396=B396)*(D$14:D396=D396))>1,0,1)","v":0}]
[911,"2020",null,"N/A","Otros gastos",null,"No aplica","PAGO DE LA SEGURIDAD SOCIAL EN SALUD DE LOS EDILES DE LA LOCALIDAD LACANDELARIA, ACORDE A LOS HONORARIOS PERCIBIDOS DURANTE EL MES DE OCTUBREDE 2020.","Funcionamiento","Bogotá Mejor para Todos","No aplica","No Aplica","No Aplica","No Aplica","860045904","CAJA DE COMPENSACION FAMILIAR DE CUNDINA MARCA COMFACUNDI",936500,null,null,null,null,936500,936500,"2020-11-10",null,null,null,null,null,null,null,null,null,null,null,null,null,1,{"$f":"IF(SUMPRODUCT((A$14:A397=A397)*(B$14:B397=B397)*(D$14:D397=D397))>1,0,1)","v":0}]
[112020,"2020",null,"N/A","Otros gastos",null,"No aplica","PAGO DE LA SEGURIDAD SOCIAL EN SALUD DE LOS EDILES DE LA LOCALIDAD LACANDELARIA, ACORDE A LOS HONORARIOS PERCIBIDOS DURANTE LAS SESIONES DELMES DE NOVIEMBRE DE 2020.","Funcionamiento","Bogotá Mejor para Todos","No aplica","No Aplica","No Aplica","No Aplica","800251440","ENTIDAD PROMOTORA DE SALUD SANITAS S.A.S",3746000,null,null,null,null,3746000,3746000,"2020-12-02",null,null,null,null,null,null,null,null,null,null,null,null,null,1,{"$f":"IF(SUMPRODUCT((A$14:A398=A398)*(B$14:B398=B398)*(D$14:D398=D398))>1,0,1)","v":0}]
[112020,"2020",null,"N/A","Otros gastos",null,"No aplica","PAGO DE LA SEGURIDAD SOCIAL EN SALUD DE LOS EDILES DE LA LOCALIDAD LACANDELARIA, ACORDE A LOS HONORARIOS PERCIBIDOS DURANTE LAS SESIONES DELMES DE NOVIEMBRE DE 2020.","Funcionamiento","Bogotá Mejor para Todos","No aplica","No Aplica","No Aplica","No Aplica","860066942","CAJA DE COMPENSACION FAMILIAR COMPENSAR",936500,null,null,null,null,936500,936500,"2020-12-02",null,null,null,null,null,null,null,null,null,null,null,null,null,1,{"$f":"IF(SUMPRODUCT((A$14:A399=A399)*(B$14:B399=B399)*(D$14:D399=D399))>1,0,1)","v":0}]
[112020,"2020",null,"N/A","Otros gastos",null,"No aplica","PAGO DE LA SEGURIDAD SOCIAL EN SALUD DE LOS EDILES DE LA LOCALIDAD LACANDELARIA, ACORDE A LOS HONORARIOS PERCIBIDOS DURANTE LAS SESIONES DELMES DE NOVIEMBRE DE 2020.","Funcionamiento","Bogotá Mejor para Todos","No aplica","No Aplica","No Aplica","No Aplica","830003564","ENTIDAD PROMOTORA DE SALUD FAMISANAR S.A .S",936500,null,null,null,null,936500,936500,"2020-12-02",null,null,null,null,null,null,null,null,null,null,null,null,null,1,{"$f":"IF(SUMPRODUCT((A$14:A400=A400)*(B$14:B400=B400)*(D$14:D400=D400))>1,0,1)","v":0}]
[112020,"2020",null,"N/A","Otros gastos",null,"No aplica","PAGO DE LA SEGURIDAD SOCIAL EN SALUD DE LOS EDILES DE LA LOCALIDAD LACANDELARIA, ACORDE A LOS HONORARIOS PERCIBIDOS DURANTE LAS SESIONES DELMES DE NOVIEMBRE DE 2020.","Funcionamiento","Bogotá Mejor para Todos","No aplica","No Aplica","No Aplica","No Aplica","860045904","CAJA DE COMPENSACION FAMILIAR DE CUNDINA MARCA COMFACUNDI",936500,null,null,null,null,936500,936500,"2020-12-02",null,null,null,null,null,null,null,null,null,null,null,null,null,1,{"$f":"IF(SUMPRODUCT((A$14:A401=A401)*(B$14:B401=B401)*(D$14:D401=D401))>1,0,1)","v":0}]
[2812,"2020",null,"N/A","Otros gastos",null,"No aplica","PAGO DE LA SEGURIDAD SOCIAL DE LOS EDILES DE LA LOCALIDAD LA CANDELARIACORRESPONDIENTE AL MES DE DICIEMBRE DE 2020, SEGUN LAS ACTAS RECIBIDAS,LISTADOS DE ASISTENCIA A LAS SESIONES Y CAUSACIÓN CONTABLE EMITIDA PORCONTABILIDAD.","Funcionamiento","Bogotá Mejor para Todos","No aplica","No Aplica","No Aplica","No Aplica","800251440","ENTIDAD PROMOTORA DE SALUD SANITAS S.A.S",3746000,null,null,null,null,3746000,3746000,"2020-12-28",null,null,null,null,null,null,null,null,null,null,null,null,null,1,{"$f":"IF(SUMPRODUCT((A$14:A402=A402)*(B$14:B402=B402)*(D$14:D402=D402))>1,0,1)","v":0}]
[2812,"2020",null,"N/A","Otros gastos",null,"No aplica","PAGO DE LA SEGURIDAD SOCIAL DE LOS EDILES DE LA LOCALIDAD LA CANDELARIACORRESPONDIENTE AL MES DE DICIEMBRE DE 2020, SEGUN LAS ACTAS RECIBIDAS,LISTADOS DE ASISTENCIA A LAS SESIONES Y CAUSACIÓN CONTABLE EMITIDA PORCONTABILIDAD.","Funcionamiento","Bogotá Mejor para Todos","No aplica","No Aplica","No Aplica","No Aplica","860066942","CAJA DE COMPENSACION FAMILIAR COMPENSAR",936500,null,null,null,null,936500,936500,"2020-12-28",null,null,null,null,null,null,null,null,null,null,null,null,null,1,{"$f":"IF(SUMPRODUCT((A$14:A403=A403)*(B$14:B403=B403)*(D$14:D403=D403))>1,0,1)","v":0}]
[2812,"2020",null,"N/A","Otros gastos",null,"No aplica","PAGO DE LA SEGURIDAD SOCIAL DE LOS EDILES DE LA LOCALIDAD LA CANDELARIACORRESPONDIENTE AL MES DE DICIEMBRE DE 2020, SEGUN LAS ACTAS RECIBIDAS,LISTADOS DE ASISTENCIA A LAS SESIONES Y CAUSACIÓN CONTABLE EMITIDA PORCONTABILIDAD.","Funcionamiento","Bogotá Mejor para Todos","No aplica","No Aplica","No Aplica","No Aplica","830003564","ENTIDAD PROMOTORA DE SALUD FAMISANAR S.A .S",936500,null,null,null,null,936500,936500,"2020-12-28",null,null,null,null,null,null,null,null,null,null,null,null,null,1,{"$f":"IF(SUMPRODUCT((A$14:A404=A404)*(B$14:B404=B404)*(D$14:D404=D404))>1,0,1)","v":0}]
[2812,"2020",null,"N/A","Otros gastos",null,"No aplica","PAGO DE LA SEGURIDAD SOCIAL DE LOS EDILES DE LA LOCALIDAD LA CANDELARIACORRESPONDIENTE AL MES DE DICIEMBRE DE 2020, SEGUN LAS ACTAS RECIBIDAS,LISTADOS DE ASISTENCIA A LAS SESIONES Y CAUSACIÓN CONTABLE EMITIDA PORCONTABILIDAD.","Funcionamiento","Bogotá Mejor para Todos","No aplica","No Aplica","No Aplica","No Aplica","860045904","CAJA DE COMPENSACION FAMILIAR DE CUNDINA MARCA COMFACUNDI",936500,null,null,null,null,936500,936500,"2020-12-28",null,null,null,null,null,null,null,null,null,null,null,null,null,1,{"$f":"IF(SUMPRODUCT((A$14:A405=A405)*(B$14:B405=B405)*(D$14:D405=D405))>1,0,1)","v":0}]
[1,"2020",null,"N/A","Otros gastos",null,"No aplica","V/R. DE LA SEGURIDAD SOCIAL EN SALUD DE LOS EDILES DE LA LOCALIDAD DE LA CANDELARIA, ACORDE A LOS HONORARIOS PERCIBIDOS DURANTE EL MES DE ENERO DE 2020.","Funcionamiento","Bogotá Mejor para Todos","No aplica","No Aplica","No Aplica","No Aplica","830003564","ENTIDAD PROMOTORA DE SALUD FAMISANAR CAFAM COLSUBSIDIO LIMITADA",890900,null,null,null,null,890900,890900,"2020-01-30",null,null,null,null,null,null,null,null,null,null,null,null,null,1,{"$f":"IF(SUMPRODUCT((A$14:A406=A406)*(B$14:B406=B406)*(D$14:D406=D406))>1,0,1)","v":0}]
[1,"2020",null,"N/A","Otros gastos",null,"No aplica","V/R. DE LA SEGURIDAD SOCIAL EN SALUD DE LOS EDILES DE LA LOCALIDAD DE LA CANDELARIA, ACORDE A LOS HONORARIOS PERCIBIDOS DURANTE EL MES DE ENERO DE 2020.","Funcionamiento","Bogotá Mejor para Todos","No aplica","No Aplica","No Aplica","No Aplica","800251440","ENTIDAD PROMOTORA DE SALUD SANITAS S.A.",3563600,null,null,null,null,3563600,3563600,"2020-01-30",null,null,null,null,null,null,null,null,null,null,null,null,null,1,{"$f":"IF(SUMPRODUCT((A$14:A407=A407)*(B$14:B407=B407)*(D$14:D407=D407))>1,0,1)","v":0}]
[1,"2020",null,"N/A","Otros gastos",null,"No aplica","V/R. DE LA SEGURIDAD SOCIAL EN SALUD DE LOS EDILES DE LA LOCALIDAD DE LA CANDELARIA, ACORDE A LOS HONORARIOS PERCIBIDOS DURANTE EL MES DE ENERO DE 2020.","Funcionamiento","Bogotá Mejor para Todos","No aplica","No Aplica","No Aplica","No Aplica","860066942","CAJA DE COMPENSACION FAMILIAR - COMPENSAR",890900,null,null,null,null,890900,890900,"2020-01-30",null,null,null,null,null,null,null,null,null,null,null,null,null,1,{"$f":"IF(SUMPRODUCT((A$14:A408=A408)*(B$14:B408=B408)*(D$14:D408=D408))>1,0,1)","v":0}]
[1,"2020",null,"N/A","Otros gastos",null,"No aplica","V/R. DE LA SEGURIDAD SOCIAL EN SALUD DE LOS EDILES DE LA LOCALIDAD DE LA CANDELARIA, ACORDE A LOS HONORARIOS PERCIBIDOS DURANTE EL MES DE ENERO DE 2020.","Funcionamiento","Bogotá Mejor para Todos","No aplica","No Aplica","No Aplica","No Aplica","860045904","CAJA DE COMPENSACION FAMILIAR DE CUNDINAMARCA - COMFACUNDI",890900,null,null,null,null,890900,890900,"2020-02-04",null,null,null,null,null,null,null,null,null,null,null,null,null,1,{"$f":"IF(SUMPRODUCT((A$14:A409=A409)*(B$14:B409=B409)*(D$14:D409=D409))>1,0,1)","v":0}]
[2,"2020",null,"N/A","Otros gastos",null,"No aplica","V/R. DE LA SEGURIDAD SOCIAL EN SALUD DE LOS EDILES DE LA LOCALIDAD DE LA CANDELARIA, ACORDE A LOS HONORARIOS PERCIBIDOS DURANTE EL MES DE FEBRERO DE 2020.","Funcionamiento","Bogotá Mejor para Todos","No aplica","No Aplica","No Aplica","No Aplica","860045904","CAJA DE COMPENSACION FAMILIAR DE CUNDINAMARCA - COMFACUNDI",890900,null,null,null,null,890900,890900,"2020-03-02",null,null,null,null,null,null,null,null,null,null,null,null,null,1,{"$f":"IF(SUMPRODUCT((A$14:A410=A410)*(B$14:B410=B410)*(D$14:D410=D410))>1,0,1)","v":0}]
[2,"2020",null,"N/A","Otros gastos",null,"No aplica","V/R. DE LA SEGURIDAD SOCIAL EN SALUD DE LOS EDILES DE LA LOCALIDAD DE LA CANDELARIA, ACORDE A LOS HONORARIOS PERCIBIDOS DURANTE EL MES DE FEBRERO DE 2020.","Funcionamiento","Bogotá Mejor para Todos","No aplica","No Aplica","No Aplica","No Aplica","800251440","ENTIDAD PROMOTORA DE SALUD SANITAS S.A.",3563600,null,null,null,null,3563600,3563600,"2020-03-02",null,null,null,null,null,null,null,null,null,null,null,null,null,1,{"$f":"IF(SUMPRODUCT((A$14:A411=A411)*(B$14:B411=B411)*(D$14:D411=D411))>1,0,1)","v":0}]
[2,"2020",null,"N/A","Otros gastos",null,"No aplica","V/R. DE LA SEGURIDAD SOCIAL EN SALUD DE LOS EDILES DE LA LOCALIDAD DE LA CANDELARIA, ACORDE A LOS HONORARIOS PERCIBIDOS DURANTE EL MES DE FEBRERO DE 2020.","Funcionamiento","Bogotá Mejor para Todos","No aplica","No Aplica","No Aplica","No Aplica","860066942","CAJA DE COMPENSACION FAMILIAR - COMPENSAR",890900,null,null,null,null,890900,890900,"2020-03-02",null,null,null,null,null,null,null,null,null,null,null,null,null,1,{"$f":"IF(SUMPRODUCT((A$14:A412=A412)*(B$14:B412=B412)*(D$14:D412=D412))>1,0,1)","v":0}]
[2,"2020",null,"N/A","Otros gastos",null,"No aplica","V/R. DE LA SEGURIDAD SOCIAL EN SALUD DE LOS EDILES DE LA LOCALIDAD DE LA CANDELARIA, ACORDE A LOS HONORARIOS PERCIBIDOS DURANTE EL MES DE FEBRERO DE 2020.","Funcionamiento","Bogotá Mejor para Todos","No aplica","No Aplica","No Aplica","No Aplica","830003564","ENTIDAD PROMOTORA DE SALUD FAMISANAR CAFAM COLSUBSIDIO LIMITADA",890900,null,null,null,null,890900,890900,"2020-03-02",null,null,null,null,null,null,null,null,null,null,null,null,null,1,{"$f":"IF(SUMPRODUCT((A$14:A413=A413)*(B$14:B413=B413)*(D$14:D413=D413))>1,0,1)","v":0}]
[3,"2020",null,"N/A","Otros gastos",null,"No aplica","V/R. DE LA SEGURIDAD SOCIAL EN SALUD, ACORDE A LOS HONORARIOS PERCIBIDOS DURANTE EL MES DE MARZO DE 2020.","Funcionamiento","Bogotá Mejor para Todos","No aplica","No Aplica","No Aplica","No Aplica","860045904","CAJA DE COMPENSACION FAMILIAR DE CUNDINAMARCA - COMFACUNDI",936500,null,null,null,null,936500,936500,"2020-03-25",null,null,null,null,null,null,null,null,null,null,null,null,null,1,{"$f":"IF(SUMPRODUCT((A$14:A414=A414)*(B$14:B414=B414)*(D$14:D414=D414))>1,0,1)","v":0}]
[3,"2020",null,"N/A","Otros gastos",null,"No aplica","V/R. DE LA SEGURIDAD SOCIAL EN SALUD, ACORDE A LOS HONORARIOS PERCIBIDOS DURANTE EL MES DE MARZO DE 2020.","Funcionamiento","Bogotá Mejor para Todos","No aplica","No Aplica","No Aplica","No Aplica","830003564","ENTIDAD PROMOTORA DE SALUD FAMISANAR CAFAM COLSUBSIDIO LIMITADA",936500,null,null,null,null,936500,936500,"2020-03-25",null,null,null,null,null,null,null,null,null,null,null,null,null,1,{"$f":"IF(SUMPRODUCT((A$14:A415=A415)*(B$14:B415=B415)*(D$14:D415=D415))>1,0,1)","v":0}]
[3,"2020",null,"N/A","Otros gastos",null,"No aplica","V/R. DE LA SEGURIDAD SOCIAL EN SALUD, ACORDE A LOS HONORARIOS PERCIBIDOS DURANTE EL MES DE MARZO DE 2020.","Funcionamiento","Bogotá Mejor para Todos","No aplica","No Aplica","No Aplica","No Aplica","800251440","ENTIDAD PROMOTORA DE SALUD SANITAS S.A.",3746000,null,null,null,null,3746000,3746000,"2020-03-25",null,null,null,null,null,null,null,null,null,null,null,null,null,1,{"$f":"IF(SUMPRODUCT((A$14:A416=A416)*(B$14:B416=B416)*(D$14:D416=D416))>1,0,1)","v":0}]
[3,"2020",null,"N/A","Otros gastos",null,"No aplica","V/R. DE LA SEGURIDAD SOCIAL EN SALUD, ACORDE A LOS HONORARIOS PERCIBIDOS DURANTE EL MES DE MARZO DE 2020.","Funcionamiento","Bogotá Mejor para Todos","No aplica","No Aplica","No Aplica","No Aplica","860066942","CAJA DE COMPENSACION FAMILIAR - COMPENSAR",936500,null,null,null,null,936500,936500,"2020-03-25",null,null,null,null,null,null,null,null,null,null,null,null,null,1,{"$f":"IF(SUMPRODUCT((A$14:A417=A417)*(B$14:B417=B417)*(D$14:D417=D417))>1,0,1)","v":0}]
[4,"2020",null,"N/A","Otros gastos",null,"No aplica","V/R. DE LAS SEGURIDAD EN SALUD DE LOS EDILES DE LA CANDELARIA, ACORDE A LOS HONORARIOS PERCIBIDOS DURANTE EL MES DE ABRIL DE 2020.","Funcionamiento","Bogotá Mejor para Todos","No aplica","No Aplica","No Aplica","No Aplica","860045904","CAJA DE COMPENSACION FAMILIAR DE CUNDINAMARCA - COMFACUNDI",1027800,null,null,null,null,1027800,1027800,"2020-05-02",null,null,null,null,null,null,null,null,null,null,null,null,null,1,{"$f":"IF(SUMPRODUCT((A$14:A418=A418)*(B$14:B418=B418)*(D$14:D418=D418))>1,0,1)","v":0}]
[4,"2020",null,"N/A","Otros gastos",null,"No aplica","V/R. DE LAS SEGURIDAD EN SALUD DE LOS EDILES DE LA CANDELARIA, ACORDE A LOS HONORARIOS PERCIBIDOS DURANTE EL MES DE ABRIL DE 2020.","Funcionamiento","Bogotá Mejor para Todos","No aplica","No Aplica","No Aplica","No Aplica","830003564","ENTIDAD PROMOTORA DE SALUD FAMISANAR CAFAM COLSUBSIDIO LIMITADA",1027800,null,null,null,null,1027800,1027800,"2020-05-02",null,null,null,null,null,null,null,null,null,null,null,null,null,{"$f":"IF(ISERROR(W419/V419),\"-\",(W419/V419))","v":1},{"$f":"IF(SUMPRODUCT((A$14:A419=A419)*(B$14:B419=B419)*(D$14:D419=D419))>1,0,1)","v":0}]
[4,"2020",null,"N/A","Otros gastos",null,"No aplica","V/R. DE LAS SEGURIDAD EN SALUD DE LOS EDILES DE LA CANDELARIA, ACORDE A LOS HONORARIOS PERCIBIDOS DURANTE EL MES DE ABRIL DE 2020.","Funcionamiento","Bogotá Mejor para Todos","No aplica","No Aplica","No Aplica","No Aplica","800251440","ENTIDAD PROMOTORA DE SALUD SANITAS S.A.",3083400,null,null,null,null,3083400,3083400,"2020-05-02",null,null,null,null,null,null,null,null,null,null,null,null,null,1,{"$f":"IF(SUMPRODUCT((A$14:A420=A420)*(B$14:B420=B420)*(D$14:D420=D420))>1,0,1)","v":0}]
[4,"2020",null,"N/A","Otros gastos",null,"No aplica","V/R. DE LAS SEGURIDAD EN SALUD DE LOS EDILES DE LA CANDELARIA, ACORDE A LOS HONORARIOS PERCIBIDOS DURANTE EL MES DE ABRIL DE 2020.","Funcionamiento","Bogotá Mejor para Todos","No aplica","No Aplica","No Aplica","No Aplica","860066942","CAJA DE COMPENSACION FAMILIAR - COMPENSAR",1027800,null,null,null,null,1027800,1027800,"2020-05-02",null,null,null,null,null,null,null,null,null,null,null,null,null,1,{"$f":"IF(SUMPRODUCT((A$14:A421=A421)*(B$14:B421=B421)*(D$14:D421=D421))>1,0,1)","v":0}]
[4,"2020",null,"N/A","Otros gastos",null,"No aplica","V/R. DE LAS SEGURIDAD EN SALUD DE LOS EDILES DE LA CANDELARIA, ACORDE A LOS HONORARIOS PERCIBIDOS DURANTE EL MES DE ABRIL DE 2020.","Funcionamiento","Bogotá Mejor para Todos","No aplica","No Aplica","No Aplica","No Aplica","800251440","ENTIDAD PROMOTORA DE SALUD SANITAS S.A.",1027800,null,null,null,null,1027800,1027800,"2020-05-02",null,null,null,null,null,null,null,null,null,null,null,null,null,1,{"$f":"IF(SUMPRODUCT((A$14:A422=A422)*(B$14:B422=B422)*(D$14:D422=D422))>1,0,1)","v":0}]
[5,"2020",null,"N/A","Otros gastos",null,"No aplica","V/R. DE LA SEGURIDAD SOCIAL EN SALUD DE LOS EDILES DE LA LOCALIDAD DE LA CANDELARIA, ACORDE A LOS HONORARIOS PERCIBIDOS DURANTE EL MES DE MAYO DE 2020.","Funcionamiento","Bogotá Mejor para Todos","No aplica","No Aplica","No Aplica","No Aplica","860045904","CAJA DE COMPENSACION FAMILIAR DE CUNDINAMARCA - COMFACUNDI",936500,null,null,null,null,936500,936500,"2020-05-31",null,null,null,null,null,null,null,null,null,null,null,null,null,1,{"$f":"IF(SUMPRODUCT((A$14:A423=A423)*(B$14:B423=B423)*(D$14:D423=D423))>1,0,1)","v":0}]
[5,"2020",null,"N/A","Otros gastos",null,"No aplica","V/R. DE LA SEGURIDAD SOCIAL EN SALUD DE LOS EDILES DE LA LOCALIDAD DE LA CANDELARIA, ACORDE A LOS HONORARIOS PERCIBIDOS DURANTE EL MES DE MAYO DE 2020.","Funcionamiento","Bogotá Mejor para Todos","No aplica","No Aplica","No Aplica","No Aplica","830003564","ENTIDAD PROMOTORA DE SALUD FAMISANAR CAFAM COLSUBSIDIO LIMITADA",936500,null,null,null,null,936500,936500,"2020-05-31",null,null,null,null,null,null,null,null,null,null,null,null,null,1,{"$f":"IF(SUMPRODUCT((A$14:A424=A424)*(B$14:B424=B424)*(D$14:D424=D424))>1,0,1)","v":0}]
[5,"2020",null,"N/A","Otros gastos",null,"No aplica","V/R. DE LA SEGURIDAD SOCIAL EN SALUD DE LOS EDILES DE LA LOCALIDAD DE LA CANDELARIA, ACORDE A LOS HONORARIOS PERCIBIDOS DURANTE EL MES DE MAYO DE 2020.","Funcionamiento","Bogotá Mejor para Todos","No aplica","No Aplica","No Aplica","No Aplica","800251440","ENTIDAD PROMOTORA DE SALUD SANITAS S.A.",3746000,null,null,null,null,3746000,3746000,"2020-05-31",null,null,null,null,null,null,null,null,null,null,null,null,null,1,{"$f":"IF(SUMPRODUCT((A$14:A425=A425)*(B$14:B425=B425)*(D$14:D425=D425))>1,0,1)","v":0}]
[5,"2020",null,"N/A","Otros gastos",null,"No aplica","V/R. DE LA SEGURIDAD SOCIAL EN SALUD DE LOS EDILES DE LA LOCALIDAD DE LA CANDELARIA, ACORDE A LOS HONORARIOS PERCIBIDOS DURANTE EL MES DE MAYO DE 2020.","Funcionamiento","Bogotá Mejor para Todos","No aplica","No Aplica","No Aplica","No Aplica","860066942","CAJA DE COMPENSACION FAMILIAR - COMPENSAR",936500,null,null,null,null,936500,936500,"2020-05-31",null,null,null,null,null,null,null,null,null,null,null,null,null,1,{"$f":"IF(SUMPRODUCT((A$14:A426=A426)*(B$14:B426=B426)*(D$14:D426=D426))>1,0,1)","v":0}]
[6,"2020",null,"N/A","Otros gastos",null,"No aplica","V/R. DE LA SEGURIDAD SOCIAL EN SALUD DE LOS EDILES DE LA LOCALIDAD DE LA CANDELARIA, ACORDE A LOS HONORARIOS PERCIBIDOS DURANTE EL MES DE JUNIO DE 2020.","Funcionamiento","Bogotá Mejor para Todos","No aplica","No Aplica","No Aplica","No Aplica","860045904","CAJA DE COMPENSACION FAMILIAR DE CUNDINAMARCA - COMFACUNDI",936500,null,null,null,null,936500,936500,"2020-06-30",null,null,null,null,null,null,null,null,null,null,null,null,null,1,{"$f":"IF(SUMPRODUCT((A$14:A427=A427)*(B$14:B427=B427)*(D$14:D427=D427))>1,0,1)","v":0}]
[6,"2020",null,"N/A","Otros gastos",null,"No aplica","V/R. DE LA SEGURIDAD SOCIAL EN SALUD DE LOS EDILES DE LA LOCALIDAD DE LA CANDELARIA, ACORDE A LOS HONORARIOS PERCIBIDOS DURANTE EL MES DE JUNIO DE 2020.","Funcionamiento","Bogotá Mejor para Todos","No aplica","No Aplica","No Aplica","No Aplica","830003564","ENTIDAD PROMOTORA DE SALUD FAMISANAR CAFAM COLSUBSIDIO LIMITADA",936500,null,null,null,null,936500,936500,"2020-06-30",null,null,null,null,null,null,null,null,null,null,null,null,null,1,{"$f":"IF(SUMPRODUCT((A$14:A428=A428)*(B$14:B428=B428)*(D$14:D428=D428))>1,0,1)","v":0}]
[6,"2020",null,"N/A","Otros gastos",null,"No aplica","V/R. DE LA SEGURIDAD SOCIAL EN SALUD DE LOS EDILES DE LA LOCALIDAD DE LA CANDELARIA, ACORDE A LOS HONORARIOS PERCIBIDOS DURANTE EL MES DE JUNIO DE 2020.","Funcionamiento","Bogotá Mejor para Todos","No aplica","No Aplica","No Aplica","No Aplica","800251440","ENTIDAD PROMOTORA DE SALUD SANITAS S.A.",3746000,null,null,null,null,3746000,3746000,"2020-06-30",null,null,null,null,null,null,null,null,null,null,null,null,null,1,{"$f":"IF(SUMPRODUCT((A$14:A429=A429)*(B$14:B429=B429)*(D$14:D429=D429))>1,0,1)","v":0}]
[6,"2020",null,"N/A","Otros gastos",null,"No aplica","V/R. DE LA SEGURIDAD SOCIAL EN SALUD DE LOS EDILES DE LA LOCALIDAD DE LA CANDELARIA, ACORDE A LOS HONORARIOS PERCIBIDOS DURANTE EL MES DE JUNIO DE 2020.","Funcionamiento","Bogotá Mejor para Todos","No aplica","No Aplica","No Aplica","No Aplica","860066942","CAJA DE COMPENSACION FAMILIAR - COMPENSAR",936500,null,null,null,null,936500,936500,"2020-06-30",null,null,null,null,null,null,null,null,null,null,null,null,null,1,{"$f":"IF(SUMPRODUCT((A$14:A430=A430)*(B$14:B430=B430)*(D$14:D430=D430))>1,0,1)","v":0}]
[7,"2020",null,"N/A","Otros gastos",null,"No aplica","V/R. DE LA SEGURIDAD SOCIAL EN SALUD DE LOS EDILES DE LA LOCALIDAD DE LA CANDELARIA, ACORDE A LOS HONORARIOS PERCIBIDOS DURANTE EL MES DE JULIO DE 2020.","Funcionamiento","Bogotá Mejor para Todos","No aplica","No Aplica","No Aplica","No Aplica","800251440","ENTIDAD PROMOTORA DE SALUD SANITAS S.A.",3746000,null,null,null,null,{"$f":"+Q431+S431+U431","v":3746000},3746000,"2020-08-01",null,null,null,null,null,null,null,null,null,null,null,null,null,1,{"$f":"IF(SUMPRODUCT((A$14:A431=A431)*(B$14:B431=B431)*(D$14:D431=D431))>1,0,1)","v":0}]
[7,"2020",null,"N/A","Otros gastos",null,"No aplica","V/R. DE LA SEGURIDAD SOCIAL EN SALUD DE LOS EDILES DE LA LOCALIDAD DE LA CANDELARIA, ACORDE A LOS HONORARIOS PERCIBIDOS DURANTE EL MES DE JULIO DE 2020.","Funcionamiento","Bogotá Mejor para Todos","No aplica","No Aplica","No Aplica","No Aplica","830003564","ENTIDAD PROMOTORA DE SALUD FAMISANAR CAFAM COLSUBSIDIO LIMITADA",936500,null,null,null,null,936500,936500,"2020-08-01",null,null,null,null,null,null,null,null,null,null,null,null,null,1,{"$f":"IF(SUMPRODUCT((A$14:A432=A432)*(B$14:B432=B432)*(D$14:D432=D432))>1,0,1)","v":0}]
[7,"2020",null,"N/A","Otros gastos",null,"No aplica","V/R. DE LA SEGURIDAD SOCIAL EN SALUD DE LOS EDILES DE LA LOCALIDAD DE LA CANDELARIA, ACORDE A LOS HONORARIOS PERCIBIDOS DURANTE EL MES DE JULIO DE 2020.","Funcionamiento","Bogotá Mejor para Todos","No aplica","No Aplica","No Aplica","No Aplica","860045904","CAJA DE COMPENSACION FAMILIAR DE CUNDINAMARCA - COMFACUNDI",936500,null,null,null,null,936500,936500,"2020-08-01",null,null,null,null,null,null,null,null,null,null,null,null,null,1,{"$f":"IF(SUMPRODUCT((A$14:A433=A433)*(B$14:B433=B433)*(D$14:D433=D433))>1,0,1)","v":0}]
[7,"2020",null,"N/A","Otros gastos",null,"No aplica","V/R. DE LA SEGURIDAD SOCIAL EN SALUD DE LOS EDILES DE LA LOCALIDAD DE LA CANDELARIA, ACORDE A LOS HONORARIOS PERCIBIDOS DURANTE EL MES DE JULIO DE 2020.","Funcionamiento","Bogotá Mejor para Todos","No aplica","No Aplica","No Aplica","No Aplica","860066942","CAJA DE COMPENSACION FAMILIAR - COMPENSAR",936500,null,null,null,null,936500,936500,"2020-08-01",null,null,null,null,null,null,null,null,null,null,null,null,null,1,{"$f":"IF(SUMPRODUCT((A$14:A434=A434)*(B$14:B434=B434)*(D$14:D434=D434))>1,0,1)","v":0}]
[9,"2020",null,"N/A","Otros gastos",null,"No aplica","V/R. DE LA SEGURIDAD SOCIAL EN SALUD DE LOS EDILES DE LA LOCALIDAD DE LA CANDELARIA, ACORDE A LOS HONORARIOS PERCIBIDOS DURANTE EL MES DE AGOSTO DE 2020.","Funcionamiento","Bogotá Mejor para Todos","No aplica","No Aplica","No Aplica","No Aplica","800251440","ENTIDAD PROMOTORA DE SALUD SANITAS S.A.",3746000,null,null,null,null,3746000,3746000,"2020-09-08",null,null,null,null,null,null,null,null,null,null,null,null,null,1,{"$f":"IF(SUMPRODUCT((A$14:A435=A435)*(B$14:B435=B435)*(D$14:D435=D435))>1,0,1)","v":0}]
[9,"2020",null,"N/A","Otros gastos",null,"No aplica","V/R. DE LA SEGURIDAD SOCIAL EN SALUD DE LOS EDILES DE LA LOCALIDAD DE LA CANDELARIA, ACORDE A LOS HONORARIOS PERCIBIDOS DURANTE EL MES DE AGOSTO DE 2020.","Funcionamiento","Bogotá Mejor para Todos","No aplica","No Aplica","No Aplica","No Aplica","830003564","ENTIDAD PROMOTORA DE SALUD FAMISANAR CAFAM COLSUBSIDIO LIMITADA",936500,null,null,null,null,936500,936500,"2020-09-08",null,null,null,null,null,null,null,null,null,null,null,null,null,1,{"$f":"IF(SUMPRODUCT((A$14:A436=A436)*(B$14:B436=B436)*(D$14:D436=D436))>1,0,1)","v":0}]
[9,"2020",null,"N/A","Otros gastos",null,"No aplica","V/R. DE LA SEGURIDAD SOCIAL EN SALUD DE LOS EDILES DE LA LOCALIDAD DE LA CANDELARIA, ACORDE A LOS HONORARIOS PERCIBIDOS DURANTE EL MES DE AGOSTO DE 2020.","Funcionamiento","Bogotá Mejor para Todos","No aplica","No Aplica","No Aplica","No Aplica","860045904","CAJA DE COMPENSACION FAMILIAR DE CUNDINAMARCA - COMFACUNDI",936500,null,null,null,null,936500,936500,"2020-09-08",null,null,null,null,null,null,null,null,null,null,null,null,null,1,{"$f":"IF(SUMPRODUCT((A$14:A437=A437)*(B$14:B437=B437)*(D$14:D437=D437))>1,0,1)","v":0}]
[8,"2020",null,"N/A","Otros gastos",null,"No aplica","V/R. DE LA SEGURIDAD SOCIAL EN SALUD DE LOS EDILES DE LA LOCALIDAD DE LA CANDELARIA, ACORDE A LOS HONORARIOS PERCIBIDOS DURANTE EL MES DE AGOSTO DE 2020.","Funcionamiento","Bogotá Mejor para Todos","No aplica","No Aplica","No Aplica","No Aplica","860066942","CAJA DE COMPENSACION FAMILIAR - COMPENSAR",936500,null,null,null,null,936500,936500,"2020-09-08",null,null,null,null,null,null,null,null,null,null,null,null,null,1,{"$f":"IF(SUMPRODUCT((A$14:A438=A438)*(B$14:B438=B438)*(D$14:D438=D438))>1,0,1)","v":0}]
[45033,"2020",null,"N/A","Otros gastos",null,"No aplica","PAGO SERVICIO DE TELEFONIA E INTERNET DE LA ALCALDIA LOCAL DE LA CANDELARIA Y SUS SEDES. DEL 01 AL 30 SEPTIEMBRE 2020","Funcionamiento","Bogotá Mejor para Todos","No aplica","No Aplica","No Aplica","No Aplica","899999115","EMPRESA DE TELECOMUNICACIONES DE BOGOTÁ S.A. E.S.P. - ETB S.A. ESP",2894910,null,null,null,null,2894910,2894910,"2020-10-30",null,null,null,null,null,null,null,null,null,null,null,null,null,1,{"$f":"IF(SUMPRODUCT((A$14:A439=A439)*(B$14:B439=B439)*(D$14:D439=D439))>1,0,1)","v":1}]
[286298346,"2020",null,"N/A","Otros gastos",null,"No aplica","PAGO SERVICIOS PBLICOS DEL 01 AL 30 DE NOVIEMBRE DE 2020, FACTURAS286298346-286303121-286302524.","Funcionamiento","Bogotá Mejor para Todos","No aplica","No Aplica","No Aplica","No Aplica","899999115","EMPRESA DE TELECOMUNICACIONES DE BOGOTÁ S.A. E.S.P. - ETB S.A. ESP",5890180,null,null,null,null,5890180,5890180,"2020-12-23",null,null,null,null,null,null,null,null,null,null,null,null,null,1,{"$f":"IF(SUMPRODUCT((A$14:A440=A440)*(B$14:B440=B440)*(D$14:D440=D440))>1,0,1)","v":1}]
[1,"2020",null,"N/A","Otros gastos",null,"No aplica","V/R. DEL SERVICIO DE TELEFONIA FIJA DE LAS DIFERENTES SEDES DONDE FUNCIONA LA ALCALDIA LOCAL DE LA CANDELARIA, SEGUN CAUSACIÓN CONTABLE Y FACTURAS ANEXAS.","Funcionamiento","Bogotá Mejor para Todos","No aplica","No Aplica","No Aplica","No Aplica","899999115","EMPRESA DE TELECOMUNICACIONES DE BOGOTÁ S.A. E.S.P. - ETB S.A. ESP",235290,null,null,null,null,235290,235290,"2020-01-16",null,null,null,null,null,null,null,null,null,null,null,null,null,1,{"$f":"IF(SUMPRODUCT((A$14:A441=A441)*(B$14:B441=B441)*(D$14:D441=D441))>1,0,1)","v":0}]
[275353853,"2020",null,"N/A","Otros gastos",null,"No aplica","Pagar el servicio de telefonía de la Alcaldía Local La Candelaria, correspondiente al periodo del 1 al 31 de diciembre de 2019","Funcionamiento","Bogotá Mejor para Todos","No aplica","No Aplica","No Aplica","No Aplica","899999115","EMPRESA DE TELECOMUNICACIONES DE BOGOTÁ S.A. E.S.P. - ETB S.A. ESP",1249320,null,null,null,null,1249320,1249320,"2020-01-21",null,null,null,null,null,null,null,null,null,null,null,null,null,1,{"$f":"IF(SUMPRODUCT((A$14:A442=A442)*(B$14:B442=B442)*(D$14:D442=D442))>1,0,1)","v":1}]
[3038320,"2020",null,"N/A","Otros gastos",null,"No aplica","PAGO DE SERVCICIIO PUBLICO DEL MES DE FEBRERO CORRESPONDIENTE AL PERIDOO CONSUMO DEL 01 AL 31 DE ENERO  DIRECCION CRA 5 N° 12C-40","Funcionamiento","Bogotá Mejor para Todos","No aplica","No Aplica","No Aplica","No Aplica","899999115","EMPRESA DE TELECOMUNICACIONES DE BOGOTÁ S.A. E.S.P. - ETB S.A. ESP",976750,null,null,null,null,976750,976750,"2020-02-19",null,null,null,null,null,null,null,null,null,null,null,null,null,1,{"$f":"IF(SUMPRODUCT((A$14:A443=A443)*(B$14:B443=B443)*(D$14:D443=D443))>1,0,1)","v":1}]
[7230123,"2020",null,"N/A","Otros gastos",null,"No aplica","PAGO DE SERVCICIIO PUBLICO DEL MES DE FEBRERO CORRESPONDIENTE AL PERIDOO CONSUMO DEL 01 AL 31 DE ENERO  DIRECCION CRA 5 N° 12C-40","Funcionamiento","Bogotá Mejor para Todos","No aplica","No Aplica","No Aplica","No Aplica","899999115","EMPRESA DE TELECOMUNICACIONES DE BOGOTÁ S.A. E.S.P. - ETB S.A. ESP",714000,null,null,null,null,714000,714000,"2020-02-19",null,null,null,null,null,null,null,null,null,null,null,null,null,1,{"$f":"IF(SUMPRODUCT((A$14:A444=A444)*(B$14:B444=B444)*(D$14:D444=D444))>1,0,1)","v":1}]
[4363105,"2020",null,"N/A","Otros gastos",null,"No aplica","PAGO DE SERVICIOS PUBLICOS DE TELEFONIA FIJA DE LA ALCALDIA LOCAL DE LA CANDELARIA","Funcionamiento","Bogotá Mejor para Todos","No aplica","No Aplica","No Aplica","No Aplica","899999115","EMPRESA DE TELECOMUNICACIONES DE BOGOTÁ S.A. E.S.P. - ETB S.A. ESP",1211020,null,null,null,null,1211020,1211020,"2020-03-04",null,null,null,null,null,null,null,null,null,null,null,null,null,1,{"$f":"IF(SUMPRODUCT((A$14:A445=A445)*(B$14:B445=B445)*(D$14:D445=D445))>1,0,1)","v":1}]
[5,"2020",null,"N/A","Otros gastos",null,"No aplica","V/R. DEL SERVICIO DE TELEFONIA DE LAS DIFERENTES SEDES DONDE FUNCIONA AL ALCALDIA LOCAL DE LA CANDELARIA.","Funcionamiento","Bogotá Mejor para Todos","No aplica","No Aplica","No Aplica","No Aplica","899999115","EMPRESA DE TELECOMUNICACIONES DE BOGOTÁ S.A. E.S.P. - ETB S.A. ESP",1250130,null,null,null,null,1250130,1250130,"2020-03-17",null,null,null,null,null,null,null,null,null,null,null,null,null,1,{"$f":"IF(SUMPRODUCT((A$14:A446=A446)*(B$14:B446=B446)*(D$14:D446=D446))>1,0,1)","v":0}]
[6,"2020",null,"N/A","Otros gastos",null,"No aplica","V/R. DEL SERVICO DE TELEFONIA DE LAS DIFERENTES SEDES DONDE FUNCIONA LA ALCALDIA LOCAL DE LA CANDELARIA, SEGUN FACTURAS ANEXAS Y CAUSACIÓN CONTBLE.","Funcionamiento","Bogotá Mejor para Todos","No aplica","No Aplica","No Aplica","No Aplica","899999115","EMPRESA DE TELECOMUNICACIONES DE BOGOTÁ S.A. E.S.P. - ETB S.A. ESP",2500270,null,null,null,null,2500270,2500270,"2020-06-08",null,null,null,null,null,null,null,null,null,null,null,null,null,1,{"$f":"IF(SUMPRODUCT((A$14:A447=A447)*(B$14:B447=B447)*(D$14:D447=D447))>1,0,1)","v":0}]
[6,"2020",null,"N/A","Otros gastos",null,"No aplica","V/R. DEL SERVICIO DE ETB DE LAS DIFERENTES SEDES DONDE FUNCIONA LA ALCALDÍA LOCAL DE LA CANDELARIA, SEGUN CAUSACIÓN CONTABLE Y FACTURAS ANEXAS.","Funcionamiento","Bogotá Mejor para Todos","No aplica","No Aplica","No Aplica","No Aplica","899999115","EMPRESA DE TELECOMUNICACIONES DE BOGOTÁ S.A. E.S.P. - ETB S.A. ESP",1428000,null,null,null,null,1428000,1428000,"2020-06-08",null,null,null,null,null,null,null,null,null,null,null,null,null,1,{"$f":"IF(SUMPRODUCT((A$14:A448=A448)*(B$14:B448=B448)*(D$14:D448=D448))>1,0,1)","v":0}]
[6,"2020",null,"N/A","Otros gastos",null,"No aplica","V/R. DEL SERVICIO DE ETB DE LAS DIFERENTES SEDES DONDE FUNCIONA LA ALCALDIA LOCAL DE LA CANDELARIA, SEGUN CAUSACIÓN CONTABLE Y FACTURAS ANEXAS.","Funcionamiento","Bogotá Mejor para Todos","No aplica","No Aplica","No Aplica","No Aplica","899999115","EMPRESA DE TELECOMUNICACIONES DE BOGOTÁ S.A. E.S.P. - ETB S.A. ESP",2142000,null,null,null,null,2142000,2142000,"2020-06-16",null,null,null,null,null,null,null,null,null,null,null,null,null,1,{"$f":"IF(SUMPRODUCT((A$14:A449=A449)*(B$14:B449=B449)*(D$14:D449=D449))>1,0,1)","v":0}]
[7,"2020",null,"N/A","Otros gastos",null,"No aplica","V/r. del servicio de etb de las diferentes sedes donde funciona al alcaldía local de la candelaria, según causación contable y facturas anexas.","Funcionamiento","Bogotá Mejor para Todos","No aplica","No Aplica","No Aplica","No Aplica","899999115","EMPRESA DE TELECOMUNICACIONES DE BOGOTÁ S.A. E.S.P. - ETB S.A. ESP",1207420,null,null,null,null,1207420,1207420,"2020-07-01",null,null,null,null,null,null,null,null,null,null,null,null,null,1,{"$f":"IF(SUMPRODUCT((A$14:A450=A450)*(B$14:B450=B450)*(D$14:D450=D450))>1,0,1)","v":0}]
[86718,"2020",null,"N/A","Otros gastos",null,"No aplica","PAGO DE SERVICIO DE TELEFONÍA FIJA PERIODO DE CONSUMO JUNIO 2020 DE LA ALCALDÍA LOCAL DE LA CANDELARIA","Funcionamiento","Bogotá Mejor para Todos","No aplica","No Aplica","No Aplica","No Aplica","899999115","EMPRESA DE TELECOMUNICACIONES DE BOGOTÁ S.A. E.S.P. - ETB S.A. ESP",2441310,null,null,null,null,2441310,2441310,"2020-07-25",null,null,null,null,null,null,null,null,null,null,null,null,null,1,{"$f":"IF(SUMPRODUCT((A$14:A451=A451)*(B$14:B451=B451)*(D$14:D451=D451))>1,0,1)","v":1}]
[32363,"2020",null,"N/A","Otros gastos",null,"No aplica","PAGAR FACTURA DEL 01 AL 31 DE JULIO DE ETB N°32363 DE LA ALCALDIA LOCAL DE LA CANDELARIA SERIVICIO TELEFONIA","Funcionamiento","Bogotá Mejor para Todos","No aplica","No Aplica","No Aplica","No Aplica","899999115","EMPRESA DE TELECOMUNICACIONES DE BOGOTÁ S.A. E.S.P. - ETB S.A. ESP",45160,null,null,null,null,45160,45160,"2020-09-08",null,null,null,null,null,null,null,null,null,null,null,null,null,1,{"$f":"IF(SUMPRODUCT((A$14:A452=A452)*(B$14:B452=B452)*(D$14:D452=D452))>1,0,1)","v":1}]
[64866,"2020",null,"N/A","Otros gastos",null,"No aplica","PAGAR LAS FACTURAS Nos. 64866 y 64380 DEL SERVICIO DE TELEFONÍA FIJA DEL PERIODO COMPRENDIDO DEL 1 AL 31 DE AGOSTO DE 2020 DE LA ALCALDÍA LOCAL LA CANDELARIA.","Funcionamiento","Bogotá Mejor para Todos","No aplica","No Aplica","No Aplica","No Aplica","899999115","EMPRESA DE TELECOMUNICACIONES DE BOGOTÁ S.A. E.S.P. - ETB S.A. ESP",1690780,null,null,null,null,1690780,1690780,"2020-09-18",null,null,null,null,null,null,null,null,null,null,null,null,null,1,{"$f":"IF(SUMPRODUCT((A$14:A453=A453)*(B$14:B453=B453)*(D$14:D453=D453))>1,0,1)","v":1}]
[3601022,"2020",null,"N/A","Otros gastos",null,"No aplica","PAGAR LA FACTURA No. 000283601022 DEL SERVICIO DE TLEFONIA DEL PERIODO DEL 1 AL 31 DE AGOSTO, DEL FONDO DE DESARROLLO LOCAL LA CANDELARIA.","Funcionamiento","Bogotá Mejor para Todos","No aplica","No Aplica","No Aplica","No Aplica","899999115","EMPRESA DE TELECOMUNICACIONES DE BOGOTÁ S.A. E.S.P. - ETB S.A. ESP",1296920,null,null,null,null,1296920,1296920,"2020-09-24",null,null,null,null,null,null,null,null,null,null,null,null,null,1,{"$f":"IF(SUMPRODUCT((A$14:A454=A454)*(B$14:B454=B454)*(D$14:D454=D454))>1,0,1)","v":1}]
[1,"2020",null,"N/A","Otros gastos",null,"No aplica","V/R. DEL SERVIVIO DE INTERNET DE LAS DIFERENTES SEDES DONDE FUNCIONA EL FDLC, ACORDE A LA CAUSACIÓN CONTABLE Y FACTURAS ANEXAS.","Funcionamiento","Bogotá Mejor para Todos","No aplica","No Aplica","No Aplica","No Aplica","899999115","EMPRESA DE TELECOMUNICACIONES DE BOGOTA SA ESP",976750,null,null,null,null,976750,976750,"2020-01-16",null,null,null,null,null,null,null,null,null,null,null,null,null,1,{"$f":"IF(SUMPRODUCT((A$14:A455=A455)*(B$14:B455=B455)*(D$14:D455=D455))>1,0,1)","v":0}]
[4,"2020",null,"N/A","Otros gastos",null,"No aplica","V/R. DEL SERVICIO DE INTERNET DE LAS DIFERENTES SEDES DONDE FUNCIONA LA ALCALDIA LOCAL DE LA CANDELARIA.","Funcionamiento","Bogotá Mejor para Todos","No aplica","No Aplica","No Aplica","No Aplica","899999115","EMPRESA DE TELECOMUNICACIONES DE BOGOTA SA ESP",1690750,null,null,null,null,1690750,1690750,"2020-03-17",null,null,null,null,null,null,null,null,null,null,null,null,null,1,{"$f":"IF(SUMPRODUCT((A$14:A456=A456)*(B$14:B456=B456)*(D$14:D456=D456))>1,0,1)","v":0}]
[6,"2020",null,"N/A","Otros gastos",null,"No aplica","V/R. SERVICIO DE TRANSMISIÓN DE DATOS ETB DE LAS DIFERENTES SEDES DONDE FUNCIONA LA ALCALDIA LOCAL DE LA CANDELARIA, SEGUN CAUSACIÓN CONTABLE Y FACTURAS ANEXAS.","Funcionamiento","Bogotá Mejor para Todos","No aplica","No Aplica","No Aplica","No Aplica","899999115","EMPRESA DE TELECOMUNICACIONES DE BOGOTA SA ESP",1953500,null,null,null,null,1953500,1953500,"2020-06-08",null,null,null,null,null,null,null,null,null,null,null,null,null,1,{"$f":"IF(SUMPRODUCT((A$14:A457=A457)*(B$14:B457=B457)*(D$14:D457=D457))>1,0,1)","v":0}]
[6,"2020",null,"N/A","Otros gastos",null,"No aplica","V/R. SERVICIO DE ETB - TRANSMISIÓN DE DATOS DE LAS DIFERENTES SEDES DONDE FUNCIONA LA ALCALDIA LOCAL DE LA CANDELARIA, SEGUN CAUSACIÓN CONTABLE Y FACTURAS ANEXAS.","Funcionamiento","Bogotá Mejor para Todos","No aplica","No Aplica","No Aplica","No Aplica","899999115","EMPRESA DE TELECOMUNICACIONES DE BOGOTA SA ESP",2930250,null,null,null,null,2930250,2930250,"2020-06-16",null,null,null,null,null,null,null,null,null,null,null,null,null,1,{"$f":"IF(SUMPRODUCT((A$14:A458=A458)*(B$14:B458=B458)*(D$14:D458=D458))>1,0,1)","v":0}]
[1030,"2020",null,"N/A","Otros gastos",null,"No aplica","PAGO DE SERVICIO DE ENERGIA DE 8 SEPTIEMBRE DE 8 DE OCTUBRE DE 2020 DELAS SEDES DE LA ALCALDIA LOCAL DE LA CANDELARIA","Funcionamiento","Bogotá Mejor para Todos","No aplica","No Aplica","No Aplica","No Aplica","830037248","CODENSA S.A. ESP",5896250,null,null,null,null,5896250,5896250,"2020-10-30",null,null,null,null,null,null,null,null,null,null,null,null,null,1,{"$f":"IF(SUMPRODUCT((A$14:A459=A459)*(B$14:B459=B459)*(D$14:D459=D459))>1,0,1)","v":1}]
[61758947,"2020",null,"N/A","Otros gastos",null,"No aplica","PAGO FACTURAS NOVIEMBE-DICIEMBRE 2020 FACTURAS 61758947-615687139-7590-7591-9064-5765","Funcionamiento","Bogotá Mejor para Todos","No aplica","No Aplica","No Aplica","No Aplica","830037248","CODENSA S.A. ESP",6669350,null,null,null,null,6669350,6669350,"2020-12-24",null,null,null,null,null,null,null,null,null,null,null,null,null,1,{"$f":"IF(SUMPRODUCT((A$14:A460=A460)*(B$14:B460=B460)*(D$14:D460=D460))>1,0,1)","v":1}]
[578706768,"2020",null,"N/A","Otros gastos",null,"No aplica","Pagar el servicio de Energía de los inmuebles adscritos a la Alcaldía Local La Candelaria asi: Periodo de consumo 11 diciembre 2019 al 13 enero 2020","Funcionamiento","Bogotá Mejor para Todos","No aplica","No Aplica","No Aplica","No Aplica","830037248","CODENSA S. A. ESP",4526960,null,null,null,null,4526960,4526960,"2020-01-21",null,null,null,null,null,null,null,null,null,null,null,null,null,1,{"$f":"IF(SUMPRODUCT((A$14:A461=A461)*(B$14:B461=B461)*(D$14:D461=D461))>1,0,1)","v":1}]
[3993908,"2020",null,"N/A","Otros gastos",null,"No aplica","V/R. DEL SERVICIO DE ENERGIA- CODENSA DE LAS DIFERENTES SEDES DONDE FUNCIONA LA ALCALDIA LOCAL DE LA CANDELARIA, SEGUN CAUSACIÓN CONTABLE Y FACTURAS ANEXAS.","Funcionamiento","Bogotá Mejor para Todos","No aplica","No Aplica","No Aplica","No Aplica","830037248","CODENSA S. A. ESP",3317670,null,null,null,null,3317670,3317670,"2020-02-19",null,null,null,null,null,null,null,null,null,null,null,null,null,1,{"$f":"IF(SUMPRODUCT((A$14:A462=A462)*(B$14:B462=B462)*(D$14:D462=D462))>1,0,1)","v":1}]
[3,"2020",null,"N/A","Otros gastos",null,"No aplica","V/R. DEL SERVICIO DE CODENSA DE LAS DIFERENTES SEDES DONDE FUNCIONA LA ALCALDIA LOCAL DE LA CANDELARIA.","Funcionamiento","Bogotá Mejor para Todos","No aplica","No Aplica","No Aplica","No Aplica","830037248","CODENSA S. A. ESP",3027100,null,null,null,null,3027100,3027100,"2020-03-13",null,null,null,null,null,null,null,null,null,null,null,null,null,1,{"$f":"IF(SUMPRODUCT((A$14:A463=A463)*(B$14:B463=B463)*(D$14:D463=D463))>1,0,1)","v":0}]
[86048,"2020",null,"N/A","Otros gastos",null,"No aplica","PAGO SERVICIO DE ENERGIA DEL 8 DE JUNIO AL 9 DE JULIO DE LAS SEDES DE LA ALCALDÍA LOCAL DE LA CANDELARIA","Funcionamiento","Bogotá Mejor para Todos","No aplica","No Aplica","No Aplica","No Aplica","830037248","CODENSA S.A. ESP",2693060,null,null,null,null,2693060,2693060,"2020-07-25",null,null,null,null,null,null,null,null,null,null,null,null,null,1,{"$f":"IF(SUMPRODUCT((A$14:A464=A464)*(B$14:B464=B464)*(D$14:D464=D464))>1,0,1)","v":1}]
[13388,"2020",null,"N/A","Otros gastos",null,"No aplica","PAGO SERVICIO DE ENERGIA DEL 9 DE JUlIO AL10 DE AGOSTO DE LAS SEDES DE LA ALCALDÍA LOCAL DE LA CANDELARIA","Funcionamiento","Bogotá Mejor para Todos","No aplica","No Aplica","No Aplica","No Aplica","830037248","CODENSA S.A. ESP",2052190,null,null,null,null,2052190,2052190,"2020-08-20",null,null,null,null,null,null,null,null,null,null,null,null,null,1,{"$f":"IF(SUMPRODUCT((A$14:A465=A465)*(B$14:B465=B465)*(D$14:D465=D465))>1,0,1)","v":1}]
[6,"2020",null,"N/A","Otros gastos",null,"No aplica","V/R. DEL SERVICIO DE ENERGIA DE LAS DIFERENTES SEDES DONDE FUNIONA LA ALCALDIA LOCAL DE LA CANDELARIA, SEGÚN CAUSACIÓN CONTABLE DE JUNIO 16/2020 Y FACTURAS ANEXAS.","Funcionamiento","Bogotá Mejor para Todos","No aplica","No Aplica","No Aplica","No Aplica","830037248","CODENSA S. A. ESP",8824990,null,null,null,null,8824990,8824990,"2020-06-16",null,null,null,null,null,null,null,null,null,null,null,null,null,1,{"$f":"IF(SUMPRODUCT((A$14:A466=A466)*(B$14:B466=B466)*(D$14:D466=D466))>1,0,1)","v":0}]
["9619-9510","2020",null,"N/A","Otros gastos",null,"No aplica","PAGO FACTURAS DE ACUEDUCTO N°0419- 0112-0013-9916-9817-0211-0310-97189619-9510 PERIODO FACTURADO SEPTIEMBRE 2 OCTUBRE 29.","Funcionamiento","Bogotá Mejor para Todos","No aplica","No Aplica","No Aplica","No Aplica","899999094","EMPRESA DE ACUEDUCTO Y ALCANTARILLADO DE BOGOTA ESP",1621918,null,null,null,null,1621918,1621918,"2020-12-09",null,null,null,null,null,null,null,null,null,null,null,null,null,1,{"$f":"IF(SUMPRODUCT((A$14:A467=A467)*(B$14:B467=B467)*(D$14:D467=D467))>1,0,1)","v":1}]
[1,"2020",null,"N/A","Otros gastos",null,"No aplica","V/R. DEL SERVICIO DE ACUEDUCTO DE LAS DIFERENTES SEDES DONDE FUNCIONA LA ALCALDIA LOCAL DE LA CANDELARIA, SEGUN CAUSACIÓN CONTABLE DE ENERO 29 DE 2020 Y FACTURAS ANEXAS.","Funcionamiento","Bogotá Mejor para Todos","No aplica","No Aplica","No Aplica","No Aplica","899999094","EMPRESA DE ACUEDUCTO Y ALCANTARILLADO DE BOGOTA ESP",1745170,null,null,null,null,1745170,1745170,"2020-01-30",null,null,null,null,null,null,null,null,null,null,null,null,null,1,{"$f":"IF(SUMPRODUCT((A$14:A468=A468)*(B$14:B468=B468)*(D$14:D468=D468))>1,0,1)","v":0}]
[4,"2020",null,"N/A","Otros gastos",null,"No aplica","V/R. SECIO DE ACUEDUCTO DE LAS DIFERENTES SEDES DONDE FUNCIONA LA ALCALDIA LOCAL DE LA CANDELARIA, SEGUN CAUSACIÓN CONTABLE Y FACTURAS ANEXAS.","Funcionamiento","Bogotá Mejor para Todos","No aplica","No Aplica","No Aplica","No Aplica","899999094","EMPRESA DE ACUEDUCTO Y ALCANTARILLADO DE BOGOTA ESP",1440840,null,null,null,null,1440840,1440840,"2020-04-14",null,null,null,null,null,null,null,null,null,null,null,null,null,1,{"$f":"IF(SUMPRODUCT((A$14:A469=A469)*(B$14:B469=B469)*(D$14:D469=D469))>1,0,1)","v":0}]
[6,"2020",null,"N/A","Otros gastos",null,"No aplica","V/R. DEL SERVICIO DE ACUEDUCTO DE LAS DIFERENTES SEDES DONDE FUNCIONA LA ALCLADÍA LOCAL DE LA CANDELARIA, SEGUN CAUSACIÓN CONTABLE Y FACTURAS ANEXAS.","Funcionamiento","Bogotá Mejor para Todos","No aplica","No Aplica","No Aplica","No Aplica","899999094","EMPRESA DE ACUEDUCTO Y ALCANTARILLADO DE BOGOTA ESP",842840,null,null,null,null,842840,842840,"2020-06-10",null,null,null,null,null,null,null,null,null,null,null,null,null,1,{"$f":"IF(SUMPRODUCT((A$14:A470=A470)*(B$14:B470=B470)*(D$14:D470=D470))>1,0,1)","v":0}]
[5914,"2020",null,"N/A","Otros gastos",null,"No aplica","PAGAR LAS FACTURAS DE SERVICIOS PÚBLICOS DE ACUEDUCTO Y ALCANTARILLADO DE LOS ENTES ADSCRITOS AL FONDO DE DESARROLLO LOCAL LA CANDELARIA, DEL PERIODO COMPRENDIDO ENTRE EL 5 DE MAYO Y EL 2 DE JULIO DE 2020","Funcionamiento","Bogotá Mejor para Todos","No aplica","No Aplica","No Aplica","No Aplica","899999094","EMPRESA DE ACUEDUCTO Y ALCANTARILLADO DE BOGOTA ESP",1004540,null,null,null,null,1004540,1004540,"2020-08-08",null,null,null,null,null,null,null,null,null,null,null,null,null,1,{"$f":"IF(SUMPRODUCT((A$14:A471=A471)*(B$14:B471=B471)*(D$14:D471=D471))>1,0,1)","v":1}]
[47327147,"2020",null,"N/A","Otros gastos",null,"No aplica","PAGO FACTURA 47327147-PERIODO OCTUBRE DE2020","Funcionamiento","Bogotá Mejor para Todos","No aplica","No Aplica","No Aplica","No Aplica","901145808","PROMOAMBIENTAL DISTRITO S A S ESP",5248590,null,null,null,null,5248590,5248590,"2020-12-24",null,null,null,null,null,null,null,null,null,null,null,null,null,1,{"$f":"IF(SUMPRODUCT((A$14:A472=A472)*(B$14:B472=B472)*(D$14:D472=D472))>1,0,1)","v":1}]
[2,"2020",null,"N/A","Otros gastos",null,"No aplica","V/R. DEL SERVICIO DE ASEO DE LAS DIFERENTES SEDES DONDE FUNCIONA LA ALCALDIA LOCAL DE LA CANDELARIA, SEGÚN CAUSACIÓN CONTABLE Y FACTIRAS ANEXAS.","Funcionamiento","Bogotá Mejor para Todos","No aplica","No Aplica","No Aplica","No Aplica","901145808","PROMOAMBIENTAL DISTRITO S A S ESP",3928160,null,null,null,null,3928160,3928160,"2020-01-14",null,null,null,null,null,null,null,null,null,null,null,null,null,1,{"$f":"IF(SUMPRODUCT((A$14:A473=A473)*(B$14:B473=B473)*(D$14:D473=D473))>1,0,1)","v":0}]
[1219482,"2020",null,"N/A","Otros gastos",null,"No aplica","Pago de las facturas del servicio de aseo de las diferentes sedes donde funciona la Alcaldía Local La Candelaria a la Empresa Promoambiental Distrito S.A.S.E.S.P. del periodo 1 al 30 de noviembre de 2019","Funcionamiento","Bogotá Mejor para Todos","No aplica","No Aplica","No Aplica","No Aplica","901145808","PROMOAMBIENTAL DISTRITO S A S ESP",3928160,null,null,null,null,3928160,3928160,"2020-01-22",null,null,null,null,null,null,null,null,null,null,null,null,null,1,{"$f":"IF(SUMPRODUCT((A$14:A474=A474)*(B$14:B474=B474)*(D$14:D474=D474))>1,0,1)","v":1}]
[1,"2020",null,"N/A","Otros gastos",null,"No aplica","V/R. SERVICIO DE ASEO - PROMOAMBIENTAL - SEGUN CAUSACIÓN CONTABLE DE ENERO 29 DE 2020 Y FACTURAS ANEXAS.","Funcionamiento","Bogotá Mejor para Todos","No aplica","No Aplica","No Aplica","No Aplica","901145808","PROMOAMBIENTAL DISTRITO S A S ESP",4835460,null,null,null,null,4835460,4835460,"2020-01-30",null,null,null,null,null,null,null,null,null,null,null,null,null,1,{"$f":"IF(SUMPRODUCT((A$14:A475=A475)*(B$14:B475=B475)*(D$14:D475=D475))>1,0,1)","v":0}]
[12192374,"2020",null,"N/A","Otros gastos",null,"No aplica","V/R. DEL SERVICIO DE ASEO DE LAS DIFERENTES SEDES DONDE FUNCIONA LA ALCALDIA LOCAL DE LA CANDELARIA, SEGÚN CAUSACIÓN CONTABLE Y FACTIRAS ANEXAS.","Funcionamiento","Bogotá Mejor para Todos","No aplica","No Aplica","No Aplica","No Aplica","901145808","PROMOAMBIENTAL DISTRITO S A S ESP",5403320,null,null,null,null,5403320,5403320,"2020-03-04",null,null,null,null,null,null,null,null,null,null,null,null,null,1,{"$f":"IF(SUMPRODUCT((A$14:A476=A476)*(B$14:B476=B476)*(D$14:D476=D476))>1,0,1)","v":1}]
[66375,"2020",null,"N/A","Otros gastos",null,"No aplica","PAGO FACTURAS DEL SERVICIO DE GAS<(>,<)> DE LA ALCALDIA LOCAL DE LACANDELARIA Y SUS SEDES, ENTRE El 10 DE SEPTIEMBRE Y EL 10 DE OCTUBRE DE2020.","Funcionamiento","Bogotá Mejor para Todos","No aplica","No Aplica","No Aplica","No Aplica","800007813","VANTI S.A. ESP",180430,null,null,null,null,180430,180430,"2020-10-30",null,null,null,null,null,null,null,null,null,null,null,null,null,1,{"$f":"IF(SUMPRODUCT((A$14:A477=A477)*(B$14:B477=B477)*(D$14:D477=D477))>1,0,1)","v":1}]
[7151161197,"2020",null,"N/A","Otros gastos",null,"No aplica","PAGO FACTURAS F151161197 Y F151133608","Funcionamiento","Bogotá Mejor para Todos","No aplica","No Aplica","No Aplica","No Aplica","800007813","VANTI S.A. ESP",75640,null,null,null,null,75640,75640,"2020-12-11",null,null,null,null,null,null,null,null,null,null,null,null,null,1,{"$f":"IF(SUMPRODUCT((A$14:A478=A478)*(B$14:B478=B478)*(D$14:D478=D478))>1,0,1)","v":1}]
[1,"2020",null,"N/A","Otros gastos",null,"No aplica","V/R. DEL SERVICIO DE GAS NATURAL DE LA CASA BELEN Y SANTA BARBARA. SEGÚN CAUSACIÓN CONTABLE Y FACTURAS ANEXAS.","Funcionamiento","Bogotá Mejor para Todos","No aplica","No Aplica","No Aplica","No Aplica","800007813","VANTI S.A. ESP",11460,null,null,null,null,11460,11460,"2020-01-14",null,null,null,null,null,null,null,null,null,null,null,null,null,1,{"$f":"IF(SUMPRODUCT((A$14:A479=A479)*(B$14:B479=B479)*(D$14:D479=D479))>1,0,1)","v":0}]
[2101,"2020",null,"N/A","Otros gastos",null,"No aplica","PAGO SERVICIO GAS NATURAL DE LA CASA COMUNITARIA EGIPTO PERIODO 11 DICIEMBRE DE 2019 A 13 ENERO DE 2020, CASA COMUNITARIA BELEN PERIODO 9 DICIEMBRE 2019 A ENERO 10 DE 2020, CASA COMUNITARIA CONCORDIA PERIODO 11 DICIEMBRE DE 2019 A 13 ENERO DE 2020","Funcionamiento","Bogotá Mejor para Todos","No aplica","No Aplica","No Aplica","No Aplica","800007813","VANTI S.A. ESP",86680,null,null,null,null,86680,86680,"2020-01-21",null,null,null,null,null,null,null,null,null,null,null,null,null,1,{"$f":"IF(SUMPRODUCT((A$14:A480=A480)*(B$14:B480=B480)*(D$14:D480=D480))>1,0,1)","v":1}]
[19862574,"2020",null,"N/A","Otros gastos",null,"No aplica","PAGO DE SERVICIO GAS NATURAL CASA COMUNITRIA DIRECCION KRA  2 ESTE 7","Funcionamiento","Bogotá Mejor para Todos","No aplica","No Aplica","No Aplica","No Aplica","800007813","VANTI S.A. ESP",12930,null,null,null,null,12930,12930,"2020-02-19",null,null,null,null,null,null,null,null,null,null,null,null,null,1,{"$f":"IF(SUMPRODUCT((A$14:A481=A481)*(B$14:B481=B481)*(D$14:D481=D481))>1,0,1)","v":1}]
[3,"2020",null,"N/A","Otros gastos",null,"No aplica","V/R. DEL SERVICIO DE GAS ANTURAL DE LAS DIFERENTES SEDES DONDE FUNCIONA LA ALCALDIA LOCAL DE LA CANDELARIA.","Funcionamiento","Bogotá Mejor para Todos","No aplica","No Aplica","No Aplica","No Aplica","800007813","VANTI S.A. ESP",45840,null,null,null,null,45840,45840,"2020-03-13",null,null,null,null,null,null,null,null,null,null,null,null,null,1,{"$f":"IF(SUMPRODUCT((A$14:A482=A482)*(B$14:B482=B482)*(D$14:D482=D482))>1,0,1)","v":0}]
[4,"2020",null,"N/A","Otros gastos",null,"No aplica","V/R. DEL SERVICIO DE GAS NATURAL DE LAS DIFERENTES SEDES DONDE FUNCIONA LA ALCALDIA LOCAL DE LA CANDELARIA.","Funcionamiento","Bogotá Mejor para Todos","No aplica","No Aplica","No Aplica","No Aplica","800007813","VANTI S.A. ESP",126670,null,null,null,null,126670,126670,"2020-03-17",null,null,null,null,null,null,null,null,null,null,null,null,null,{"$f":"IF(ISERROR(W483/V483),\"-\",(W483/V483))","v":1},{"$f":"IF(SUMPRODUCT((A$14:A483=A483)*(B$14:B483=B483)*(D$14:D483=D483))>1,0,1)","v":0}]
[3,"2020",null,"N/A","Otros gastos",null,"No aplica","V/R. DEL SERVICIO DE GAS NATURAL DE LAS DIFERENTES SEDES DONDE FUNCIONA LA ALCALDIA LOCAL DE LA CANDELARIA,","Funcionamiento","Bogotá Mejor para Todos","No aplica","No Aplica","No Aplica","No Aplica","800007813","VANTI S.A. ESP",15650,null,null,null,null,15650,15650,"2020-03-19",null,null,null,null,null,null,null,null,null,null,null,null,null,1,{"$f":"IF(SUMPRODUCT((A$14:A484=A484)*(B$14:B484=B484)*(D$14:D484=D484))>1,0,1)","v":0}]
[4,"2020",null,"N/A","Otros gastos",null,"No aplica","V/R. DEL SERVICIO DEGAS NATURAL DE LS DIFERENTES SEDES DONDE FUNCIONA LA ALCALDIA LOCAL DE LA CANDELARIA, SEGUN CAUSACIÓN CONTABLE Y FACTURA ANEXA.","Funcionamiento","Bogotá Mejor para Todos","No aplica","No Aplica","No Aplica","No Aplica","800007813","VANTI S.A. ESP",31260,null,null,null,null,31260,31260,"2020-04-30",null,null,null,null,null,null,null,null,null,null,null,null,null,1,{"$f":"IF(SUMPRODUCT((A$14:A485=A485)*(B$14:B485=B485)*(D$14:D485=D485))>1,0,1)","v":0}]
[6,"2020",null,"N/A","Otros gastos",null,"No aplica","V/R. DEL SERVICIO DE GAS NATURAL DE LAS DIFERENTES SEDES DONDE FUNCIONA LA ALCALDÍA LOCAL DE LA CANDELARIA, SEGUN CAUSACIÓN CONTABLE Y FACTURAS ANEXAS.","Funcionamiento","Bogotá Mejor para Todos","No aplica","No Aplica","No Aplica","No Aplica","800007813","VANTI S.A. ESP",47070,null,null,null,null,47070,47070,"2020-06-18",null,null,null,null,null,null,null,null,null,null,null,null,null,1,{"$f":"IF(SUMPRODUCT((A$14:A486=A486)*(B$14:B486=B486)*(D$14:D486=D486))>1,0,1)","v":0}]
[6,"2020",null,"N/A","Otros gastos",null,"No aplica","V/R. DEL SERVICIO DE GAS NATURAL DE LAS DIFERENTES SEDES DONDE FUNCIONA LA ALCALDIA LOCAL DE LA CANDELARIA, SEGUN CAUSACIÓN CONTABLE Y FACTURAS ANEXAS.","Funcionamiento","Bogotá Mejor para Todos","No aplica","No Aplica","No Aplica","No Aplica","800007813","VANTI S.A. ESP",58250,null,null,null,null,58250,58250,"2020-06-24",null,null,null,null,null,null,null,null,null,null,null,null,null,1,{"$f":"IF(SUMPRODUCT((A$14:A487=A487)*(B$14:B487=B487)*(D$14:D487=D487))>1,0,1)","v":0}]
[40658,"2020",null,"N/A","Otros gastos",null,"No aplica","PAGAR EL SERVICIO DE GAS NATURAL DE LAS ENTIDADES ADSCRITAS LA FDL LA CANDELARIA","Funcionamiento","Bogotá Mejor para Todos","No aplica","No Aplica","No Aplica","No Aplica","800007813","VANTI S.A. ESP",35140,null,null,null,null,35140,35140,"2020-07-25",null,null,null,null,null,null,null,null,null,null,null,null,null,1,{"$f":"IF(SUMPRODUCT((A$14:A488=A488)*(B$14:B488=B488)*(D$14:D488=D488))>1,0,1)","v":1}]
[796976,"2020",null,"N/A","Otros gastos",null,"No aplica","PAGAR LAS FACTURAS DEL SERVICIO DE GAS NATURAL CORRESPONDIENTES AL PERIODO DE JULIO A AGOSTO DE 2020, DE LOS ENTES ADSCRITOS A LA ALCALDÍA LOCAL LA CANDELARIA","Funcionamiento","Bogotá Mejor para Todos","No aplica","No Aplica","No Aplica","No Aplica","800007813","VANTI S.A. ESP",43540,null,null,null,null,43540,43540,"2020-08-21",null,null,null,null,null,null,null,null,null,null,null,null,null,1,{"$f":"IF(SUMPRODUCT((A$14:A489=A489)*(B$14:B489=B489)*(D$14:D489=D489))>1,0,1)","v":1}]
[1425842977,"2020",null,"N/A","Otros gastos",null,"No aplica","PAGAR FACTURA DE SERVICIO PUBLICO GAS NATURAL DE  INMUEBLES DEL FONDO DE DESARROLLO LOCAL CANDELARIA.DEL 10 DE JULIO AL 12 DE AGOSTO DE 2020","Funcionamiento","Bogotá Mejor para Todos","No aplica","No Aplica","No Aplica","No Aplica","800007813","VANTI S.A. ESP",24650,null,null,null,null,24650,24650,"2020-09-08",null,null,null,null,null,null,null,null,null,null,null,null,null,1,{"$f":"IF(SUMPRODUCT((A$14:A490=A490)*(B$14:B490=B490)*(D$14:D490=D490))>1,0,1)","v":1}]
[653308,"2020",null,"N/A","Otros gastos",null,"No aplica","PAGAR LAS FACTURAS Nos. E 205653308 y E 205681158 DEL SERVICIO DE GAS NATURAL, DEL PERIODO COMPRENDIDO DEL 12 DE AGOSTO AL 10 DE SEPTIEMBRE DE 2020, DE LOS ENTES ADSCRITOS AL FONDO DE DESARROLLO LOCAL LA CANDELARIA.","Funcionamiento","Bogotá Mejor para Todos","No aplica","No Aplica","No Aplica","No Aplica","800007813","VANTI S.A. ESP",24720,null,null,null,null,24720,24720,"2020-09-24",null,null,null,null,null,null,null,null,null,null,null,null,null,1,{"$f":"IF(SUMPRODUCT((A$14:A491=A491)*(B$14:B491=B491)*(D$14:D491=D491))>1,0,1)","v":1}]
[103,2019,"SECOP II","FDLC-IMC-015-2019","Otros gastos",null,"No aplica","ADQUIRIR A TODO COSTO EL SERVICIO DE MANTENIMIENTO PREVENTIVO Y CORRECTIVO INTEGRAL CON SUMINISTRO DE REPUESTOS Y DE MANO DE OBRA PARA LOS VEHÍCULOS QUE CONFORMAN EL PARQUE AUTOMOTOR  DEL FDLC. REEMPLAZA EL RP No. 454 DEL 2019 POR CONSTITUIRSE COMO OBLIGACION POR PAGAR","Funcionamiento","Bogotá Mejor para Todos","No aplica","No Aplica","No Aplica","No Aplica",800250589,"CENTRO CAR 19 LIMITADA",null,null,null,null,19995667,19995667,19995667,"2019-10-17","2019-10-22","2020-06-21",360,null,null,null,null,null,null,null,null,null,"X",1,{"$f":"IF(SUMPRODUCT((A$14:A492=A492)*(B$14:B492=B492)*(D$14:D492=D492))>1,0,1)","v":1}]
[107,"2019","SECOP I","ORDEN DE COMPRA 43256","Otros gastos",null,"No aplica","Prestar el servicio de revisión, inspección, mantenimiento y recarga de extintores de la alcaldía local de La Candelaria.REEMPLAZA EL RP No. 490 DEL 2019 POR CONSTITUIRSE COMO OBLIGACION POR PAGAR","Funcionamiento","Bogotá Mejor para Todos","No aplica","No Aplica","No Aplica","No Aplica","860051688-5 ","PRODUCTOS DE SEGURIDAD S.A. - PRODESEG S.A.",null,null,null,null,2225160,2225160,2225160,"2019-12-03","2019-12-04","2020-02-03",137,null,null,null,null,null,null,null,null,null,"X",1,{"$f":"IF(SUMPRODUCT((A$14:A493=A493)*(B$14:B493=B493)*(D$14:D493=D493))>1,0,1)","v":1}]
[76,2019,"SECOP I","ORDEN DE COMPRA 35780","Otros gastos",null,"Acuerdo marco de precios ","Obligaciones por Pagar Vigencia Anterior","Funcionamiento","Bogotá Mejor para Todos","No aplica","No Aplica","No Aplica","No Aplica","900459737-5","GRUPO EDS AUTOGAS S.A.S",null,null,null,null,1925643,1925643,1925643,"2019-02-18","2019-03-01","2020-02-29",330,null,null,null,null,null,null,null,null,null,"X",1,{"$f":"IF(SUMPRODUCT((A$14:A494=A494)*(B$14:B494=B494)*(D$14:D494=D494))>1,0,1)","v":1}]
[80,2019,"SECOP II","FDLC-IMC-003-2019","Seguros","Contratación mínima cuantia","No aplica","Obligaciones por Pagar Vigencia Anterior","Funcionamiento","Bogotá Mejor para Todos","No aplica","No Aplica","No Aplica","No Aplica",8605246546,"Aseguradora Solidaria de Colombia Entidad Cooperativa",null,null,null,1,1094750,{"$f":"+Q495+S495+U495","v":1094750},1094750,"2019-03-07","2019-03-07","2019-12-20",280,1,15,null,null,null,null,null,null,null,"X",1,{"$f":"IF(SUMPRODUCT((A$14:A495=A495)*(B$14:B495=B495)*(D$14:D495=D495))>1,0,1)","v":1}]
[81,2019,"SECOP I","orden de compra 36399","Otros gastos",null,"Acuerdo marco de precios ","Obligaciones por Pagar Vigencia Anterior","Funcionamiento","Bogotá Mejor para Todos","No aplica","No Aplica","No Aplica","No Aplica","901351411-8","Union Temporal ECOLIMPIEZA",null,null,null,null,57438250,57438250,57438250,"2020-03-25","2020-04-06","2021-03-05",360,null,null,null,null,null,null,null,null,"X",null,1,{"$f":"IF(SUMPRODUCT((A$14:A496=A496)*(B$14:B496=B496)*(D$14:D496=D496))>1,0,1)","v":1}]
[82,2019,"SECOP II","FDLC-LP-002-2019 ","Contratos de prestación de servicios","Licitación pública","No aplica","Obligaciones por Pagar Vigencia Anterior","Funcionamiento","Bogotá Mejor para Todos","No aplica","No Aplica","No Aplica","No Aplica",860517560,"EMPRESA DE SEGURIDAD Y VIGILANCIA SERVICONFOR LIMITADA",null,null,null,1,427734216,427734216,427732190,"2019-03-20","2019-03-21","2020-05-06",60,1,51,null,null,null,null,null,null,null,"X",0.99999526341376443,{"$f":"IF(SUMPRODUCT((A$14:A497=A497)*(B$14:B497=B497)*(D$14:D497=D497))>1,0,1)","v":1}]
[96,2017,"SECOP I","CIN-096-2017","Otros gastos",null,"No aplica","Obligaciones por Pagar Vigencia Anterior","Funcionamiento","Bogotá Mejor para Todos","No aplica","No Aplica","No Aplica","No Aplica","900062917-9","Servicios Postales Nacionales s.a",null,null,null,null,null,24700,24700,"2017-11-02","2017-11-16","2019-11-15",360,null,null,null,null,null,null,null,null,null,"X",1,{"$f":"IF(SUMPRODUCT((A$14:A498=A498)*(B$14:B498=B498)*(D$14:D498=D498))>1,0,1)","v":1}]
[106,2019,"SECOP I","ORDEN DE COMPRA 42070","Otros gastos",null,"Acuerdo marco de precios ","Obligaciones por Pagar Vigencia Anterior","Funcionamiento","Bogotá Mejor para Todos","No aplica","No Aplica","No Aplica","No Aplica",811021363,"UNIPLES S.A",null,null,null,null,18754400,18754400,18754400,"2019-11-05","2019-11-05","2020-01-06",60,null,null,null,null,null,null,null,null,null,"X",1,{"$f":"IF(SUMPRODUCT((A$14:A499=A499)*(B$14:B499=B499)*(D$14:D499=D499))>1,0,1)","v":1}]
[181,2020,null,null,"Otros gastos",null,null,"RECURSOS POR LIBERAR NO SE SUSCRIBIO EL CONTRATO","Inversión","Bogotá Mejor para Todos",19,{"$f":"IF(ISERROR(VLOOKUP(K500,Eje_Pilar_Prop!$C$2:$E$104,2,FALSE)),\" \",VLOOKUP(K500,Eje_Pilar_Prop!$C$2:$E$104,2,FALSE))","v":"Seguridad y convivencia para todos"},{"$f":"IF(ISERROR(VLOOKUP(K500,Eje_Pilar_Prop!$C$2:$E$104,3,FALSE)),\" \",VLOOKUP(K500,Eje_Pilar_Prop!$C$2:$E$104,3,FALSE))","v":"Pilar 3 Construcción de Comunidad y Cultura Ciudadana"},1392,null,"YESID EDUARDO FORERO SANABRIA",4000000,null,null,null,null,{"$f":"+Q500+S500+U500","v":4000000}]
[107,2019,"SECOP I","ORDEN DE COMPRA 43256","Otros gastos",null,"Acuerdo marco de precios ","Obligaciones por Pagar Vigencia Anterior","Funcionamiento","Bogotá Mejor para Todos","No aplica","No Aplica","No Aplica","No Aplica","860051688-5 ","PRODUCTOS DE SEGURIDAD S.A. PRODESEG",null,null,null,null,1968855,1968855,null,"2019-12-03","2019-12-04","2020-02-03",60,null,null,null,null,null,null,null,null,"X",null,0,{"$f":"IF(SUMPRODUCT((A$14:A501=A501)*(B$14:B501=B501)*(D$14:D501=D501))>1,0,1)","v":1}]

{"sheet":"INVERSION","index":1,"n_rows":66,"n_cols":14,"rows_kept":66,"cut":false,"hidden":false,"merged":[]}
["INVERSION"]
[]
["MODALIDAD VIGENCIA 2020",null,"SUMA TOTAL CONTRATOS VIGENCIA ",null,null,null,null,null,"TIPO  VIGENCIA 2020",null,"SUMA TOTAL CONTRATOS VIGENCIA Y SUMA ADICIONES A CONTRATOS AÑOS ANTERIORES"]
[]
["Año",2020,"Seleccionar Año 2020"]
["Afectación","Inversión",null,null,null,null,null,null,"Año",2020,"Seleccionar año 2020"]
["Tipo de contrato ","(Varios elementos)",null,null,null,null,null,null,"Afectación","Inversión"]
[]
[null,null,null,"Valores",null,null,null,null,null,null,null,"Valores"]
["Modalidad de Selección","Equivalencia número de programa","Eje / Pilar / Propósito","Suma de Total Contratos","Suma de Valor Final ","Suma de Giros (Valor en pesos)",null,null,"Tipo de contrato ","Equivalencia número de programa","Eje / Pilar / Propósito","Suma de Total Contratos","Suma de Valor Final ","Suma de Giros (Valor en pesos)"]
["Concurso de méritos","Mejor movilidad para todos","Pilar 2 Democracía Urbana",1,504558537,138468821,null,null,"Contratos de prestación de servicios","Gobernanza e influencia local, regional e internacional","Eje Transversal 4 Gobierno Legitimo, Fortalecimiento Local y Eficiencia",2,1023285664,345688163]
["Contratación directa","Gobernanza e influencia local, regional e internacional","Eje Transversal 4 Gobierno Legitimo, Fortalecimiento Local y Eficiencia",245,4107138445,2897337330,null,null,null,"Igualdad y autonomía para una Bogotá incluyente","Pilar 1 Igualdad de Calidad de Vida",2,248240000,171216000]
[null,"Igualdad y autonomía para una Bogotá incluyente","Pilar 1 Igualdad de Calidad de Vida",6,311675011,219809702,null,null,"Contratos de prestación de servicios profesionales y de apoyo a la gestión","Gobernanza e influencia local, regional e internacional","Eje Transversal 4 Gobierno Legitimo, Fortalecimiento Local y Eficiencia",240,2469971388,2008170906]
[null,"Seguridad y convivencia para todos","Pilar 3 Construcción de Comunidad y Cultura Ciudadana",20,263299633,156458150,null,null,null,"Igualdad y autonomía para una Bogotá incluyente","Pilar 1 Igualdad de Calidad de Vida",4,63435011,48593702]
[null,"Mejor movilidad para todos","Pilar 2 Democracía Urbana",6,77915160,67185811,null,null,null,"Seguridad y convivencia para todos","Pilar 3 Construcción de Comunidad y Cultura Ciudadana",19,101683334,75650000]
[null,"Mejores oportunidades para el desarrollo a través de la cultura, la recreación y el deporte","Pilar 1 Igualdad de Calidad de Vida",2,23189000,15334233,null,null,null,"Mejor movilidad para todos","Pilar 2 Democracía Urbana",6,77915160,67185811]
[null,"Recuperación y manejo de la Estructura Ecológica Principal","Eje Transversal 3 Sostenibilidad Ambiental basada en la eficiencia energética",2,208051096,21922775,null,null,null,"Mejores oportunidades para el desarrollo a través de la cultura, la recreación y el deporte","Pilar 1 Igualdad de Calidad de Vida",2,23189000,15334233]
["Contratación mínima cuantia","Gobernanza e influencia local, regional e internacional","Eje Transversal 4 Gobierno Legitimo, Fortalecimiento Local y Eficiencia",5,46334075,23934500,null,null,null,"Recuperación y manejo de la Estructura Ecológica Principal","Eje Transversal 3 Sostenibilidad Ambiental basada en la eficiencia energética",1,36000000,21922775]
[null,"Mejor movilidad para todos","Pilar 2 Democracía Urbana",1,24184587,12092293,null,null,"Contratos interadministrativos","Gobernanza e influencia local, regional e internacional","Eje Transversal 4 Gobierno Legitimo, Fortalecimiento Local y Eficiencia",3,613881393,543478261]
["Total general",null,null,288,5566345544,3552543615,null,null,null,"Seguridad y convivencia para todos","Pilar 3 Construcción de Comunidad y Cultura Ciudadana",1,161616299,80808150]
[null,null,null,null,null,null,null,null,null,"Recuperación y manejo de la Estructura Ecológica Principal","Eje Transversal 3 Sostenibilidad Ambiental basada en la eficiencia energética",1,172051096,0]
[null,null,null,null,null,null,null,null,"Interventoría","Mejor movilidad para todos","Pilar 2 Democracía Urbana",2,528743124,150561114]
[null,null,null,null,null,null,null,null,"Suministro","Gobernanza e influencia local, regional e internacional","Eje Transversal 4 Gobierno Legitimo, Fortalecimiento Local y Eficiencia",5,46334075,23934500]
[null,null,null,null,null,null,null,null,"Total general",null,null,288,5566345544,3552543615]
[]
[]
[]
[]
[]
[]
[]
[]
[]
[]
[]
[]
[]
[]
[]
[]
[]
[]
[]
[]
[]
[]
[]
["MODALIDAD AÑOS ANTERIORES",null,"SUMA ADICIONES A CONTRATOS AÑOS ANTERIORES",null,null,null,null,null,"TIPO  AÑOS ANTERIORES",null,"SUMA ADICIONES A CONTRATOS AÑOS ANTERIORES"]
[]
[]
["Año","(Varios elementos)","Seleccionar Años diferentes 2020",null,null,null,null,null,"Año","(Varios elementos)","Seleccionar años diferentes 2020"]
["Afectación","Inversión",null,null,null,null,null,null,"Afectación","Inversión"]
["Tipo de contrato ","(Varios elementos)"]
[null,null,null,null,null,null,null,null,null,null,null,"Valores"]
[null,null,null,"Valores",null,null,null,null,"Tipo de contrato ","Equivalencia número de programa","Eje / Pilar / Propósito","Suma de Número de adiciones","Suma de Valor Final ","Suma de Giros (Valor en pesos)"]
["Modalidad de Selección","Equivalencia número de programa","Eje / Pilar / Propósito","Suma de Número de adiciones","Suma de Valor Final ","Suma de Giros (Valor en pesos)",null,null,"Contratos de prestación de servicios profesionales y de apoyo a la gestión","Gobernanza e influencia local, regional e internacional","Eje Transversal 4 Gobierno Legitimo, Fortalecimiento Local y Eficiencia",33,78159669,89123247]
["Concurso de méritos","Mejor movilidad para todos","Pilar 2 Democracía Urbana",4,132330755,0,null,null,null,"Igualdad y autonomía para una Bogotá incluyente","Pilar 1 Igualdad de Calidad de Vida",2,16984433,7715279]
[null,"Consolidar el turismo como factor de desarrollo, confianza y felicidad para Bogotá Región","Eje Transversal 2 Desarrollo Económico basado en el conocimiento",2,85651379,66799172,null,null,null,"Mejor movilidad para todos","Pilar 2 Democracía Urbana",2,15640000,15639999]
["Contratación directa","Gobernanza e influencia local, regional e internacional","Eje Transversal 4 Gobierno Legitimo, Fortalecimiento Local y Eficiencia",33,78159669,89123247,null,null,null,"Mejores oportunidades para el desarrollo a través de la cultura, la recreación y el deporte","Pilar 1 Igualdad de Calidad de Vida",2,7825266,7825266]
[null,"Igualdad y autonomía para una Bogotá incluyente","Pilar 1 Igualdad de Calidad de Vida",2,16984433,7715279,null,null,null,"Recuperación y manejo de la Estructura Ecológica Principal","Eje Transversal 3 Sostenibilidad Ambiental basada en la eficiencia energética",5,19248768,19078357]
[null,"Mejor movilidad para todos","Pilar 2 Democracía Urbana",2,15640000,15639999,null,null,"Interventoría","Mejor movilidad para todos","Pilar 2 Democracía Urbana",4,132330755,0]
[null,"Mejores oportunidades para el desarrollo a través de la cultura, la recreación y el deporte","Pilar 1 Igualdad de Calidad de Vida",2,7825266,7825266,null,null,null,"Consolidar el turismo como factor de desarrollo, confianza y felicidad para Bogotá Región","Eje Transversal 2 Desarrollo Económico basado en el conocimiento",1,52852272,34000065]
[null,"Recuperación y manejo de la Estructura Ecológica Principal","Eje Transversal 3 Sostenibilidad Ambiental basada en la eficiencia energética",5,19248768,19078357,null,null,"Obra pública","Mejor movilidad para todos","Pilar 2 Democracía Urbana",17,2895182593,135855509]
["Licitación pública","Mejor movilidad para todos","Pilar 2 Democracía Urbana",17,2895182593,135855509,null,null,null,"Consolidar el turismo como factor de desarrollo, confianza y felicidad para Bogotá Región","Eje Transversal 2 Desarrollo Económico basado en el conocimiento",5,730393816,534615863]
[null,"Consolidar el turismo como factor de desarrollo, confianza y felicidad para Bogotá Región","Eje Transversal 2 Desarrollo Económico basado en el conocimiento",4,697594709,501816756,null,null,"Total general",null,null,71,3948617572,843853585]
["Total general",null,null,71,3948617572,843853585]

{"sheet":"FUNCIONAMIENTO","index":2,"n_rows":40,"n_cols":10,"rows_kept":40,"cut":false,"hidden":false,"merged":[]}
["FUNCIONAMIENTO"]
[]
["MODALIDAD VIGENCIA 2020",null,"SUMA TOTAL CONTRATOS VIGENCIA ",null,null,null,"TIPO VIGENCIA 2020","SUMA TOTAL CONTRATOS VIGENCIA"]
[]
["Año",2020,"Seleccionar año 2020"]
["Afectación","Funcionamiento",null,null,null,null,"Año",2020,"Seleccionar año 2020"]
["Tipo de contrato ","(Varios elementos)",null,null,null,null,"Afectación","Funcionamiento"]
[]
[null,"Valores",null,null,null,null,null,"Valores"]
["Modalidad de Selección","Suma de Total Contratos","Suma de Valor Final ","Suma de Giros (Valor en pesos)",null,null,"Tipo de contrato ","Suma de Total Contratos","Suma de Valor Final ","Suma de Giros (Valor en pesos)"]
["Concurso de méritos",1,0,0,null,null,"Compraventa de bienes muebles",2,27735588,6936748]
["Contratación directa",1,8000000,null,null,null,"Contratos de prestación de servicios",5,637071709,420384599]
["Contratación mínima cuantia",14,210614693,148845706,null,null,"Contratos interadministrativos",1,8000000]
["Licitación pública",2,566748600,350061490,null,null,"Seguros",5,72642246,71585849]
["Selección abreviada",2,217908451,146045880,null,null,"Suministro",6,257822201,146045880]
["Total general",20,1003271744,644953076,null,null,"Consultoría",1,0,0]
[null,null,null,null,null,null,"Total general",20,1003271744,644953076]
[]
[]
[]
[]
[]
[]
[]
[]
[]
[]
[]
[]
["MODALIDAD AÑOS ANTERIORES",null,"SUMA ADICIONES A CONTRATOS AÑOS ANTERIORES",null,null,null,"TIPO AÑOS ANTERIORES",null,"SUMA ADICIONES A CONTRATOS AÑOS ANTERIORES"]
[]
["Año","(Varios elementos)","Seleccionar Años diferentes 2020"]
["Afectación","Funcionamiento",null,null,null,null,"Año","(Varios elementos)","Seleccionar Años diferentes 2020"]
["Tipo de contrato ","(Varios elementos)",null,null,null,null,"Afectación","Funcionamiento"]
[]
[null,"Valores",null,null,null,null,null,"Valores"]
["Modalidad de Selección","Suma de Número de adiciones","Suma de Valor Final ","Suma de Giros (Valor en pesos)",null,null,"Tipo de contrato ","Suma de Número de adiciones","Suma de Valor Final ","Suma de Giros (Valor en pesos)"]
["Contratación mínima cuantia",1,1094750,1094750,null,null,"Contratos de prestación de servicios",1,427734216,427732190]
["Licitación pública",1,427734216,427732190,null,null,"Seguros",1,1094750,1094750]
["Total general",2,428828966,428826940,null,null,"Total general",2,428828966,428826940]

{"sheet":"Ctos suscrito x Trimestre","index":3,"n_rows":13,"n_cols":5,"rows_kept":13,"cut":false,"hidden":false,"merged":[[1,4,3,11],[4,4,4,6]]}
[]
[null,"Contratos Suscritos en la vigencia 2020  (Inversion)",null,null,"Se toman solo los contratos de la vigencia por cuanto en las adiciones años anteriores algunas Entidades registraron la fecha en que se suscribio el contrato y no la adición."]
[null,"Afectación","Inversión"]
[null,"Tipo de contrato ","(Varios elementos)","No incluir \"otros gastos\""]
[null,"Año",2020]
[]
[]
[null,"Fecha de suscripción (DD/MM/AAAA)"]
[null,"Trim.1"]
[null,"Trim.2"]
[null,"Trim.3"]
[null,"Trim.4"]
[null,"Total general"]

{"sheet":"Instructivo","index":4,"n_rows":103,"n_cols":4,"rows_kept":103,"cut":false,"hidden":false,"merged":[[25,1,25,3],[1,1,1,3],[2,1,2,3],[3,1,3,3],[4,1,4,3],[5,1,5,3],[6,1,6,3],[7,1,7,3],[10,1,10,3],[11,1,11,3],[12,1,12,3],[14,1,14,3],[8,1,8,3],[9,1,9,3],[67,1,67,3],[26,1,27,1],[26,2,27,2],[31,1,32,1],[31,2,32,2],[33,1,53,1],[35,2,36,2],[54,1,56,1],[54,2,56,2],[59,1,62,1],[61,2,62,2],[64,1,65,1],[29,1,30,1],[68,1,70,1],[68,2,70,2],[71,1,72,1],[71,2,72,2],[74,1,75,1],[74,2,75,2],[101,1,101,3],[77,1,80,1],[77,2,80,2],[83,1,83,3],[84,1,85,1],[84,2,85,2],[98,1,98,3],[92,1,92,3]]}
[]
[null,"INSTRUCTIVO"]
[null,"Recomendamos leer cuidadosamente y poner en práctica las instrucciones que se explican en este instructivo. De la calidad de la información que se registre, depende en gran medida la calidad del informe de rendición de cuentas de la Gestión Contractual que presenta el Alcalde Mayor, consolidado por la Veeduría Distrital."]
[null,"La base en Excel a diligenciar es inmodificable, debe utilizar versión Excel 2010 o posteriores, la versión 2007 no habilita los macros.  La base no permite que se incluyan columnas con otro tipo de información que la Veeduría Distrital no está solicitando o que se cambie el formato de celda establecido. Tenga en cuenta que algunas celdas están bloqueadas y/o solo permiten el registro de una información determinada."]
[null,"La información que se registre en la base, debe coincidir con los reportes realizados en PREDIS y en el SECOP"]
[null,"Diligencie la totalidad de celdas."]
[null,"Para insertar una o varias filas, haga click  en el opción Insertar Filas y digite el número de filas a insertar. Si usted no sigue este procedimiento las filas que inserte no tomaran el formato de las filas anteriores. Se recomienda que antes de iniciar el registro de información inserte las filas que requiere, sin embargo en cualquier momento que necesite puede hacer este paso."]
[null,"Si requiere inserte una o varias filas realícelo después de la fila A14 y antes de la fila de Totales para que tomen el formato de las filas anteriores."]
[null,"Si necesita pegar información debe hacerlo por secciones debido a que hay columnas formuladas que están protegidas (como la columna J, K, T y AK) que no permiten realizar esta opción. Utilice la opción de pegado especial valores para no borrar las listas desplegables ni los formatos de las columnas."]
[null,"Si al pegar quedan textos en rojo,  verifique y ajuste la información, el dato que adiciono no se encuentra en la lista desplegable o no corresponde con el criterio definido en el columna."]
[null,"En primer lugar diligencie toda la información correspondiente a los contratos suscritos con cargo a la vigencia 2020."]
[null,"Una vez incluidos todos los contratos de la vigencia 2020, a continuación diligencie el formato completo con la información correspondiente a las adiciones efectuadas con cargo a la vigencia 2020 de contratos suscritos en vigencias anteriores. La información general del contrato como: modalidad de selección, tipología contractual, objeto, entre otros, debe corresponder a la información del contrato adicionado o modificado. Respecto al valor solo se diligencia el valor en la columna adición, es decir la columna de valor inicial debe quedar en blanco. No olvide registrar el número de adiciones realizadas, en la columna correspondiente."]
[null,"En caso de haber realizado apropiaciones presupuestales en la vigencia a través de resoluciones, caja menor, honorarios ediles, servicios públicos, debe relacionar dicha información en una sola fila al final de la base, indicando de que se trata la apropiación y número de proyecto si hay lugar a ello. En el tipo de contrato se registra Otros gastos."]
[]
[null,"ENCABEZADO DEL FORMATO"]
[null,1,"Entidad","Indique el nombre completo de la Entidad."]
[null,2,"Sector","Seleccione el sector al cual pertenece la Entidad."]
[null,3,"Presupuesto Disponible Inversión Directa","Indique el valor total del presupuesto disponible de inversión directa, de acuerdo con el PREDIS, a 31 de diciembre de 2020."]
[null,4,"Presupuesto Comprometido de Inversión Directa ","Escriba el valor total del presupuesto comprometido de inversión directa, de acuerdo con el PREDIS a 31 de diciembre de 2020."]
[null,5,"Presupuesto Disponible Funcionamiento","Indique el valor total del presupuesto de funcionamiento disponible, de acuerdo con el PREDIS a 31 de diciembre de 2020."]
[null,6,"Presupuesto Comprometido funcionamiento ","Escriba el monto del presupuesto de funcionamiento, comprometido mediante contratos, de acuerdo con el PREDIS a 31 de diciembre de 2020."]
[null,7,"Presupuesto Disponible Operación","Coloque el monto del presupuesto de operación disponible, de acuerdo con el PREDIS, a 31 de diciembre de 2020. Los gastos de operación corresponden solamente a aquellas entidades de régimen de contratación  privado."]
[null,8,"Presupuesto Comprometido operación mediante contratos","Escriba el monto del presupuesto de operación comprometido mediante contratos a 31 de diciembre de 2020."]
[null,9,"Nombre de quien diligencia el formato:","Indique el nombre completo, cargo, número de teléfono con extensión y correo electrónico del profesional que diligencia el formato y que posteriormente realizará los ajustes y aclaraciones a que haya lugar por solicitud de la Veeduría Distrital."]
[]
[null,"1- INFORMACIÓN GENERAL"]
[null,1,"Número de Contrato","En estricto orden consecutivo registre el número del contrato, sin incluir los contratos que fueron anulados ni comodatos."]
[null,null,null,"Una vez terminado el registro de los contratos con cargo a la vigencia 2020, en las siguientes filas registre la información correspondiente a las adiciones efectuadas con cargo a la vigencia 2020 de contratos suscritos en vigencias anteriores, especificando el año de suscripción en la columna dos."]
[null,2,"Año","Registre el año de celebración del contrato."]
[null,3,"Proceso Publicado","Seleccione el aplicativo donde se publicó el proceso (SECOP I / SECOP II)"]
[null,null,"Número de proceso en el SECOP","Relacione el número de proceso con el cual se encuentra publicado el contrato en el SECOP. Ejemplo IDU-CMA-DTDP-240-2020"]
[null,4,"Tipo de Contrato","En esta columna seleccione de la lista el tipo de contrato que corresponde al contrato suscrito. El formato no permite incluir tipo de contratos diferentes a los señaladas en la lista desplegable.  "]
[null,null,null,"Para las adiciones a contratos de años anteriores se debe diligenciar el tipo del contrato adicionado o modificado."]
[null,4,"Obra ","Son contratos de obra los que celebren las entidades estatales para la construcción, mantenimiento, instalación y, en general, para la realización de cualquier otro trabajo material sobre bienes inmuebles, cualquiera que sea la modalidad de ejecución y pago. Numeral 1 del Artículo 32 de la Ley 80 de 1993. "]
[null,null,"Consultoría","Aquellos que celebran las entidades estatales, referidos a los estudios necesarios para la ejecución de proyectos de inversión, de diagnósticos, prefactibilidad o factibilidad para programas o proyectos específicos, así como a las asesorías técnicas de coordinación, control y supervisión. Numeral 2 del Artículo 32 de la Ley 80 de 1993. "]
[null,null,"Interventoría","Son también  contratos de consultoría los que tienen por objeto la Interventoría, asesoría, gerencia de obras o de proyectos, dirección, programación y la ejecución de diseños, planos, anteproyectos y proyectos. Numeral 2 del Artículo 32 de la Ley 80 de 1993."]
[null,null,null,"El contrato de Interventoría tiene por objeto la  supervisión, seguimiento y vigilancia a la ejecución material de un contrato principal."]
[null,null,"Contrato de Prestación de servicios","Son contratos de prestación de servicios los que celebren las entidades estatales para desarrollar actividades relacionadas con la administración o funcionamiento de la entidad. Numeral 3 del Artículo 32 de la Ley 80 de 1993."]
[null,null,"Contrato de Prestación de servicios profesionales y de apoyo a la gestión","Corresponden a aquellos de naturaleza intelectual diferentes a los de consultoría que se derivan del cumplimiento de las funciones de la entidad estatal; así como los relacionados con actividades operativas, logísticas, o asistenciales. Art. 2.2.1.2.1.4.9, Decreto 1082 de 2015"]
[null,null,"Compraventa de bienes muebles","Son aquellos contratos donde se transfiere el dominio de un bien mueble (aquellos susceptibles de ser trasladadas de un lugar a otro sin alterar ni su forma ni su esencia, tal es el caso del mobiliario y equipo de oficina, maquinaria, automóviles, etc.), cuya ejecución se agota de manera instantánea. Artículo 660, Código Civil."]
[null,null,"Compraventa de bienes inmuebles","Son aquellos contratos donde se transfiere el dominio de un bien inmueble (todos aquellos bienes considerados bienes raíces, por tener de común la circunstancia de estar íntimamente ligados al suelo, unidos de modo inseparable, física o jurídicamente, al terreno). Artículo 656, Código Civil."]
[null,null,"Arrendamiento de bienes muebles","Es un contrato que tiene por objeto, conceder el uso y goce de un bien mueble a cambio de un precio determinado.  Artículo 1974 Código Civil."]
[null,null,"Arrendamiento de bienes inmuebles","Es un contrato que tiene por objeto, conceder el uso y goce de un bien inmueble a cambio de un precio determinado.  Artículo 2.2.1.2.1.4.11 Decreto 1082 de 2015"]
[null,null,"Seguros","El seguro es un contrato, en virtud del cual una persona jurídica llamada asegurador, asume, a cambio de una prima, un riesgo que le es trasladado por una persona natural o jurídica llamado tomador y en el cual éste tiene un interés asegurable, con el fin de indemnizarlo, en el evento de que ocurra la realización del riesgo amparado. de conformidad con el Título V, del Libro Cuarto del Código de Comercio "]
[null,null,"Suministro","El suministro es el contrato por el cual una parte se obliga, a cambio de una contraprestación, a cumplir en favor de otra, en forma independiente, prestaciones periódicas o continuadas de cosas o servicios. Artículo 968, Código de Comercio"]
[null,null,"Empréstitos","Son contratos de empréstito los que tienen por objeto proveer a la entidad estatal contratante de recursos en moneda nacional o extranjera con plazo para su pago. Artículo 7,  Decreto 2681 de 1996. "]
[null,null,"Fiducia mercantil o encargo fiduciario","Son contratos que tienen por objeto la administración o el manejo de los recursos vinculados a los contratos que tales entidades celebren. Numeral 5 de Articulo 32 de la Ley 80 de 1993."]
[null,null,"Concesión","Este contrato tiene por objeto otorgar a una persona llamada CONCESIONARIO  la prestación, operación, explotación, organización o gestión, total o parcial, de un servicio público, o la construcción, explotación o conservación total o parcial, de una obra o bien destinados al servicio o uso público, así como todas aquellas actividades necesarias para la adecuada prestación o funcionamiento de la obra o servicio por cuenta y riesgo del CONCESIONARIO, y bajo la vigilancia y control de la entidad concedente, a cambio de una remuneración que puede consistir en derechos, tarifas, tasas, valorización, o en la participación que se le otorgue en la explotación del bien, obra o servicio, o en una suma periódica, única o porcentual, y en general, en cualquier otra modalidad de contraprestación que las partes acuerden. Numeral 4 del Artículo 32 de la Ley 80 de 1993 "]
[null,null,"Convenios de cooperación","Son aquellos mediante los cuales se formaliza la asistencia, ayuda, auxilio, soporte o colaboración entre entidades de una misma nación, de distintos países o por parte de organizaciones internacionales de naturaleza pública o privada a favor de entidades públicas. Artículo 20 de la ley 1150"]
[null,null,"Convenios/Contratos interadministrativos","El convenio interadministrativo es el negocio jurídico en el cual están presentes dos entidades públicas en desarrollo de relaciones interadministrativas cuyo objeto es coordinar, cooperar, colaborar o distribuir competencias en la realización de funciones administrativas de interés común a los sujetos negóciales. Artículo 95 de la ley 489 de 1998."]
[null,null,"Convenios de Apoyo y/o Convenios de Asociación","Los contratos que en desarrollo de lo dispuesto en el segundo inciso del artículo 355 de la Constitución Política celebren la Nación, los Departamentos, Distritos y Municipios con entidades privadas sin ánimo de lucro y de reconocida idoneidad, con el propósito de impulsar programas y actividades de interés público.  Reglamentado mediante Decreto 92 de 2017"]
[null,null,"Asociaciones Público Privadas","Los contratos con personas naturales o jurídicas que se celebran en desarrollo de lo dispuesto en el Decreto 1508 de 2012."]
[null,null,"Otros","Los demás tipos de contratos que no se encuentren definidos en las anteriores tipologías."]
[null,null,"Otros gastos","Incluye los gastos no contractuales, estos se registran al final de la base, no cuentan con número de contrato, tipo, proceso o modalidad.  Estos gastos en los que no media un acuerdo de voluntades, en caso de ser del rubro de inversiòn, se deben discriminar por programa y proyecto. En el caso de ser del rubro de funcionamiento no requieren ser discriminados."]
[null,5,"Modalidad de Selección","Al ubicarse en la celda, se despliega una lista de modalidades de selección, de las cuales debe seleccionar la indicada. El formato no permite incluir modalidades diferentes a las señaladas en la lista desplegable.  "]
[null,null,null,"Para las adiciones a contratos de años anteriores se debe diligenciar la modalidad de selección del contrato adicionado o modificado"]
[null,null,null,"La modalidad régimen especial se refiere a todos los contratos realizados en cumplimiento del Decreto 092 de 2017, convenios de asociaciòn con ESAL. Regimen Privado es para todas aquellas entidades, que no se rigen por el Estatuto General de Contrataciòn, para el caso, en estas entidades todos sus contratos deben ser identificados con esta modalidad."]
[null,6,"Procedimiento o causal","Esta columna solo se habilita y debe ser diligenciada, para las modalidades de selección abreviada y contratación directa. Al ubicarse en la celda, se despliega una lista de procedimientos o causales, de las cuales debe seleccionar la indicada. El formato no permite incluir procedimientos o causales diferentes a las señaladas en la lista desplegable.  "]
[null,7,"Objeto","Registre el objeto del contrato."]
[null,8,"Afectación ","Registre la afectación según la clasificación de cuentas del presupuesto de gastos. Funcionamiento, Inversión y Operación, esta última aplica únicamente para entidades de régimen privado. La celda solamente permite registrar estas tres opciones."]
[null,null,"Planes de Desarrollo Distrital","Seleccionar el PDD de acuerdo con los diferentes contratos suscritos, automáticamente en la columna K se activan  los números de programa de acuerdo al PDD escogido."]
[null,null,"Número Programa","Si en la columna anterior “Afectación”,  indicó funcionamiento u operación deje en blanco el número de programa, es decir esta columna solamente aplica para gastos de Inversión."]
[null,null,null,"Identifíquelo de acuerdo con el código presupuestal de los Planes de Desarrollo \"Bogotá Mejor Para Todos\" o  \"Un Nuevo Contrato Social y Ambiental para la Bogotá del Siglo XXI\". Si un mismo contrato afecta más de un código presupuestal discrimine el contrato por cada código que afecte en filas separadas. Si se registra el número del programa, automáticamente en la columna L y M se despliega el nombre del programa y el eje, pilar o propósito según corresponda. "]
[null,9,"Número Proyecto","Indique el código presupuestal con el que se identifica el proyecto. Si un mismo contrato afecta más de un proyecto, discriminar el contrato por cada proyecto que afecte en filas separadas."]
[null,10,"Número de Identificación del contratista","Indicar el número de identificación del contratista persona natural o jurídica con quien se suscribió el contrato, con digito de verificación (DV), el formato de celda no permite guiones, comas, solo números. "]
[null,null,"Nombre del Contratista","Indicar el nombre del contratista, persona natural o jurídica."]
[]
[null,"2- INFORMACIÓN FINANCIERA"]
[null,11,"Valor Inicial ","Registre el valor inicial del contrato con cargo a la vigencia 2020, el formato de celda no permite guiones, comas o texto. Esta columna solo debe contener información numérica."]
[null,null,null,"En el caso de adiciones a contratos de años anteriores,  no diligencie esta columna, solamente la columna 15 \"Valor Total Adiciones\" "]
[null,null,null,"Excluya las reservas de apropiación y cuentas por pagar."]
[null,12,"Número de reducciones ","Diligencie esta columna solo en el caso de reducciones, reintegros, liberaciones, saldos a favor o cualquier factor que disminuya el valor de los contratos con cargo a la vigencia."]
[null,null,null,"Registre en esta celda la cantidad de reducciones que se realizaron al contrato."]
[null,13,"Valor total reducciones (En valor negativo)","Registre el valor total de las reducciones que se realizaron al contrato, el formato de celda no permite comas o texto. Esta columna solo debe contener información numérica."]
[null,14,"Número de adiciones ","Diligencie esta columna solo en el caso de adiciones al valor inicial que aumenten el valor del contrato con cargo a la vigencia."]
[null,null,null,"Registre en esta celda el número de adiciones que se realizaron al contrato."]
[null,15,"Valor total de adiciones","Registre el valor total de las adiciones que se realizaron al contrato,  el formato de celda no permite guiones, , comas o texto. Esta columna solo debe contener información numérica."]
[null,16,"Valor Final","Esta columna se encuentra formulada y bloqueada, sí el valor final no coincide, es porque están mal diligenciadas las columnas valor inicial, valor de reducciones y/o valor de adiciones. En tal caso se debe verificar dicha información."]
[null,null,null,"La sumatoria de la columna 16 (valor final) para los contratos de Inversión Directa, de funcionamiento y/o operación, cuando aplique, deberán coincidir con el valor del rubro registrado en el encabezado 4, Presupuesto comprometido de inversión según PREDIS, con el encabezado 6, Presupuesto Comprometido Funcionamiento según PREDIS y con el encabezado 8, Presupuesto Comprometido Operación mediante contratos, respectivamente. A la vez, estos valores deben coincidir con los informes de ejecución presupuestal del PREDIS.  "]
[null,null,null,"Si los valores no coinciden debe especificarse al final del formato en qué está representada la diferencia Otros gastos(discriminando los conceptos por Programa y Proyecto de inversión, si es el caso), con sus respectivos valores."]
[null,null,null,"Las bases donde dichos valores no coincidan serán devueltas por la Veeduría Distrital a cada entidad para los respectivos ajustes."]
[null,17,"Giros","Registre el valor total de los giros que se realizaron al contrato,  el formato de celda no permite guiones, comas o texto. Esta columna solo debe contener información numérica."]
[]
[null,"3- PLAZOS"]
[null,18,"Fecha de Suscripción","Relacionar la fecha en que se suscribió el contrato original. La celda solo admite el formato Día/Mes/Año así  17/02/2020."]
[null,null,null,"Para las adiciones a contratos de años anteriores se debe registrar en esta columna la fecha de suscripción de la adición en la vigencia 2020."]
[null,19,"Fecha de inicio","Indicar la fecha de inicio del contrato. Para las adiciones a contratos de años anteriores se debe diligenciar la fecha de inicio de la adición en la vigencia 2020. La celda solo admite el formato Día/Mes/Año así  13/03/2020."]
[null,20,"Fecha de terminación","Indicar la fecha efectiva de terminación del contrato. La celda solo admite el formato Día/Mes/Año así  15/02/2020."]
[null,21,"Plazo en días","Esta columna contiene el plazo inicial del contrato con el número total de días a ejecutar (sólo número de días, no mes, no texto)."]
[null,22,"Número de prórrogas","Registre en esta celda el número de prórrogas que se realizaron al contrato en la vigencia 2020."]
[null,23,"Prórroga en días","En caso de presentarse este evento, indicar en días, el tiempo por el cual se prorrogó el contrato a partir de la fecha inicial de terminación (sólo número de días, no mes, no texto)."]
[]
[null,"4- CESIÓN"]
[null,24,"Número  de Identificación del cesionario\n(NIT con digito de verificación)","Indicar el número de identificación del cesionario persona natural o jurídica con quien se suscribió la cesión, con digito de verificación (DV), el formato de celda no permite guiones o comas, solo números. Si hay más de una cesión adicione una fila y registre número de contrato, año, número proceso contractual SECOP y demás información que corresponda."]
[null,25,"Nombre cesionario","Indicar el nombre del cesionario, persona natural o jurídica."]
[null,26,"Fecha cesión","Relacionar la fecha en que se suscribió la cesión del contrato. La celda solo admite el formato Día/Mes/Año así  17/02/2020."]
[null,27,"Valor cesión","Registre el valor correspondiente a la cesión con cargo a la vigencia 2020, el formato de celda no permite guiones, comas o texto. Esta columna solo debe contener información numérica."]
[]
[null,"5- ESTADO A 31 DE DICIEMBRE DE 2020"]
[null,28,"Estado","Marque con una X en la respectiva columna si el contrato se encuentra Celebrado o por Iniciar, En Ejecución, Terminado o Liquidado."]
[]
[null,"5- PORCENTAJE DE AVANCE Y/O CUMPLIMIENTO"]
[null,29,"% Avance y/o cumplimiento","Indica el porcentaje de avance o de cumplimiento en términos presupuestales, es decir lo efectivamente pagado al contratista. Si no se ha iniciado la ejecución, el % de avance es 0%. La celda se encuentra formulada y protegida. Es la relación entre el valor de los giros y el valor final del contrato. Si el porcentaje de avance no coincide, se debe revisar los valores que se registraron en estas columnas.  Este porcentaje no debe ser superior al 100%"]

{"sheet":"Tipo","index":5,"n_rows":40,"n_cols":4,"rows_kept":40,"cut":false,"hidden":true,"merged":[]}
[null,"Tipo","Modalidad de Selección","afectacion"]
[1,"Obra pública","Concurso de méritos","Funcionamiento"]
[2,"Consultoría","Contratación directa","Inversión"]
[3,"Interventoría","Contratación mínima cuantia","Operación"]
[4,"Contratos de prestación de servicios","Selección abreviada"]
[5,"Contratos de prestación de servicios profesionales y de apoyo a la gestión","Licitación pública"]
[6,"Compraventa de bienes muebles","Régimen privado"]
[7,"Compraventa de bienes inmuebles","Régimen especial"]
[8,"Arrendamiento de bienes muebles"]
[9,"Arrendamiento de bienes inmuebles"]
[10,"Seguros","Selección abreviada"]
[11,"Suministro","Subasta inversa "]
[12,"Empréstitos","Bolsas de productos"]
[13,"Fiducia mercantil o encargo fiduciario","Acuerdo marco de precios "]
[14,"Concesión ","Selección abreviada por menor cuantía "]
[15,"Convenios de cooperacion"]
[16,"Contratos interadministrativos","contratacion directa"]
[17,"Convenios de apoyo y/o convenios de asociación ","Urgencia manifiesta"]
[18,"Asociaciones público privadas","Contratación de empréstitos"]
[19,"Otros","Contratos interadministrativos"]
[20,"Otros gastos","Contratación de bienes y servicios en el sector Defensa y en el Departamento Administrativo de Seguridad, DAS"]
[null,"SECTOR","Contratos para el desarrollo de actividades científicas y tecnológicas"]
[1,"Gestión Pública","Contratos de encargo fiduciario que celebren las entidades territoriales cuando inician el Acuerdo de Reestructuración de Pasivos"]
[{"$f":"+A23+1","v":2},"Gobierno","Cuando no exista pluralidad de oferentes en el mercado"]
[{"$f":"+A24+1","v":3},"Hacienda","Prestación de servicios profesionales y de apoyo a la gestión, o para la ejecución de trabajos artísticos que sólo puedan encomendarse a determinadas personas naturales;"]
[4,"Planeación","El arrendamiento o adquisición de inmuebles"]
[5,"Desarrollo Económico, Industria y Turismo","Contratación de bienes y servicios de la Dirección Nacional de Inteligencia (DNI)"]
[6,"Educación"]
[7,"Salud"]
[8,"Integración Social","Decreto 92 de 2017"]
[9,"Cultura, Recreación y Deporte","No aplica"]
[10,"Ambiente"]
[11,"Movilidad","SECOP I"]
[12,"Hábitat","SECOP II"]
[13,"Mujeres"]
[14,"Seguridad, Convivencia y Justicia","Bogotá Mejor para Todos"]
[15,"Gestión Juridíca","Un Nuevo Contrato Social y Ambiental para la Bogotá del Siglo XXI"]
[16,"descentralizado territorialmente"]
[]
[null,"16 - AL"]

{"sheet":"Eje_Pilar_Prop","index":6,"n_rows":104,"n_cols":5,"rows_kept":104,"cut":false,"hidden":false,"merged":[]}
[]
[null,"PDD","No. Programa","Programa","Pilar /Eje / propósito"]
[null,"Bogotá Mejor para Todos",1,"Prevención y atención de la maternidad y la paternidad tempranas","Pilar 1 Igualdad de Calidad de Vida"]
[null,"Bogotá Mejor para Todos",2,"Desarrollo integral desde la gestación hasta la adolescencia","Pilar 1 Igualdad de Calidad de Vida"]
[null,"Bogotá Mejor para Todos",3,"Igualdad y autonomía para una Bogotá incluyente","Pilar 1 Igualdad de Calidad de Vida"]
[null,"Bogotá Mejor para Todos",4,"Familias protegidas y adaptadas al cambio climático","Pilar 1 Igualdad de Calidad de Vida"]
[null,"Bogotá Mejor para Todos",5,"Desarrollo integral para la felicidad y el ejercicio de la ciudadanía","Pilar 1 Igualdad de Calidad de Vida"]
[null,"Bogotá Mejor para Todos",6,"Calidad educativa para todos","Pilar 1 Igualdad de Calidad de Vida"]
[null,"Bogotá Mejor para Todos",7,"Inclusión educativa para la equidad","Pilar 1 Igualdad de Calidad de Vida"]
[null,"Bogotá Mejor para Todos",8,"Acceso con calidad a la educación superior","Pilar 1 Igualdad de Calidad de Vida"]
[null,"Bogotá Mejor para Todos",9,"Atención integral y eficiente en salud","Pilar 1 Igualdad de Calidad de Vida"]
[null,"Bogotá Mejor para Todos",10,"Modernización de la infraestructura física y tecnológica en salud","Pilar 1 Igualdad de Calidad de Vida"]
[null,"Bogotá Mejor para Todos",11,"Mejores oportunidades para el desarrollo a través de la cultura, la recreación y el deporte","Pilar 1 Igualdad de Calidad de Vida"]
[null,"Bogotá Mejor para Todos",12,"Mujeres protagonistas, activas y empoderadas en el cierre de brechas de género","Pilar 1 Igualdad de Calidad de Vida"]
[null,"Bogotá Mejor para Todos",13,"Infraestructura para el desarrollo del hábitat","Pilar 2 Democracía Urbana"]
[null,"Bogotá Mejor para Todos",14,"Intervenciones integrales del hábitat","Pilar 2 Democracía Urbana"]
[null,"Bogotá Mejor para Todos",15,"Recuperación, incorporación, vida urbana y control de la ilegalidad","Pilar 2 Democracía Urbana"]
[null,"Bogotá Mejor para Todos",16,"Integración social para una ciudad de oportunidades","Pilar 2 Democracía Urbana"]
[null,"Bogotá Mejor para Todos",17,"Espacio público, derecho de todos","Pilar 2 Democracía Urbana"]
[null,"Bogotá Mejor para Todos",18,"Mejor movilidad para todos","Pilar 2 Democracía Urbana"]
[null,"Bogotá Mejor para Todos",19,"Seguridad y convivencia para todos","Pilar 3 Construcción de Comunidad y Cultura Ciudadana"]
[null,"Bogotá Mejor para Todos",20,"Fortalecimiento del Sistema de Protección Integral a Mujeres Víctimas de Violencia - SOFIA","Pilar 3 Construcción de Comunidad y Cultura Ciudadana"]
[null,"Bogotá Mejor para Todos",21,"Justicia para todos: consolidación del Sistema Distrital de Justicia","Pilar 3 Construcción de Comunidad y Cultura Ciudadana"]
[null,"Bogotá Mejor para Todos",22,"Bogotá vive los derechos humanos","Pilar 3 Construcción de Comunidad y Cultura Ciudadana"]
[null,"Bogotá Mejor para Todos",23,"Bogotá mejor para las víctimas, la paz y la reconciliación","Pilar 3 Construcción de Comunidad y Cultura Ciudadana"]
[null,"Bogotá Mejor para Todos",24,"Equipo por la educación para el reencuentro, la reconciliación y la paz","Pilar 3 Construcción de Comunidad y Cultura Ciudadana"]
[null,"Bogotá Mejor para Todos",25,"Cambio cultural y construcción del tejido social para la vida","Pilar 3 Construcción de Comunidad y Cultura Ciudadana"]
[null,"Bogotá Mejor para Todos",26,"Información relevante e integral para la planeación territorial","Eje Transversal 1 Nuevo Ordenamiento Territorial"]
[null,"Bogotá Mejor para Todos",27,"Proyectos urbanos integrales con visión de ciudad","Eje Transversal 1 Nuevo Ordenamiento Territorial"]
[null,"Bogotá Mejor para Todos",28,"Suelo para reducir el déficit habitacional de suelo urbanizable, vivienda y soportes urbanos","Eje Transversal 1 Nuevo Ordenamiento Territorial"]
[null,"Bogotá Mejor para Todos",29,"Articulación regional y planeación integral del transporte","Eje Transversal 1 Nuevo Ordenamiento Territorial"]
[null,"Bogotá Mejor para Todos",30,"Financiación para el Desarrollo Territorial","Eje Transversal 1 Nuevo Ordenamiento Territorial"]
[null,"Bogotá Mejor para Todos",31,"Fundamentar el desarrollo económico en la generación y uso del conocimiento para mejorar la competitividad de la Ciudad Región","Eje Transversal 2 Desarrollo Económico basado en el conocimiento"]
[null,"Bogotá Mejor para Todos",32,"Generar alternativas de ingreso y empleo de mejor calidad","Eje Transversal 2 Desarrollo Económico basado en el conocimiento"]
[null,"Bogotá Mejor para Todos",33,"Elevar la eficiencia de los mercados de la ciudad","Eje Transversal 2 Desarrollo Económico basado en el conocimiento"]
[null,"Bogotá Mejor para Todos",34,"Mejorar y fortalecer el recaudo tributario de la ciudad e impulsar el uso de mecanismos de vinculación de capital privado","Eje Transversal 2 Desarrollo Económico basado en el conocimiento"]
[null,"Bogotá Mejor para Todos",35,"Bogotá, ciudad inteligente","Eje Transversal 2 Desarrollo Económico basado en el conocimiento"]
[null,"Bogotá Mejor para Todos",36,"Bogotá, una ciudad digital","Eje Transversal 2 Desarrollo Económico basado en el conocimiento"]
[null,"Bogotá Mejor para Todos",37,"Consolidar el turismo como factor de desarrollo, confianza y felicidad para Bogotá Región","Eje Transversal 2 Desarrollo Económico basado en el conocimiento"]
[null,"Bogotá Mejor para Todos",38,"Recuperación y manejo de la Estructura Ecológica Principal","Eje Transversal 3 Sostenibilidad Ambiental basada en la eficiencia energética"]
[null,"Bogotá Mejor para Todos",39,"Ambiente sano para la equidad y disfrute del ciudadano","Eje Transversal 3 Sostenibilidad Ambiental basada en la eficiencia energética"]
[null,"Bogotá Mejor para Todos",40,"Gestión de la huella ambiental urbana","Eje Transversal 3 Sostenibilidad Ambiental basada en la eficiencia energética"]
[null,"Bogotá Mejor para Todos",41,"Desarrollo rural sostenible","Eje Transversal 3 Sostenibilidad Ambiental basada en la eficiencia energética"]
[null,"Bogotá Mejor para Todos",42,"Transparencia, gestión pública y servicio a la ciudadanía","Eje Transversal 4 Gobierno Legitimo, Fortalecimiento Local y Eficiencia"]
[null,"Bogotá Mejor para Todos",43,"Modernización institucional","Eje Transversal 4 Gobierno Legitimo, Fortalecimiento Local y Eficiencia"]
[null,"Bogotá Mejor para Todos",44,"Gobierno y ciudadanía digital","Eje Transversal 4 Gobierno Legitimo, Fortalecimiento Local y Eficiencia"]
[null,"Bogotá Mejor para Todos",45,"Gobernanza e influencia local, regional e internacional","Eje Transversal 4 Gobierno Legitimo, Fortalecimiento Local y Eficiencia"]
["Acuerdo 761 2020","Un Nuevo Contrato Social y Ambiental para la Bogotá del Siglo XXI","1.","Subsidios y transferencias para la equidad","Propósito 1: Hacer un nuevo contrato social para incrementar la inclusión social, productiva y política"]
["Pag. 51","Un Nuevo Contrato Social y Ambiental para la Bogotá del Siglo XXI","2.","Igualdad de oportunidades y desarrollo de capacidades para las mujeres","Propósito 1: Hacer un nuevo contrato social para incrementar la inclusión social, productiva y política"]
[null,"Un Nuevo Contrato Social y Ambiental para la Bogotá del Siglo XXI","3.","Movilidad social integral","Propósito 1: Hacer un nuevo contrato social para incrementar la inclusión social, productiva y política"]
[null,"Un Nuevo Contrato Social y Ambiental para la Bogotá del Siglo XXI","4.","Prevención de la exclusión por razones étnicas, religiosas, sociales, políticas y de orientación sexual","Propósito 1: Hacer un nuevo contrato social para incrementar la inclusión social, productiva y política"]
[null,"Un Nuevo Contrato Social y Ambiental para la Bogotá del Siglo XXI","5.","Promoción de la igualdad, el desarrollo de capacidades y el reconocimiento de las mujeres","Propósito 1: Hacer un nuevo contrato social para incrementar la inclusión social, productiva y política"]
[null,"Un Nuevo Contrato Social y Ambiental para la Bogotá del Siglo XXI","6.","Sistema Distrital de Cuidado","Propósito 1: Hacer un nuevo contrato social para incrementar la inclusión social, productiva y política"]
[null,"Un Nuevo Contrato Social y Ambiental para la Bogotá del Siglo XXI","7.","Mejora de la gestión de instituciones de salud","Propósito 1: Hacer un nuevo contrato social para incrementar la inclusión social, productiva y política"]
[null,"Un Nuevo Contrato Social y Ambiental para la Bogotá del Siglo XXI","8.","Prevención y atención de maternidad temprana","Propósito 1: Hacer un nuevo contrato social para incrementar la inclusión social, productiva y política"]
[null,"Un Nuevo Contrato Social y Ambiental para la Bogotá del Siglo XXI","9.","Prevención y cambios para mejorar la salud de la población","Propósito 1: Hacer un nuevo contrato social para incrementar la inclusión social, productiva y política"]
[null,"Un Nuevo Contrato Social y Ambiental para la Bogotá del Siglo XXI","10.","Salud para la vida y el bienestar","Propósito 1: Hacer un nuevo contrato social para incrementar la inclusión social, productiva y política"]
[null,"Un Nuevo Contrato Social y Ambiental para la Bogotá del Siglo XXI","11.","Salud y bienestar para niñas y niños","Propósito 1: Hacer un nuevo contrato social para incrementar la inclusión social, productiva y política"]
[null,"Un Nuevo Contrato Social y Ambiental para la Bogotá del Siglo XXI","12.","Educación inicial: Bases sólidas para la vida.","Propósito 1: Hacer un nuevo contrato social para incrementar la inclusión social, productiva y política"]
[null,"Un Nuevo Contrato Social y Ambiental para la Bogotá del Siglo XXI","13.","Educación para todos y todas: acceso y permanencia con equidad y énfasis en educación rural","Propósito 1: Hacer un nuevo contrato social para incrementar la inclusión social, productiva y política"]
[null,"Un Nuevo Contrato Social y Ambiental para la Bogotá del Siglo XXI","14.","Formación integral: más y mejor tiempo en los colegios","Propósito 1: Hacer un nuevo contrato social para incrementar la inclusión social, productiva y política"]
[null,"Un Nuevo Contrato Social y Ambiental para la Bogotá del Siglo XXI","15.","Plan Distrital de Lectura, Escritura y Oralidad: \"Leer para la vida\"","Propósito 1: Hacer un nuevo contrato social para incrementar la inclusión social, productiva y política"]
[null,"Un Nuevo Contrato Social y Ambiental para la Bogotá del Siglo XXI","16.","Transformación pedagógica y mejoramiento de la gestión educativa. Es con los maestros y maestras.","Propósito 1: Hacer un nuevo contrato social para incrementar la inclusión social, productiva y política"]
[null,"Un Nuevo Contrato Social y Ambiental para la Bogotá del Siglo XXI","17.","Jóvenes con capacidades: Proyecto de vida para la ciudadanía, la innovación y el trabajo del siglo XXI","Propósito 1: Hacer un nuevo contrato social para incrementar la inclusión social, productiva y política"]
[null,"Un Nuevo Contrato Social y Ambiental para la Bogotá del Siglo XXI","18.","Cierre de brechas para la inclusión productiva urbano rural","Propósito 1: Hacer un nuevo contrato social para incrementar la inclusión social, productiva y política"]
[null,"Un Nuevo Contrato Social y Ambiental para la Bogotá del Siglo XXI","19.","Vivienda y entornos dignos en el territorio urbano y rural","Propósito 1: Hacer un nuevo contrato social para incrementar la inclusión social, productiva y política"]
[null,"Un Nuevo Contrato Social y Ambiental para la Bogotá del Siglo XXI","20.","Bogotá, referente en cultura, deporte, recreación y actividad física, con parques para el desarrollo y la salud","Propósito 1: Hacer un nuevo contrato social para incrementar la inclusión social, productiva y política"]
[null,"Un Nuevo Contrato Social y Ambiental para la Bogotá del Siglo XXI","21.","Creación y vida cotidiana: Apropiación ciudadana del arte, la cultura y el patrimonio, para la democracia cultural","Propósito 1: Hacer un nuevo contrato social para incrementar la inclusión social, productiva y política"]
[null,"Un Nuevo Contrato Social y Ambiental para la Bogotá del Siglo XXI","22.","Transformación cultural para la conciencia ambiental y el cuidado de la fauna doméstica","Propósito 1: Hacer un nuevo contrato social para incrementar la inclusión social, productiva y política"]
[null,"Un Nuevo Contrato Social y Ambiental para la Bogotá del Siglo XXI","23.","Bogotá rural","Propósito 1: Hacer un nuevo contrato social para incrementar la inclusión social, productiva y política"]
[null,"Un Nuevo Contrato Social y Ambiental para la Bogotá del Siglo XXI","24.","Bogotá región emprendedora e innovadora","Propósito 1: Hacer un nuevo contrato social para incrementar la inclusión social, productiva y política"]
[null,"Un Nuevo Contrato Social y Ambiental para la Bogotá del Siglo XXI","25.","Bogotá región productiva y competitiva","Propósito 1: Hacer un nuevo contrato social para incrementar la inclusión social, productiva y política"]
[null,"Un Nuevo Contrato Social y Ambiental para la Bogotá del Siglo XXI","26.","Bogotá - región, el mejor destino para visitar","Propósito 1: Hacer un nuevo contrato social para incrementar la inclusión social, productiva y política"]
[null,"Un Nuevo Contrato Social y Ambiental para la Bogotá del Siglo XXI","27.","Cambio cultural para la gestión de la crisis climática","Propósito 2 : Cambiar Nuestros Hábitos de Vida para Reverdecer a Bogotá y Adaptarnos y Mitigar la Crisis Climática"]
[null,"Un Nuevo Contrato Social y Ambiental para la Bogotá del Siglo XXI","28.","Bogotá protectora de sus recursos naturales","Propósito 2 : Cambiar Nuestros Hábitos de Vida para Reverdecer a Bogotá y Adaptarnos y Mitigar la Crisis Climática"]
[null,"Un Nuevo Contrato Social y Ambiental para la Bogotá del Siglo XXI","29.","Asentamientos y entornos protectores","Propósito 2 : Cambiar Nuestros Hábitos de Vida para Reverdecer a Bogotá y Adaptarnos y Mitigar la Crisis Climática"]
[null,"Un Nuevo Contrato Social y Ambiental para la Bogotá del Siglo XXI","30.","Eficiencia en la atención de emergencias","Propósito 2 : Cambiar Nuestros Hábitos de Vida para Reverdecer a Bogotá y Adaptarnos y Mitigar la Crisis Climática"]
[null,"Un Nuevo Contrato Social y Ambiental para la Bogotá del Siglo XXI","31."," Protección y valoración del patrimonio tangible e intangible en Bogotá y la región","Propósito 2 : Cambiar Nuestros Hábitos de Vida para Reverdecer a Bogotá y Adaptarnos y Mitigar la Crisis Climática"]
[null,"Un Nuevo Contrato Social y Ambiental para la Bogotá del Siglo XXI","32.","Revitalización urbana para la competitividad","Propósito 2 : Cambiar Nuestros Hábitos de Vida para Reverdecer a Bogotá y Adaptarnos y Mitigar la Crisis Climática"]
[null,"Un Nuevo Contrato Social y Ambiental para la Bogotá del Siglo XXI","33.","Más árboles y más y mejor espacio público","Propósito 2 : Cambiar Nuestros Hábitos de Vida para Reverdecer a Bogotá y Adaptarnos y Mitigar la Crisis Climática"]
[null,"Un Nuevo Contrato Social y Ambiental para la Bogotá del Siglo XXI","34.","Bogotá protectora de los animales","Propósito 2 : Cambiar Nuestros Hábitos de Vida para Reverdecer a Bogotá y Adaptarnos y Mitigar la Crisis Climática"]
[null,"Un Nuevo Contrato Social y Ambiental para la Bogotá del Siglo XXI","35.","Manejo y prevención de contaminación","Propósito 2 : Cambiar Nuestros Hábitos de Vida para Reverdecer a Bogotá y Adaptarnos y Mitigar la Crisis Climática"]
[null,"Un Nuevo Contrato Social y Ambiental para la Bogotá del Siglo XXI","36.","Manejo y saneamiento de los cuerpos de agua","Propósito 2 : Cambiar Nuestros Hábitos de Vida para Reverdecer a Bogotá y Adaptarnos y Mitigar la Crisis Climática"]
[null,"Un Nuevo Contrato Social y Ambiental para la Bogotá del Siglo XXI","37.","Provisión y mejoramiento de servicios públicos","Propósito 2 : Cambiar Nuestros Hábitos de Vida para Reverdecer a Bogotá y Adaptarnos y Mitigar la Crisis Climática"]
[null,"Un Nuevo Contrato Social y Ambiental para la Bogotá del Siglo XXI","38.","Ecoeficiencia, reciclaje, manejo de residuos e inclusión de la población recicladora","Propósito 2 : Cambiar Nuestros Hábitos de Vida para Reverdecer a Bogotá y Adaptarnos y Mitigar la Crisis Climática"]
[null,"Un Nuevo Contrato Social y Ambiental para la Bogotá del Siglo XXI","39.","Bogotá territorio de paz y atención integral a las víctimas del conflicto armado","Propósito 3: Inspirar confianza y legitimidad para vivir sin miedo y ser epicentro de cultura ciudadana, paz y reconciliación"]
[null,"Un Nuevo Contrato Social y Ambiental para la Bogotá del Siglo XXI","40.","Más mujeres viven una vida libre de violencias, se sienten seguras y acceden con confianza al sistema de justicia","Propósito 3: Inspirar confianza y legitimidad para vivir sin miedo y ser epicentro de cultura ciudadana, paz y reconciliación"]
[null,"Un Nuevo Contrato Social y Ambiental para la Bogotá del Siglo XXI","41.","Sin machismo ni violencias contra las mujeres, las niñas y los niños","Propósito 3: Inspirar confianza y legitimidad para vivir sin miedo y ser epicentro de cultura ciudadana, paz y reconciliación"]
[null,"Un Nuevo Contrato Social y Ambiental para la Bogotá del Siglo XXI","42.","Conciencia y cultura ciudadana para la seguridad, la convivencia y la construcción de confianza","Propósito 3: Inspirar confianza y legitimidad para vivir sin miedo y ser epicentro de cultura ciudadana, paz y reconciliación"]
[null,"Un Nuevo Contrato Social y Ambiental para la Bogotá del Siglo XXI","43.","Cultura ciudadana para la confianza, la convivencia y la participación desde la vida cotidiana","Propósito 3: Inspirar confianza y legitimidad para vivir sin miedo y ser epicentro de cultura ciudadana, paz y reconciliación"]
[null,"Un Nuevo Contrato Social y Ambiental para la Bogotá del Siglo XXI","44.","Autoconciencia, respeto y cuidado en el espacio público","Propósito 3: Inspirar confianza y legitimidad para vivir sin miedo y ser epicentro de cultura ciudadana, paz y reconciliación"]
[null,"Un Nuevo Contrato Social y Ambiental para la Bogotá del Siglo XXI","45.","Espacio público más seguro y construido colectivamente","Propósito 3: Inspirar confianza y legitimidad para vivir sin miedo y ser epicentro de cultura ciudadana, paz y reconciliación"]
[null,"Un Nuevo Contrato Social y Ambiental para la Bogotá del Siglo XXI","46.","Atención a jóvenes y adultos infractores con impacto en su proyecto de vida","Propósito 3: Inspirar confianza y legitimidad para vivir sin miedo y ser epicentro de cultura ciudadana, paz y reconciliación"]
[null,"Un Nuevo Contrato Social y Ambiental para la Bogotá del Siglo XXI","47.","Calidad de Vida y Derechos de la Población privada de la libertad","Propósito 3: Inspirar confianza y legitimidad para vivir sin miedo y ser epicentro de cultura ciudadana, paz y reconciliación"]
[null,"Un Nuevo Contrato Social y Ambiental para la Bogotá del Siglo XXI","48.","Plataforma institucional para la seguridad y justicia","Propósito 3: Inspirar confianza y legitimidad para vivir sin miedo y ser epicentro de cultura ciudadana, paz y reconciliación"]
[null,"Un Nuevo Contrato Social y Ambiental para la Bogotá del Siglo XXI","49.","Movilidad segura, sostenible y accesible","Propósito 4: Hacer de Bogotá Región un modelo de movilidad multimodal, incluyente y sostenible"]
[null,"Un Nuevo Contrato Social y Ambiental para la Bogotá del Siglo XXI","50.","Red de metros","Propósito 4: Hacer de Bogotá Región un modelo de movilidad multimodal, incluyente y sostenible"]
[null,"Un Nuevo Contrato Social y Ambiental para la Bogotá del Siglo XXI","51.","Gobierno Abierto","Propósito 5: Construir Bogotá - Región con gobierno abierto, transparente y ciudadanía consciente"]
[null,"Un Nuevo Contrato Social y Ambiental para la Bogotá del Siglo XXI","52.","Integración regional, distrital y local","Propósito 5: Construir Bogotá - Región con gobierno abierto, transparente y ciudadanía consciente"]
[null,"Un Nuevo Contrato Social y Ambiental para la Bogotá del Siglo XXI","53.","Información para la toma de decisiones","Propósito 5: Construir Bogotá - Región con gobierno abierto, transparente y ciudadanía consciente"]
[null,"Un Nuevo Contrato Social y Ambiental para la Bogotá del Siglo XXI","54.","Transformación digital y gestión de TIC para un territorio inteligente","Propósito 5: Construir Bogotá - Región con gobierno abierto, transparente y ciudadanía consciente"]
[null,"Un Nuevo Contrato Social y Ambiental para la Bogotá del Siglo XXI","55.","Fortalecimiento de cultura ciudadana y su institucionalidad","Propósito 5: Construir Bogotá - Región con gobierno abierto, transparente y ciudadanía consciente"]
[null,"Un Nuevo Contrato Social y Ambiental para la Bogotá del Siglo XXI","56.","Gestión pública efectiva","Propósito 5: Construir Bogotá - Región con gobierno abierto, transparente y ciudadanía consciente"]
[null,"Un Nuevo Contrato Social y Ambiental para la Bogotá del Siglo XXI","57.","Gestión pública local","Propósito 5: Construir Bogotá - Región con gobierno abierto, transparente y ciudadanía consciente"]