{"text_format":"1","workbook":"xlsx","n_sheets":7,"sheets":["Formato2020 ","INVERSION","FUNCIONAMIENTO","Ctos suscrito x Trimestre","Instructivo","Tipo","Eje_Pilar_Prop"],"not_rendered":{"charts":0,"images":1,"macros":1,"external_links":6,"defined_names":65,"comments":1,"pivot_tables":9},"unopened":[],"bounds":{"document_bytes":16777216,"sheet_cells":100000,"rows_first":2000,"rows_last":500,"rows_between":2000,"halvings":0,"cell_chars":16384,"cell_head_chars":4096},"cells_cut":0,"cells_raw":0,"read":"whole","date_system":"1900"}

{"sheet":"Formato2020 ","index":0,"n_rows":501,"n_cols":47,"rows_kept":501,"cut":false,"hidden":false,"merged":[[5,0,5,3],[5,8,5,10],[5,29,5,30],[6,0,6,3],[6,8,6,10],[6,29,6,30],[1,0,1,37],[2,0,2,37],[4,0,4,3],[4,8,4,10],[4,14,4,15],[4,22,4,37],[8,10,9,15],[8,29,8,30],[9,0,9,3],[9,5,9,7],[11,14,11,15],[10,0,10,15],[10,16,10,22],[10,23,10,28],[11,2,11,3],[11,8,11,12],[8,0,8,3],[8,5,8,7],[7,29,7,30],[11,33,11,36],[10,29,10,32],[5,31,5,37],[6,31,6,37],[7,31,7,37],[8,31,8,37],[9,31,9,37],[9,29,9,30],[10,33,10,36]]}
[]
["VEEDURIA DISTRITAL - RENDICION DE CUENTAS DE LA GESTION CONTRACTUAL EN EL DISTRITO CAPITAL (Acuerdo 380 de 2009)"]
["INFORMACION GENERAL DE CONTRATACION ENTIDADES DISTRITALES  -  ENERO 1 A 31 DICIEMBRE DE 2020"]
[]
["1. Entidad",null,null,null,"FONDO DE DESARROLLO LOCAL LA CANDELARIA",null,null,"2. Sector","Gobierno"]
["3. Presupuesto Disponible Inversión Directa PREDIS",null,null,null,{"$f":"11749185174-E7","v":1572098883},null,null,"5. Presupuesto Disponible Funcionamiento PREDIS",{"$f":"2525795523-I7","v":180815230},null,null,null,null,null,null,null,null,null,null,null,null,null,null,null,null,null,null,null,null,"9. Nombre de quien diligencia el formato",null,"Paula Villota"]
["4. Presupuesto Comprometido de Inversión Directa según PREDIS ",null,null,null,10177086291,null,null,"6. Presupuesto Comprometido Funcionamiento según PREDIS",2344980293,null,null,null,null,null,null,null,null,null,null,null,null,null,null,null,null,null,null,null,null,"Cargo"]
[null,null,null,null,null,null,null,null,null,null,null,null,null,null,null,null,null,null,null,null,null,null,null,null,null,null,null,null,null,"Dependencia",null,"Contratación"]
["7. Presupuesto Disponible Operación (Régimen Privado)",null,null,null,null,null,null,null,null,null,null,null,null,null,null,null,null,null,null,null,null,{"$f":"+SUBTOTAL(9,V14:V501)","v":12522066584},{"$f":"+SUBTOTAL(9,W14:W501)","v":7229871864},null,null,null,null,null,null,"Teléfono"]
["8. Presupuesto Comprometido Operación mediante contratos",null,null,null,null,null,null,null,null,null,null,null,null,null,null,null,null,null,null,null,null,null,null,null,null,null,null,null,null,"Correo Electrónico"]
["1- INFORMACION GENERAL",null,null,null,null,null,null,null,null,null,null,null,null,null,null,null,"2- INFORMACION FINANCIERA",null,null,null,null,null,null,"3 - PLAZOS ",null,null,null,null,null,"4. CESION",null,null,null,null,null,null,null,"5. %  Avance y/o cumplimiento"]
[1,2,3,null,4,5,6,7,8,null,null,null,null,9,10,null,11,12,13,14,15,16,17,18,19,20,21,22,23,24,25,26,27,null,null,null,null,29]
["Número Contrato","Año","Proceso Publicado en","Número de proceso contractual \nSECOP","Tipo de contrato ","Modalidad de Selección","Procedimiento o causal","Objeto","Afectación","Plan de Desarrollo Distrital","Número Programa","Equivalencia número de programa","Eje / Pilar / Propósito","Número Proyecto","Número  de Identificación del contratista\n(NIT con digito de verificación)","Nombre del contratista","Valor Inicial del contrato","Número de reducciones","Valor total reducciones \n(En valor negativo)","Número de adiciones","Valor total de adiciones ","Valor Final ","Giros (valor en pesos)","Fecha de suscripción (DD/MM/AAAA)","Fecha de inicio (DD/MM/AAAA)","Fecha de terminación (DD/MM/AAAA)","Plazo en días","Número de prórrogas","Prorroga en días","Número  de Identificación del cesionario\n(NIT con digito de verificación)","Nombre cesionario","Fecha cesión\n(DD/MM/AAAA)","Valor cesión","Celebrado o por iniciar","En Ejecución","Terminado","Liquidado","% Avance y/o Cumplimiento","Total Contratos","Validación Tipo","Validación Modalidad","Validación procedimiento","Validación afectación","Validación programa","secop","Fecha suscripción","PDD"]
[1,2020,"SECOP I","ORDEN DE COMPRA 44279","Suministro","Selección abreviada","Acuerdo marco de precios ","CONTRATAR A MONTO AGOTABLE EL SUMINISTRO DE SERVICIO DE COMBUSTIBLE GASOLINA Y DIÉSEL PARA LOS VEHÍCULOS DE PROPIEDAD DEL FONDO DE DESARROLLO LOCAL DE LA CANDELARIA","Funcionamiento","Bogotá Mejor para Todos","No aplica","No Aplica","No Aplica","No Aplica","900459737-5","GRUPO EDS AUTOGAS S.A.S",20000000,null,null,1,3000000,{"$f":"+Q14+S14+U14","v":23000000},18967996,"2020-01-10","2020-01-13","2021-01-12",360,null,null,null,null,null,null,null,null,"X",null,{"$f":"IF(ISERROR(W14/V14),\"-\",(W14/V14))","v":0.82469547826086953},{"$f":"IF(SUMPRODUCT((A$14:A14=A14)*(B$14:B14=B14)*(D$14:D14=D14))>1,0,1)","v":1},{"$f":"IF(ISBLANK(E14),1,IFERROR(VLOOKUP(E14,tipo,1,FALSE),\"NO\"))","v":"Suministro"},{"$f":"IF(ISBLANK(F14),1,IFERROR(VLOOKUP(F14,modal,1,FALSE),\"NO\"))","v":"Selección abreviada"},{"$f":"IF(ISBLANK(G14),1,IFERROR(VLOOKUP(G14,Tipo!$C$12:$C$27,1,FALSE),\"NO\"))","v":"Acuerdo marco de precios "},{"$f":"IF(ISBLANK(I14),1,IFERROR(VLOOKUP(I14,afectacion,1,FALSE),\"NO\"))","v":"Funcionamiento"},{"$f":"IF(ISBLANK(K14),1,IFERROR(VLOOKUP(K14,Eje_Pilar_Prop!C3:C104,1,FALSE),\"NO\"))","v":"NO"},{"$f":"IF(ISBLANK(C14),1,IFERROR(VLOOKUP(C14,SECOP,1,FALSE),\"NO\"))","v":"SECOP I"},{"$f":"IF(OR(YEAR(X14)=2020,ISBLANK(X14)),1,\"NO\")","v":1},{"$f":"IF(ISBLANK(J14),1,IFERROR(VLOOKUP(J14,pdd,1,FALSE),\"NO\"))","v":"Bogotá Mejor para Todos"}]
[2,2020,"SECOP II","FDLC-IMC-001-2020","Interventoría","Contratación mínima cuantia","No aplica","INTERVENTORÍA TÉCNICA, ADMINISTRATIVA Y FINANCIERA DE LA CONTINUACIÓN DEL CONTRATO DE OBRA 101 DE 2018, QUE TIENE POR OBJETO: “REALIZAR A PRECIO GLOBAL FIJO LA ACTUALIZACIÓN, AJUSTES Y/O COMPLEMENTACIÓN DE LOS ESTUDIOS Y DISEÑOS Y A MONTO AGOTABLE LA CONSTRUCCIÓN DEL TRAMO FALTANTE DEL PROYECTO RAPS NIEVES UBICADO EN LA CARRERA 4 ENTRE CALLES 13 Y 10 EN LA LOCALIDAD DE LA CANDELARIA, EN BOGOTÁ D.C.","Inversión","Bogotá Mejor para Todos",18,{"$f":"IF(ISERROR(VLOOKUP(K15,Eje_Pilar_Prop!$C$2:$E$104,2,FALSE)),\" \",VLOOKUP(K15,Eje_Pilar_Prop!$C$2:$E$104,2,FALSE))","v":"Mejor movilidad para todos"},{"$f":"IF(ISERROR(VLOOKUP(K15,Eje_Pilar_Prop!$C$2:$E$104,3,FALSE)),\" \",VLOOKUP(K15,Eje_Pilar_Prop!$C$2:$E$104,3,FALSE))","v":"Pilar 2 Democracía Urbana"},1391,900866325,"JMELO INGENIERIA DE PROYECTOS S.A.S",24184587,null,null,0,null,{"$f":"+Q15+S15+U15","v":24184587},12092293,"2020-01-30","2020-02-05","2020-07-21",60,null,null,null,null,null,null,null,null,"X",null,{"$f":"IF(ISERROR(W15/V15),\"-\",(W15/V15))","v":0.49999997932567547},{"$f":"IF(SUMPRODUCT((A$14:A15=A15)*(B$14:B15=B15)*(D$14:D15=D15))>1,0,1)","v":1},"Interventoría","Contratación mínima cuantia",{"$f":"IF(ISBLANK(G15),1,IFERROR(VLOOKUP(G15,Tipo!$C$12:$C$27,1,FALSE),\"NO\"))","v":"NO"},"Inversión",{"$f":"IF(ISBLANK(K15),1,IFERROR(VLOOKUP(K15,Eje_Pilar_Prop!C4:C105,1,FALSE),\"NO\"))","v":18},"SECOP II",1,"Bogotá Mejor para Todos"]
{"$rows_left_out":487}
{"sheet":"INVERSION","index":1,"n_rows":66,"n_cols":14,"rows_kept":66,"cut":false,"hidden":false,"merged":[]}
["INVERSION"]
[]
["MODALIDAD VIGENCIA 2020",null,"SUMA TOTAL CONTRATOS VIGENCIA ",null,null,null,null,null,"TIPO  VIGENCIA 2020",null,"SUMA TOTAL CONTRATOS VIGENCIA Y SUMA ADICIONES A CONTRATOS AÑOS ANTERIORES"]
[]
["Año",2020,"Seleccionar Año 2020"]
["Afectación","Inversión",null,null,null,null,null,null,"Año",2020,"Seleccionar año 2020"]
["Tipo de contrato ","(Varios elementos)",null,null,null,null,null,null,"Afectación","Inversión"]
[]
[null,null,null,"Valores",null,null,null,null,null,null,null,"Valores"]
["Modalidad de Selección","Equivalencia número de programa","Eje / Pilar / Propósito","Suma de Total Contratos","Suma de Valor Final ","Suma de Giros (Valor en pesos)",null,null,"Tipo de contrato ","Equivalencia número de programa","Eje / Pilar / Propósito","Suma de Total Contratos","Suma de Valor Final ","Suma de Giros (Valor en pesos)"]
["Concurso de méritos","Mejor movilidad para todos","Pilar 2 Democracía Urbana",1,504558537,138468821,null,null,"Contratos de prestación de servicios","Gobernanza e influencia local, regional e internacional","Eje Transversal 4 Gobierno Legitimo, Fortalecimiento Local y Eficiencia",2,1023285664,345688163]
["Contratación directa","Gobernanza e influencia local, regional e internacional","Eje Transversal 4 Gobierno Legitimo, Fortalecimiento Local y Eficiencia",245,4107138445,2897337330,null,null,null,"Igualdad y autonomía para una Bogotá incluyente","Pilar 1 Igualdad de Calidad de Vida",2,248240000,171216000]
[null,"Igualdad y autonomía para una Bogotá incluyente","Pilar 1 Igualdad de Calidad de Vida",6,311675011,219809702,null,null,"Contratos de prestación de servicios profesionales y de apoyo a la gestión","Gobernanza e influencia local, regional e internacional","Eje Transversal 4 Gobierno Legitimo, Fortalecimiento Local y Eficiencia",240,2469971388,2008170906]
[null,"Seguridad y convivencia para todos","Pilar 3 Construcción de Comunidad y Cultura Ciudadana",20,263299633,156458150,null,null,null,"Igualdad y autonomía para una Bogotá incluyente","Pilar 1 Igualdad de Calidad de Vida",4,63435011,48593702]
[null,"Mejor movilidad para todos","Pilar 2 Democracía Urbana",6,77915160,67185811,null,null,null,"Seguridad y convivencia para todos","Pilar 3 Construcción de Comunidad y Cultura Ciudadana",19,101683334,75650000]
{"$rows_left_out":52}
{"sheet":"FUNCIONAMIENTO","index":2,"n_rows":40,"n_cols":10,"rows_kept":40,"cut":false,"hidden":false,"merged":[]}
["FUNCIONAMIENTO"]
[]
["MODALIDAD VIGENCIA 2020",null,"SUMA TOTAL CONTRATOS VIGENCIA ",null,null,null,"TIPO VIGENCIA 2020","SUMA TOTAL CONTRATOS VIGENCIA"]
[]
["Año",2020,"Seleccionar año 2020"]
["Afectación","Funcionamiento",null,null,null,null,"Año",2020,"Seleccionar año 2020"]
["Tipo de contrato ","(Varios elementos)",null,null,null,null,"Afectación","Funcionamiento"]
[]
[null,"Valores",null,null,null,null,null,"Valores"]
["Modalidad de Selección","Suma de Total Contratos","Suma de Valor Final ","Suma de Giros (Valor en pesos)",null,null,"Tipo de contrato ","Suma de Total Contratos","Suma de Valor Final ","Suma de Giros (Valor en pesos)"]
["Concurso de méritos",1,0,0,null,null,"Compraventa de bienes muebles",2,27735588,6936748]
["Contratación directa",1,8000000,null,null,null,"Contratos de prestación de servicios",5,637071709,420384599]
["Contratación mínima cuantia",14,210614693,148845706,null,null,"Contratos interadministrativos",1,8000000]
["Licitación pública",2,566748600,350061490,null,null,"Seguros",5,72642246,71585849]
["Selección abreviada",2,217908451,146045880,null,null,"Suministro",6,257822201,146045880]
{"$rows_left_out":26}
{"sheet":"Ctos suscrito x Trimestre","index":3,"n_rows":13,"n_cols":5,"rows_kept":13,"cut":false,"hidden":false,"merged":[[1,4,3,11],[4,4,4,6]]}
[]
[null,"Contratos Suscritos en la vigencia 2020  (Inversion)",null,null,"Se toman solo los contratos de la vigencia por cuanto en las adiciones años anteriores algunas Entidades registraron la fecha en que se suscribio el contrato y no la adición."]
[null,"Afectación","Inversión"]
[null,"Tipo de contrato ","(Varios elementos)","No incluir \"otros gastos\""]
[null,"Año",2020]
[]
[]
[null,"Fecha de suscripción (DD/MM/AAAA)"]
[null,"Trim.1"]
[null,"Trim.2"]
[null,"Trim.3"]
[null,"Trim.4"]
[null,"Total general"]

{"sheet":"Instructivo","index":4,"n_rows":103,"n_cols":4,"rows_kept":103,"cut":false,"hidden":false,"merged":[[25,1,25,3],[1,1,1,3],[2,1,2,3],[3,1,3,3],[4,1,4,3],[5,1,5,3],[6,1,6,3],[7,1,7,3],[10,1,10,3],[11,1,11,3],[12,1,12,3],[14,1,14,3],[8,1,8,3],[9,1,9,3],[67,1,67,3],[26,1,27,1],[26,2,27,2],[31,1,32,1],[31,2,32,2],[33,1,53,1],[35,2,36,2],[54,1,56,1],[54,2,56,2],[59,1,62,1],[61,2,62,2],[64,1,65,1],[29,1,30,1],[68,1,70,1],[68,2,70,2],[71,1,72,1],[71,2,72,2],[74,1,75,1],[74,2,75,2],[101,1,101,3],[77,1,80,1],[77,2,80,2],[83,1,83,3],[84,1,85,1],[84,2,85,2],[98,1,98,3],[92,1,92,3]]}
[]
[null,"INSTRUCTIVO"]
[null,"Recomendamos leer cuidadosamente y poner en práctica las instrucciones que se explican en este instructivo. De la calidad de la información que se registre, depende en gran medida la calidad del informe de rendición de cuentas de la Gestión Contractual que presenta el Alcalde Mayor, consolidado por la Veeduría Distrital."]
[null,"La base en Excel a diligenciar es inmodificable, debe utilizar versión Excel 2010 o posteriores, la versión 2007 no habilita los macros.  La base no permite que se incluyan columnas con otro tipo de información que la Veeduría Distrital no está solicitando o que se cambie el formato de celda establecido. Tenga en cuenta que algunas celdas están bloqueadas y/o solo permiten el registro de una información determinada."]
[null,"La información que se registre en la base, debe coincidir con los reportes realizados en PREDIS y en el SECOP"]
[null,"Diligencie la totalidad de celdas."]
[null,"Para insertar una o varias filas, haga click  en el opción Insertar Filas y digite el número de filas a insertar. Si usted no sigue este procedimiento las filas que inserte no tomaran el formato de las filas anteriores. Se recomienda que antes de iniciar el registro de información inserte las filas que requiere, sin embargo en cualquier momento que necesite puede hacer este paso."]
[null,"Si requiere inserte una o varias filas realícelo después de la fila A14 y antes de la fila de Totales para que tomen el formato de las filas anteriores."]
[null,"Si necesita pegar información debe hacerlo por secciones debido a que hay columnas formuladas que están protegidas (como la columna J, K, T y AK) que no permiten realizar esta opción. Utilice la opción de pegado especial valores para no borrar las listas desplegables ni los formatos de las columnas."]
[null,"Si al pegar quedan textos en rojo,  verifique y ajuste la información, el dato que adiciono no se encuentra en la lista desplegable o no corresponde con el criterio definido en el columna."]
[null,"En primer lugar diligencie toda la información correspondiente a los contratos suscritos con cargo a la vigencia 2020."]
[null,"Una vez incluidos todos los contratos de la vigencia 2020, a continuación diligencie el formato completo con la información correspondiente a las adiciones efectuadas con cargo a la vigencia 2020 de contratos suscritos en vigencias anteriores. La información general del contrato como: modalidad de selección, tipología contractual, objeto, entre otros, debe corresponder a la información del contrato adicionado o modificado. Respecto al valor solo se diligencia el valor en la columna adición, es decir la columna de valor inicial debe quedar en blanco. No olvide registrar el número de adiciones realizadas, en la columna correspondiente."]
[null,"En caso de haber realizado apropiaciones presupuestales en la vigencia a través de resoluciones, caja menor, honorarios ediles, servicios públicos, debe relacionar dicha información en una sola fila al final de la base, indicando de que se trata la apropiación y número de proyecto si hay lugar a ello. En el tipo de contrato se registra Otros gastos."]
[]
[null,"ENCABEZADO DEL FORMATO"]
{"$rows_left_out":89}
{"sheet":"Tipo","index":5,"n_rows":40,"n_cols":4,"rows_kept":40,"cut":false,"hidden":true,"merged":[]}
[null,"Tipo","Modalidad de Selección","afectacion"]
[1,"Obra pública","Concurso de méritos","Funcionamiento"]
[2,"Consultoría","Contratación directa","Inversión"]
[3,"Interventoría","Contratación mínima cuantia","Operación"]
[4,"Contratos de prestación de servicios","Selección abreviada"]
[5,"Contratos de prestación de servicios profesionales y de apoyo a la gestión","Licitación pública"]
[6,"Compraventa de bienes muebles","Régimen privado"]
[7,"Compraventa de bienes inmuebles","Régimen especial"]
[8,"Arrendamiento de bienes muebles"]
[9,"Arrendamiento de bienes inmuebles"]
[10,"Seguros","Selección abreviada"]
[11,"Suministro","Subasta inversa "]
[12,"Empréstitos","Bolsas de productos"]
[13,"Fiducia mercantil o encargo fiduciario","Acuerdo marco de precios "]
[14,"Concesión ","Selección abreviada por menor cuantía "]
{"$rows_left_out":26}
{"sheet":"Eje_Pilar_Prop","index":6,"n_rows":104,"n_cols":5,"rows_kept":104,"cut":false,"hidden":false,"merged":[]}
[]
[null,"PDD","No. Programa","Programa","Pilar /Eje / propósito"]
[null,"Bogotá Mejor para Todos",1,"Prevención y atención de la maternidad y la paternidad tempranas","Pilar 1 Igualdad de Calidad de Vida"]
[null,"Bogotá Mejor para Todos",2,"Desarrollo integral desde la gestación hasta la adolescencia","Pilar 1 Igualdad de Calidad de Vida"]
[null,"Bogotá Mejor para Todos",3,"Igualdad y autonomía para una Bogotá incluyente","Pilar 1 Igualdad de Calidad de Vida"]
[null,"Bogotá Mejor para Todos",4,"Familias protegidas y adaptadas al cambio climático","Pilar 1 Igualdad de Calidad de Vida"]
[null,"Bogotá Mejor para Todos",5,"Desarrollo integral para la felicidad y el ejercicio de la ciudadanía","Pilar 1 Igualdad de Calidad de Vida"]
[null,"Bogotá Mejor para Todos",6,"Calidad educativa para todos","Pilar 1 Igualdad de Calidad de Vida"]
[null,"Bogotá Mejor para Todos",7,"Inclusión educativa para la equidad","Pilar 1 Igualdad de Calidad de Vida"]
[null,"Bogotá Mejor para Todos",8,"Acceso con calidad a la educación superior","Pilar 1 Igualdad de Calidad de Vida"]
[null,"Bogotá Mejor para Todos",9,"Atención integral y eficiente en salud","Pilar 1 Igualdad de Calidad de Vida"]
[null,"Bogotá Mejor para Todos",10,"Modernización de la infraestructura física y tecnológica en salud","Pilar 1 Igualdad de Calidad de Vida"]
[null,"Bogotá Mejor para Todos",11,"Mejores oportunidades para el desarrollo a través de la cultura, la recreación y el deporte","Pilar 1 Igualdad de Calidad de Vida"]
[null,"Bogotá Mejor para Todos",12,"Mujeres protagonistas, activas y empoderadas en el cierre de brechas de género","Pilar 1 Igualdad de Calidad de Vida"]
[null,"Bogotá Mejor para Todos",13,"Infraestructura para el desarrollo del hábitat","Pilar 2 Democracía Urbana"]
{"$rows_left_out":89}